{"text_format":"1","workbook":"xlsx","n_sheets":7,"sheets":["MENU","TABLAS","INFORME","INF BACTERIO","Datos","PROV_DIST","TBC_NEW"],"not_rendered":{"charts":0,"images":30,"macros":1,"external_links":0,"defined_names":7,"comments":0,"pivot_tables":9},"unopened":[],"bounds":{"document_bytes":16777216,"sheet_cells":100000,"rows_first":2000,"rows_last":500,"rows_between":2000,"halvings":0,"cell_chars":16384,"cell_head_chars":4096},"cells_cut":0,"cells_raw":0,"read":"whole","date_system":"1900"}

{"sheet":"MENU","index":0,"n_rows":29,"n_cols":12,"rows_kept":29,"cut":false,"hidden":false,"merged":[[28,7,29,10],[26,7,27,10]]}
[]
[]
[]
[null,null,null,null,null,null,null,null,null,null,null,{"$f":"+TABLAS!A77","v":"3-1-2-5-4-10-11-9-8-7-6-T"}]
[null,null,null,null,null,null,null,null,null,null,null,{"$f":"+TABLAS!A109","v":"3-1-2-4-5-9-10-7-8-11-6-T"}]
[null,null,null,null,null,null,null,null,null,null,null,{"$f":"+TABLAS!A146","v":"1-11-5-2-6-7-8-9-10-4-3-T"}]
[null,null,null,null,null,null,null,null,null,null,null,{"$f":"+TABLAS!A182","v":"1-11-5-2-6-7-8-9-10-4-3-T"}]
[null,null,null,null,null,null,null,null,null,null,null,{"$f":"+TABLAS!A217","v":"1-11-5-2-6-7-8-9-10-4-3-T"}]
[null,null,null,null,null,null,null,null,null,null,null,{"$f":"+TABLAS!A251","v":"3-1-2-4-5-11-10-9-8-7-6-T"}]
[null,null,null,null,null,null,null,null,null,null,null,{"$f":"+GETPIVOTDATA(\"Suma de total\",TABLAS!$A$266)","v":0}]
[null,null,null,null,null,null,null,null,null,null,null,{"$f":"+TABLAS!A303","v":"1-2-3-4-5-9-11-8-6-7-10-T"}]
[]
[]
[]
[]
[]
[]
[]
[]
[]
[]
[]
[]
[]
[]
[]
[null,null,null,null,null,null,null,"CONTROL DE MESES"]
[]
[null,null,null,null,null,null,null,{"$f":"+TABLAS!A146","v":"1-11-5-2-6-7-8-9-10-4-3-T"}]

{"sheet":"TABLAS","index":1,"n_rows":305,"n_cols":232,"rows_kept":305,"cut":false,"hidden":true,"merged":[[7,2,7,6],[8,3,8,6],[9,3,9,6],[10,3,10,6],[145,0,145,1],[302,0,302,1],[181,0,181,1],[250,0,250,1],[216,0,216,1],[11,3,11,6],[12,3,12,6],[13,3,13,6],[76,0,76,1],[108,0,108,1]]}
[]
[]
[]
[]
[]
[]
[]
[null,null,"Valores",null,null,null,null,null,"Tabla",{"$f":"IF(I9=\"(Todas)\",\"CUSCO \",\"\")","v":""}]
[null,null,"RED","03 - LA CONVENCION",null,null,null,null,{"$f":"IF(MID(D9,1,2)=\"99\",\"(All)\",MID(D9,1,2))","v":"03"},{"$f":"IF(I9=\"(All)\",\" \",I9)","v":"03"},null,null,{"$f":"LEN(MID(D9,5,90))","v":14},null,{"$f":"IF(MID(D9,6,5)=\"(All)\",\"\",D9)","v":"03 - LA CONVENCION"}]
[null,null,"Micro RED","0399 - (All)",null,null,null,null,{"$f":"IF(MID(D10,3,2)=\"99\",\"(All)\",MID(D10,1,4))","v":"(All)"}," ",null,null,{"$f":"LEN(MID(D10,7,90))","v":6},null,{"$f":"IF(MID(D10,8,5)=\"(All)\",\"\",D10)","v":""}]
[null,null,"Establecimiento","999999999 - (All)",null,null,null,null,{"$f":"IF(OR(MID(D11,1,9)=\"999999999\",MID(D11,1,9)=\"000000000\"),\"(All)\",MID(D11,1,9))","v":"(All)"}," ",null,null,{"$f":"LEN(MID(D11,12,90))","v":6},null,{"$f":"IF(MID(D11,13,5)=\"(All)\",\"\",D11)","v":""},null,{"$f":"MID(O11,1,9)","v":""}]
[null,null,"Provincia","00 - (All)",null,null,null,null,{"$f":"IF(MID(D12,1,2)=\"00\",\"(All)\",MID(D12,1,2))","v":"(All)"}," ",null,null,{"$f":"LEN(MID(D12,6,90))","v":5},null,{"$f":"IF(MID(D12,6,5)=\"(All)\",\"\",D12)","v":""}]
[null,null,"Distrito","0000 - (All)",null,null,null,null,{"$f":"IF(OR(MID(D13,1,4)=\"0000\",MID(D13,3,2)=\"00\"),\"(All)\",MID(D13,1,4))","v":"(All)"}," ",null,null,{"$f":"LEN(MID(D13,8,90))","v":5},null,{"$f":"IF(MID(D13,8,5)=\"(All)\",\"\",D13)","v":""}]
[null,null,"Ejecutira","99 - (ALL)",null,null,null,null,{"$f":"IF(MID(D14,1,2)=\"99\",\"(All)\",MID(D14,1,2))","v":"(All)"}," ",null,null,{"$f":"LEN(MID(D14,5,90))","v":6},null,{"$f":"IF(MID(D14,6,5)=\"(All)\",\"\",D14)","v":""}]
[]
[null,null,"Año","2024",null,null,null,null,{"$f":"+D16","v":"2024"},{"$f":"IF(I16=\"(Todas)\",\" \",I16)","v":"2024"}]
[]
[]
[]
[null,1,1,1,1,1,1,1,1,1,1,1,0,{"$f":"SUM(B20:M20)","v":11}]
[null,{"$f":"IF(B20=1,\"ENERO\",\"\")","v":"ENERO"},{"$f":"IF(C20=1,\"FEBRERO\",\"\")","v":"FEBRERO"},{"$f":"IF(D20=1,\"MARZO\",\"\")","v":"MARZO"},{"$f":"IF(E20=1,\"ABRIL\",\"\")","v":"ABRIL"},{"$f":"IF(F20=1,\"MAYO\",\"\")","v":"MAYO"},{"$f":"IF(G20=1,\"JUNIO\",\"\")","v":"JUNIO"},{"$f":"IF(H20=1,\"JULIO\",\"\")","v":"JULIO"},{"$f":"IF(I20=1,\"AGOSTO\",\"\")","v":"AGOSTO"},{"$f":"IF(J20=1,\"SETIEMBRE\",\"\")","v":"SETIEMBRE"},{"$f":"IF(K20=1,\"OCTUBRE\",\"\")","v":"OCTUBRE"},{"$f":"IF(L20=1,\"NOVIEMBRE\",\"\")","v":"NOVIEMBRE"},{"$f":"IF(M20=1,\"DICIEMBRE\",\"\")","v":""},{"$f":"IF(B20=1,B21,IF(C20=1,C21,IF(D20=1,D21,IF(E20=1,E21,IF(F20=1,F21,IF(G20=1,G21,IF(H20=1,H21,IF(I20=1,I21,IF(J20=1,J21,IF(K20=1,K21,IF(L20=1,L21,IF(M20=1,M21,\"\"))))))))))))","v":"ENERO"}]
[null,null,null,null,null,null,null,null,null,null,null,null,null,{"$f":"IF(N20=1,N21,\"\")","v":""}]
[null,10,4,6,8,10,12,14,16,18,20,22,null,{"$f":"MIN(B23:M23)","v":4},{"$f":"MAX(B23:M23)","v":22},{"$f":"MAX(C23:N23)","v":22}]
[null,{"$f":"IF(B23=2,\"ENE\",\"\")","v":""},{"$f":"IF(C23=4,\"FEB\",\"\")","v":"FEB"},{"$f":"IF(D23=6,\"MAR\",\"\")","v":"MAR"},{"$f":"IF(E23=8,\"ABR\",\"\")","v":"ABR"},{"$f":"IF(F23=10,\"MAY\",\"\")","v":"MAY"},{"$f":"IF(G23=12,\"JUN\",\"\")","v":"JUN"},{"$f":"IF(H23=14,\"JUL\",\"\")","v":"JUL"},{"$f":"IF(I23=16,\"AGO\",\"\")","v":"AGO"},{"$f":"IF(J23=18,\"SET\",\"\")","v":"SET"},{"$f":"IF(K23=20,\"OCT\",\"\")","v":"OCT"},{"$f":"IF(L23=22,\"NOV\",\"\")","v":"NOV"},{"$f":"IF(M23=24,\"DIC\",\"\")","v":""},{"$f":"IF(N23=B23,B24,IF(N23=C23,C24,IF(N23=D23,D24,IF(N23=E23,E24,IF(N23=F23,F24,IF(N23=G23,G24,IF(N23=H23,#REF!,IF(N23=I23,I24,IF(N23=J23,J24,IF(N23=K23,K24,IF(N23=L23,L24,IF(N23=M23,M24,\"\"))))))))))))","v":"FEB"},{"$f":"IF(O23=C23,C24,IF(O23=D23,D24,IF(O23=E23,E24,IF(O23=F23,F24,IF(O23=G23,G24,IF(O23=H23,H24,IF(O23=I23,I24,IF(O23=J23,J24,IF(O23=K23,K24,IF(O23=L23,L24,IF(O23=M23,M24,\"\")))))))))))","v":"NOV"},{"$f":"IF(P23=D23,D24,IF(P23=E23,E24,IF(P23=F23,F24,IF(P23=G23,G24,IF(P23=H23,H24,IF(P23=I23,I24,IF(P23=J23,J24,IF(P23=K23,K24,IF(P23=L23,L24,IF(P23=M23,M24,IF(P23=N23,N24,\"\")))))))))))","v":"NOV"}]
[null,null,null,null,null,null,null,null,null,null,null,null,null,{"$f":"CONCATENATE(N24,\" - \",O24)","v":"FEB - NOV"}]
[null,null,null,null,null,null,null,null,null,null,null,null,null,{"$f":"IF(N23=O23,N22,N25)","v":"FEB - NOV"}]
[]
[]
[]
[]
[]
[]
[]
[]
[]
[]
[]
[]
[]
[]
[]
[]
[]
[]
[]
[]
[]
[]
[]
["TUBERCU_ATC_ETAPAS"]
["ANNO",2024]
["cod_red","03"]
["codmic","(Todas)"]
["cod_prov","(Todas)"]
["coddist","(Todas)"]
["cod_estab","(Todas)"]
["cod_eje","(Todas)"]
[]
["Suma de ATC","Etiquetas de columna"]
["Etiquetas de fila","00-11A","12-17A","18-29A","30-59A","80-+A"]
[3,12746,3704,11953,26422,11163]
[1,12851,2997,10560,24849,10688]
[2,11666,3067,11266,24248,10834]
[5,19723,10353,13300,28030,11347]
[4,21342,10267,13067,28887,13029]
[10,18160,4837,10509,24564,10831]
[11,17209,7817,10593,25351,11269]
[9,23230,5381,10559,23210,10744]
[8,13362,4777,10363,23408,10825]
[7,15799,5568,11832,27999,11630]
[6,18487,10821,12642,29411,11477]
["T",184575,69589,126644,286379,123837]
[]
[]
["TOTAL"]
[{"$f":"COUNT(A61:A72)","v":11},{"$f":"SUM(B57:B73)","v":369150}]
[{"$f":"CONCATENATE(A61,\"-\",A62,\"-\",A63,\"-\",A64,\"-\",A65,\"-\",A66,\"-\",A67,\"-\",A68,\"-\",A69,\"-\",A70,\"-\",A71,\"-\",A72)","v":"3-1-2-5-4-10-11-9-8-7-6-T"}]
[null," BAS001"]
[null,{"$f":"IF(B78=B56,\"SI\",\"NO\")","v":"NO"}]
[]
[]
["TUBERCU_ATC_MAY15"]
["ANNO",2024]
["cod_red","03"]
["codmic","(Todas)"]
["cod_prov","(Todas)"]
["coddist","(Todas)"]
["cod_estab","(Todas)"]
["cod_eje","(Todas)"]
[]
["Suma de ATC","Etiquetas de columna"]
["Etiquetas de fila","0","15-+A"]
[3,14441,51547]
[1,14123,47822]
[2,12910,48171]
[4,27132,59460]
[5,24986,57767]
[9,25780,47344]
[10,20366,48535]
[7,18222,54606]
[8,15424,47311]
[11,20805,51434]
[6,24044,58794]
["T",218233,572791]
[]
[]
["TOTAL"]
[{"$f":"COUNT(A93:A104)","v":11},{"$f":"SUM(B89:B105)","v":436466}]
[{"$f":"CONCATENATE(A93,\"-\",A94,\"-\",A95,\"-\",A96,\"-\",A97,\"-\",A98,\"-\",A99,\"-\",A100,\"-\",A101,\"-\",A102,\"-\",A103,\"-\",A104)","v":"3-1-2-4-5-9-10-7-8-11-6-T"}]
[null," BAS001"]
[null,{"$f":"IF(B110=B88,\"SI\",\"NO\")","v":"NO"}]
[]
[]
[]
["TUBERCU_01"]
["anno",2024]
["cod_red","03"]
["codmic","(Todas)"]
["cod_prov","(Todas)"]
["coddist","(Todas)"]
["cod_estab","(Todas)"]
["cod_eje","(Todas)"]
[]
[null,"Valores"]
["Etiquetas de fila"," BAS001"," BAS002"," BAS003"," BAS004"," BAS005"," BAS006"," BAS007"," BAS008"," BAS009"," BAS010"," BAS011"," BAS012"," BAS013"," BAS014"," BAS015"," BAS016"," BAS017"," BAS018"," BAS019"," BAS020"," BAS021"," BAS022"," BAS023"," BAS024"," BAS025"," BAS026"," BAS027"," BAS028"," BAS029"," BAS030"," BAS031"," BAS032"," BAS033"," BAS034"," BAS035"," BAS036"," BAS037"," BAS038"," BAS039"," BAS040"," BAS041"," BAS042"," BAS043"," BAS044"," BAS045"," BAS046"," BAS047"," BAS048"," BAS049"," BAS050"," BAS051"," BAS052"," BAS053"," BAS054"," BAS055"," BAS056"," BAS057"," BAS058"," BAS059"," BAS060"," BAS061"," BAS062"," BAS063"," BAS064"," BAS065"," BAS066"," BAS067"," BAS068"," BAS069"," BAS070"," BAS071"," BAS072"," BAS073"," BAS074"," BAS075"," BAS076"," BAS077"," BAS078"," BAS079"," BAS080"," BAS081"," BAS082"," BAS083"," BAS084"," BAS085"," BAS086"," BAS087"," BAS088"," BAS089"," BAS090"," BAS091"," BAS092"," BAS093"," BAS094"," BAS095"," BAS096"," BAS097"," BAS098"," BAS099"," BAS100"," BAS101"," BAS102"," BAS103"," BAS104"," BAS105"," BAS106"," BAS107"," BAS108"," BAS109"," BAS110"," BAS111"," BAS112"," BAS113"," BAS114"," BAS115"," BAS116"," BAS117"," BAS118"," BAS119"," BAS120"," BAS121"," BAS122"," BAS123"," BAS124"," BAS125"," BAS126"," BAS127"," BAS128"," BAS129"," BAS130"," BAS131"," BAS132"," BAS133"," BAS134"," BAS135"," BAS136"," BAS137"," BAS138"," BAS139"," BAS140"," BAS141"," BAS142"," BAS143"," BAS144"," BAS145"," BAS146"," BAS147"," BAS148"," BAS149"," BAS150"," BAS151"," BAS152"," BAS153"," BAS154"," BAS155"," BAS156"," BAS157"," BAS158"," BAS159"," BAS160"," BAS161"," BAS162"," BAS163"," BAS164"," BAS165"," BAS166"," BAS167"," BAS168"," BAS169"," BAS170"," BAS171"," BAS172"," BAS173"," BAS174"," BAS175"," BAS176"," BAS177"," BAS178"," BAS179"," BAS180"," BAS181"," BAS182"," BAS183"," BAS184"," BAS185"," BAS186"," BAS187"," BAS188"," BAS189"," BAS190"," BAS191"," BAS192"," BAS193"," BAS194"," BAS195"," BAS196"," BAS197"," BAS198"," BAS199"," BAS200"," BAS201"," BAS202"," BAS203"," BAS204"," BAS205"," BAS206"," BAS207"," BAS208"," BAS209"," BAS210"," BAS211"," BAS212"," BAS213"," BAS214"," BAS215"," BAS216"," BAS217"," BAS218"," BAS219"," BAS220"," BAS221"," BAS222"," BAS223"," BAS224"," BAS225"," BAS226"," BAS227"," BAS228"," BAS229"," BAS230"]
[1,0,0,0,0,0,0,12,19,83,230,177,9,17,71,202,162,0,0,0,0,0,0,0,1,0,2,0,0,0,0,0,0,0,0,0,0,0,0,0,0,0,0,0,0,0,0,0,0,0,0,0,0,0,0,0,0,0,0,0,0,0,0,0,0,0,0,0,0,0,0,0,0,0,0,0,0,0,0,0,0,0,0,0,0,0,0,0,0,0,0,0,0,0,0,0,0,0,0,0,0,0,0,0,0,0,0,0,0,0,0,0,0,0,0,0,0,0,0,0,0,0,2,1,3,1,0,4,1,7,1,6,0,0,0,0,0,0,0,0,0,0,0,1,0,0,0,0,0,0,0,0,0,0,0,0,0,0,0,0,0,0,0,0,0,0,0,0,0,0,0,0,0,0,0,0,0,0,0,0,0,0,0,0,0,0,0,0,0,0,0,0,0,0,0,0,0,0,0,0,0,0,0,0,0,0,0,0,0,0,0,0,0,0,0,0,0,0,0,0,0,0,0,0,1,0,8,17,69,203,142]
[11,0,0,0,0,0,0,1,1,5,23,22,1,1,5,21,18,0,0,0,0,0,0,0,0,1,0,0,0,0,0,0,0,0,0,0,0,0,0,0,0,0,0,0,0,0,0,0,0,0,0,0,0,0,0,0,0,0,0,0,0,0,0,0,0,0,0,0,0,0,0,0,0,0,0,0,0,0,0,0,0,0,0,0,0,0,0,0,0,0,0,0,0,0,0,0,0,0,0,0,0,0,0,0,0,0,0,0,0,0,0,0,0,0,0,0,0,0,0,0,0,0,0,1,0,1,2,0,0,1,1,1,0,0,0,0,0,0,0,0,0,0,0,0,0,0,0,0,0,0,0,0,0,0,0,0,0,0,0,0,0,0,0,0,0,0,0,0,0,0,0,0,0,0,0,0,0,0,0,0,0,0,0,0,0,0,0,0,0,0,0,0,0,0,0,1,0,0,0,0,0,0,0,0,0,0,0,0,0,0,0,0,0,0,0,0,0,0,0,0,0,0,0,0,0,0,1,1,4,22,19]
[5,0,0,0,0,0,0,32,38,111,270,178,29,32,106,249,163,0,0,0,0,0,0,0,1,4,3,0,0,0,0,0,4,0,0,0,0,0,0,0,0,0,0,0,0,0,0,0,0,0,0,0,0,0,0,0,0,0,0,0,0,0,0,0,0,0,0,0,0,0,0,0,0,0,0,0,0,0,0,0,0,0,0,0,0,0,0,0,0,0,0,0,0,0,0,0,0,0,0,0,0,0,0,0,0,0,0,0,0,0,0,0,0,0,0,0,0,0,0,0,0,0,2,0,0,1,0,6,1,0,2,0,0,0,0,0,0,0,0,0,0,0,0,1,0,0,4,0,0,0,0,4,0,0,0,0,0,0,0,0,0,0,0,0,0,0,0,0,0,0,0,0,0,0,0,0,0,0,0,0,0,0,0,0,0,0,0,0,0,0,0,0,0,0,0,0,0,0,0,0,0,0,0,0,0,0,0,0,0,0,0,0,4,0,0,0,0,0,0,0,0,0,0,0,3,2,21,25,94,239,155]
[2,0,0,0,0,0,0,9,30,81,231,138,9,27,79,222,129,0,0,0,0,0,0,1,3,3,1,0,0,0,0,0,0,0,0,0,0,0,0,0,0,0,0,0,0,0,0,0,0,0,0,0,0,0,0,0,0,0,0,0,0,0,0,0,0,0,0,0,0,0,0,0,0,0,0,0,0,0,0,0,0,0,0,0,0,0,0,0,0,0,0,0,0,0,0,0,0,0,0,0,0,0,0,0,0,0,0,0,0,0,0,0,0,0,0,0,0,0,0,0,0,0,1,4,0,6,3,0,1,1,7,3,0,0,0,1,1,0,0,0,0,0,0,0,0,0,0,0,0,0,0,0,0,0,0,0,0,0,0,0,0,0,0,0,0,0,0,0,0,0,0,0,0,0,0,0,0,0,0,0,0,0,0,0,0,0,0,0,0,0,0,0,0,0,0,0,0,0,0,0,0,0,0,0,0,0,0,0,0,0,0,0,0,0,0,0,0,0,0,0,0,0,0,2,1,0,8,27,75,221,125]
[6,0,0,0,0,0,0,16,33,91,352,206,15,31,84,323,187,0,0,0,0,0,0,0,1,1,1,0,0,0,0,0,3,0,0,3,0,0,0,0,0,0,0,0,0,0,0,0,0,0,0,0,0,0,0,0,0,0,0,0,0,0,0,0,0,0,0,0,0,0,0,0,0,0,0,0,0,0,0,0,0,0,0,0,0,0,0,0,0,0,0,0,0,0,0,0,0,0,0,0,0,0,0,0,0,0,0,0,0,0,0,0,0,0,0,0,0,0,0,0,0,0,6,0,1,6,1,5,2,1,14,1,0,3,2,5,0,0,0,0,0,0,0,3,0,0,1,0,0,2,0,1,0,0,2,0,0,0,0,0,0,0,0,0,0,0,0,0,0,0,0,0,0,0,0,0,0,0,0,0,0,0,0,0,0,0,0,0,0,0,0,0,0,0,0,0,0,0,0,0,0,0,0,0,0,0,0,0,0,0,0,0,3,0,0,3,0,0,0,0,0,0,1,1,0,1,14,31,79,314,188]
[7,0,0,0,0,0,0,1,6,11,70,34,1,6,10,62,33,0,0,0,0,0,0,0,0,0,1,0,0,0,0,1,0,0,0,0,0,0,0,0,0,0,0,0,0,0,0,0,0,0,0,0,0,0,0,0,0,0,0,0,0,0,0,0,0,0,0,0,0,0,0,0,0,0,0,0,0,0,0,0,0,0,0,0,0,0,0,0,0,0,0,0,0,0,0,0,0,0,0,0,0,0,0,0,0,0,0,0,0,0,0,0,0,0,0,0,0,0,0,0,0,0,0,0,0,0,0,3,2,0,2,1,0,0,0,0,0,0,0,0,0,0,0,0,0,0,0,0,0,0,0,0,0,0,0,0,0,0,0,0,0,0,0,0,0,0,0,0,0,0,0,0,0,0,0,0,0,0,0,0,0,0,0,0,0,0,0,0,0,0,0,0,0,0,0,0,0,0,0,0,0,0,0,0,0,0,0,0,0,0,0,0,0,0,0,0,0,0,0,0,0,0,0,0,0,1,1,6,10,69,41]
[8,0,0,0,0,0,0,2,3,11,37,23,2,3,11,33,21,0,0,0,0,0,0,0,1,0,1,0,0,0,0,0,0,0,0,0,0,0,0,0,0,0,0,0,0,0,0,0,0,0,0,0,0,0,0,0,0,0,0,0,0,0,0,0,0,0,0,0,0,0,0,0,0,0,0,0,0,0,0,0,0,0,0,0,0,0,0,0,0,0,0,0,0,0,0,0,0,0,0,0,0,0,0,0,0,0,0,0,0,0,0,0,0,0,0,0,0,0,0,0,0,0,0,0,0,0,0,1,0,0,1,1,1,2,2,1,0,0,0,0,0,0,0,0,0,0,0,0,0,0,0,0,0,0,0,0,0,0,0,0,0,0,0,0,0,0,0,0,0,0,0,0,0,0,0,0,0,0,0,0,0,0,0,0,0,0,0,0,0,0,0,0,0,0,0,0,0,0,0,0,0,0,0,0,0,0,0,0,0,0,0,0,0,0,0,0,0,0,0,0,0,0,0,0,0,0,3,3,10,38,28]
[9,0,0,0,0,0,0,0,1,7,17,8,0,1,7,15,7,0,0,0,0,0,0,0,0,0,0,0,0,0,0,3,0,0,0,2,3,0,0,0,0,0,0,0,0,0,0,0,0,0,0,0,0,0,0,0,0,0,0,0,0,0,0,0,0,0,0,0,0,0,0,0,0,0,0,0,0,0,0,0,0,0,0,0,0,0,0,0,0,0,0,0,0,0,0,0,0,0,0,0,0,0,0,0,0,0,0,0,0,0,0,0,0,0,0,0,0,0,0,0,0,0,0,0,0,0,0,7,2,2,4,3,0,0,0,0,0,0,0,0,0,0,0,0,0,0,0,0,0,0,0,0,0,0,0,0,0,0,0,0,0,0,0,0,0,0,0,0,0,0,0,0,0,0,0,0,0,0,0,0,0,0,0,0,0,0,0,0,0,0,0,0,0,0,0,0,0,0,0,0,0,0,0,0,0,0,0,0,0,0,0,0,0,0,0,0,0,0,0,0,0,0,0,0,0,0,0,1,8,21,11]
[10,0,0,0,0,0,0,2,4,6,25,27,2,4,5,24,19,0,0,0,0,0,0,0,1,0,2,1,0,0,0,0,0,0,0,0,0,0,0,0,0,0,0,0,0,0,0,0,0,0,0,0,0,0,0,0,0,0,0,0,0,0,0,0,0,0,0,0,0,0,1,0,0,0,0,0,0,0,0,0,0,0,0,0,0,0,0,0,0,0,0,0,0,0,0,0,0,0,0,0,0,0,0,0,0,0,0,0,0,0,0,0,0,0,0,0,0,0,0,0,0,0,0,0,0,0,0,1,0,0,1,1,0,0,0,0,0,0,0,0,0,0,0,0,0,0,0,0,0,0,0,0,0,0,0,0,0,0,0,0,0,0,0,0,0,0,0,0,0,0,0,0,0,0,0,0,0,0,0,0,0,0,0,0,0,0,0,0,0,0,0,0,0,0,0,0,0,0,0,0,0,0,0,0,0,0,0,0,0,0,0,0,0,0,0,0,0,0,0,0,0,0,0,0,0,0,2,4,7,27,31]
[4,0,0,0,0,0,0,7,31,111,287,182,7,29,101,258,169,0,0,0,0,0,0,0,0,1,4,0,0,0,0,0,0,0,0,0,0,0,0,0,0,0,0,0,0,0,0,0,0,0,0,0,0,0,0,0,0,0,0,0,0,0,0,0,0,0,0,0,0,0,0,0,0,0,0,0,0,0,0,0,0,0,0,0,0,0,0,0,0,0,0,0,0,0,0,0,0,0,0,0,0,0,0,0,0,0,0,0,0,0,0,0,0,0,0,0,0,0,0,0,0,0,0,0,1,1,0,0,0,0,5,7,0,0,1,0,0,0,0,0,0,0,0,0,0,0,0,0,0,0,0,0,0,0,0,0,0,0,0,0,0,0,0,0,0,0,0,0,0,0,0,0,0,0,0,0,0,0,0,0,0,0,0,0,0,0,0,0,0,0,0,0,0,0,0,0,0,0,0,0,0,0,0,0,0,0,0,0,0,0,0,0,0,0,0,0,0,0,0,0,0,0,0,0,0,0,4,29,93,248,164]
[3,0,0,0,0,0,0,4,19,81,259,200,4,17,78,244,186,0,0,0,0,0,0,0,0,0,3,0,0,0,0,0,0,0,0,0,0,0,0,1,0,0,0,0,0,0,0,0,0,0,0,0,0,0,0,0,1,0,0,0,0,0,0,0,0,0,0,0,0,0,0,0,0,0,0,0,0,0,0,0,0,0,0,0,0,0,0,0,0,0,0,0,0,0,0,0,0,0,0,0,0,0,0,0,0,0,0,0,0,0,0,0,0,0,0,0,0,0,0,0,0,0,4,0,1,6,1,1,0,1,3,1,0,0,0,0,1,0,0,0,0,0,0,1,2,0,2,0,0,1,0,2,0,0,1,0,0,0,0,0,0,0,0,0,0,0,0,0,0,0,0,0,0,0,0,0,0,0,0,0,0,0,0,0,0,0,0,0,0,0,0,0,0,0,0,0,0,0,0,0,0,0,0,0,0,0,0,0,0,0,0,0,0,0,0,0,0,0,0,0,0,0,0,0,0,0,3,19,72,229,171]
["T",0,0,0,0,0,0,86,185,598,1801,1195,79,168,557,1653,1094,0,0,0,0,0,0,1,8,10,18,1,0,0,0,4,7,0,0,5,3,0,0,1,0,0,0,0,0,0,0,0,0,0,0,0,0,0,0,0,1,0,0,0,0,0,0,0,0,0,0,0,0,0,1,0,0,0,0,0,0,0,0,0,0,0,0,0,0,0,0,0,0,0,0,0,0,0,0,0,0,0,0,0,0,0,0,0,0,0,0,0,0,0,0,0,0,0,0,0,0,0,0,0,0,0,15,6,6,22,7,28,9,13,41,25,1,5,5,7,2,0,0,0,0,0,0,6,2,0,7,0,0,3,0,7,0,0,3,0,0,0,0,0,0,0,0,0,0,0,0,0,0,0,0,0,0,0,0,0,0,0,0,0,0,0,0,0,0,0,0,0,0,0,0,0,0,0,0,1,0,0,0,0,0,0,0,0,0,0,0,0,0,0,0,0,7,0,0,3,0,0,0,0,0,0,1,3,5,4,65,163,521,1631,1075]
[]
[]
[]
[]
[]
[]
["TOTAL"]
[{"$f":"COUNT(A126:A142)","v":11},{"$f":"SUM(B126:B142)","v":0},{"$f":"SUM(C126:C142)","v":0},0,0,0,0,172,370,1196,3602,2390,158,336,1114,3306,2188,0,0,0,0,0,0,2,16,20,36,2,0,0,0,8,14,0,0,10,6,0,0,2,0,0,0,0,0,0,0,0,0,0,0,0,0,0,0,0,2,0,0,0,0,0,0,0,0,0,{"$f":"SUM(BO126:BO142)","v":0},0,0,0,2,0,0,0,0,0,0,0,0,0,0,0,0,0,0,0,0,0,0,0,0,0,0,0,0,0,0,0,0,0,0,0,0,0,0,0,0,0,0,0,0,0,0,0,0,0,0,0,0,0,0,0,30,12,12,44,14,56,18,26,{"$f":"SUM(EA126:EA142)","v":82},50,2,10,10,14,4,0,0,0,0,0,0,12,4,0,14,0,0,6,0,14,0,0,6,0,0,0,0,0,0,0,0,0,0,0,0,0,0,0,0,0,0,0,0,0,0,0,0,0,0,0,0,0,0,0,0,0,0,0,0,0,0,0,{"$f":"SUM(GM126:GM142)","v":0},2,0,0,0,0,0,0,0,0,0,0,0,0,0,0,0,0,14,0,0,6,0,0,0,0,0,0,2,6,10,8,130,326,1042,3262,2150,0]
[{"$f":"CONCATENATE(A126,\"-\",A127,\"-\",A128,\"-\",A129,\"-\",A130,\"-\",A131,\"-\",A132,\"-\",A133,\"-\",A134,\"-\",A135,\"-\",A136,\"-\",A137)","v":"1-11-5-2-6-7-8-9-10-4-3-T"}]
[null," BAS001"," BAS002"," BAS003"," BAS004"," BAS005"," BAS006"," BAS007"," BAS008"," BAS009"," BAS010"," BAS011"," BAS012"," BAS013"," BAS014"," BAS015"," BAS016"," BAS017"," BAS018"," BAS019"," BAS020"," BAS021"," BAS022"," BAS023"," BAS024"," BAS025"," BAS026"," BAS027"," BAS028"," BAS029"," BAS030"," BAS031"," BAS032"," BAS033"," BAS034"," BAS035"," BAS036"," BAS037"," BAS038"," BAS039"," BAS040"," BAS041"," BAS042"," BAS043"," BAS044"," BAS045"," BAS046"," BAS047"," BAS048"," BAS049"," BAS050"," BAS051"," BAS052"," BAS053"," BAS054"," BAS055"," BAS056"," BAS057"," BAS058"," BAS059"," BAS060"," BAS061"," BAS062"," BAS063"," BAS064"," BAS065"," BAS066"," BAS067"," BAS068"," BAS069"," BAS070"," BAS071"," BAS072"," BAS073"," BAS074"," BAS075"," BAS076"," BAS077"," BAS078"," BAS079"," BAS080"," BAS081"," BAS082"," BAS083"," BAS084"," BAS085"," BAS086"," BAS087"," BAS088"," BAS089"," BAS090"," BAS091"," BAS092"," BAS093"," BAS094"," BAS095"," BAS096"," BAS097"," BAS098"," BAS099"," BAS100"," BAS101"," BAS102"," BAS103"," BAS104"," BAS105"," BAS106"," BAS107"," BAS108"," BAS109"," BAS110"," BAS111"," BAS112"," BAS113"," BAS114"," BAS115"," BAS116"," BAS117"," BAS118"," BAS119"," BAS120"," BAS121"," BAS122"," BAS123"," BAS124"," BAS125"," BAS126"," BAS127"," BAS128"," BAS129"," BAS130"," BAS131"," BAS132"," BAS133"," BAS134"," BAS135"," BAS136"," BAS137"," BAS138"," BAS139"," BAS140"," BAS141"," BAS142"," BAS143"," BAS144"," BAS145"," BAS146"," BAS147"," BAS148"," BAS149"," BAS150"," BAS151"," BAS152"," BAS153"," BAS154"," BAS155"," BAS156"," BAS157"," BAS158"," BAS159"," BAS160"," BAS161"," BAS162"," BAS163"," BAS164"," BAS165"," BAS166"," BAS167"," BAS168"," BAS169"," BAS170"," BAS171"," BAS172"," BAS173"," BAS174"," BAS175"," BAS176"," BAS177"," BAS178"," BAS179"," BAS180"," BAS181"," BAS182"," BAS183"," BAS184"," BAS185"," BAS186"," BAS187"," BAS188"," BAS189"," BAS190"," BAS191"," BAS192"," BAS193"," BAS194"," BAS195"," BAS196"," BAS197"," BAS198"," BAS199"," BAS200"," BAS201"," BAS202"," BAS203"," BAS204"," BAS205"," BAS206"," BAS207"," BAS208"," BAS209"," BAS210"," BAS211"," BAS212"," BAS213"," BAS214"," BAS215"," BAS216"," BAS217"," BAS218"," BAS219"," BAS220"," BAS221"," BAS222"," BAS223"," BAS224"," BAS225"," BAS226"," BAS227"," BAS228"," BAS229"," BAS230"]
[null,{"$f":"IF(B147=B125,\"SI\",\"NO\")","v":"SI"},{"$f":"IF(C147=C125,\"SI\",\"NO\")","v":"SI"},"SI","SI","SI","SI","SI","SI","SI","SI","SI","SI","SI","SI","SI","SI","SI","SI","SI","SI","SI","SI","SI","SI","SI","SI","SI","SI","SI","SI","SI","SI","SI","SI","SI","SI","SI","SI","SI","SI","SI","SI","SI","SI","SI","SI","SI","SI","SI","SI","SI","SI","SI","SI","SI","SI","SI","SI","SI","SI","SI","SI","SI","SI","SI",{"$f":"IF(BO147=BO125,\"SI\",\"NO\")","v":"SI"},"SI","SI","SI","SI","SI","SI","SI","SI","SI","SI","SI","SI","SI","SI","SI","SI","SI","SI","SI","SI","SI","SI","SI","SI","SI","SI","SI","SI","SI","SI","SI","SI","SI","SI","SI","SI","SI","SI","SI","SI","SI","SI","SI","SI","SI","SI","SI","SI","SI","SI","SI","SI","SI","SI","SI","SI","SI","SI","SI","SI","SI","SI","SI",{"$f":"IF(EA147=EA125,\"SI\",\"NO\")","v":"SI"},"SI","SI","SI","SI","SI","SI","SI","SI","SI","SI","SI","SI","SI","SI","SI","SI","SI","SI","SI","SI","SI","SI","SI","SI","SI","SI","SI","SI","SI","SI","SI","SI","SI","SI","SI","SI","SI","SI","SI","SI","SI","SI","SI","SI","SI","SI","SI","SI","SI","SI","SI","SI","SI","SI","SI","SI","SI","SI","SI","SI","SI","SI","SI",{"$f":"IF(GM147=GM125,\"SI\",\"NO\")","v":"SI"},"SI","SI","SI","SI","SI","SI","SI","SI","SI","SI","SI","SI","SI","SI","SI","SI","SI","SI","SI","SI","SI","SI","SI","SI","SI","SI","SI","SI","SI","SI","SI","SI","SI","SI","SI","SI",{"$f":"IF(HW147=HX125,\"SI\",\"NO\")","v":"NO"}]
[]
[]
["TUBERCU_02"]
["anno",2024]
["cod_red","03"]
["codmic","(Todas)"]
["cod_prov","(Todas)"]
["coddist","(Todas)"]
["cod_estab","(Todas)"]
["cod_eje","(Todas)"]
[]
[null,"Valores"]
["Etiquetas de fila"," BAS001"," BAS002"," BAS003"," BAS004"," BAS005"," BAS006"," BAS007"," BAS008"," BAS009"," BAS010"," BAS011"," BAS012"," BAS013"," BAS014"," BAS015"," BAS016"," BAS017"," BAS018"," BAS019"," BAS020"," BAS021"," BAS022"," BAS023"," BAS024"," BAS025"," BAS026"," BAS027"," BAS028"," BAS029"," BAS030"," BAS031"," BAS032"," BAS033"," BAS034"," BAS035"," BAS036"," BAS037"," BAS038"," BAS039"," BAS040"," BAS041"," BAS042"," BAS043"," BAS044"," BAS045"," BAS046"," BAS047"," BAS048"," BAS049"," BAS050"," BAS051"," BAS052"," BAS053"," BAS054"," BAS055"," BAS056"," BAS057"," BAS058"," BAS059"," BAS060"," BAS061"," BAS062"," BAS063"," BAS064"," BAS065"," BAS066"," BAS067"," BAS068"," BAS069"," BAS070"," BAS071"," BAS072"," BAS073"," BAS074"," BAS075"," BAS076"," BAS077"," BAS078"," BAS079"," BAS080"," BAS081"," BAS082"," BAS083"," BAS084"," BAS085"," BAS086"," BAS087"," BAS088"," BAS089"," BAS090"," BAS091"," BAS092"," BAS093"," BAS094"," BAS095"," BAS096"," BAS097"," BAS098"," BAS099"," BAS100"," BAS101"," BAS102"," BAS103"," BAS104"," BAS105"," BAS106"," BAS107"," BAS108"," BAS109"," BAS110"," BAS111"," BAS112"," BAS113"," BAS114"," BAS115"," BAS116"," BAS117"," BAS118"," BAS119"," BAS120"," BAS121"," BAS122"," BAS123"," BAS124"," BAS125"," BAS126"," BAS127"," BAS128"," BAS129"," BAS130"," BAS131"," BAS132"," BAS133"," BAS134"," BAS135"," BAS136"," BAS137"," BAS138"," BAS139"," BAS140"," BAS141"," BAS142"," BAS143"," BAS144"," BAS145"," BAS146"," BAS147"," BAS148"," BAS149"," BAS150"," BAS151"," BAS152"," BAS153"," BAS154"," BAS155"," BAS156"," BAS157"," BAS158"," BAS159"," BAS160"," BAS161"," BAS162"," BAS163"," BAS164"," BAS165"," BAS166"," BAS167"," BAS168"," BAS169"," BAS170"," BAS171"," BAS172"," BAS173"," BAS174"," BAS175"," BAS176"," BAS177"," BAS178"," BAS179"," BAS180"," BAS181"," BAS182"," BAS183"," BAS184"," BAS185"," BAS186"," BAS187"," BAS188"," BAS189"," BAS190"," BAS191"," BAS192"," BAS193"," BAS194"," BAS195"," BAS196"," BAS197"," BAS198"," BAS199"," BAS200"," BAS201"," BAS202"," BAS203"," BAS204"," BAS205"," BAS206"," BAS207"," BAS208"," BAS209"," BAS210"," BAS211"," BAS212"," BAS213"," BAS214"," BAS215"," BAS216"," BAS217"," BAS218"," BAS219"," BAS220"," BAS221"," BAS222"," BAS223"," BAS224"," BAS225"," BAS226"," BAS227"," BAS228"," BAS229"," BAS230"]
[1,0,0,0,0,0,0,0,0,0,1,0,0,0,0,0,0,0,0,0,0,0,0,0,0,0,0,0,0,0,0,0,0,0,0,0,0,0,0,0,0,0,0,0,0,0,0,0,0,0,0,0,0,0,0,0,0,0,0,0,0,0,0,0,0,0,0,0,0,0,0,0,0,0,0,0,2,0,0,0,0,0,0,0,0,0,0,0,0,0,1,0,0,0,2,0,0,0,0,0,0,0,0,0,0,0,0,0,0,0,0,0,0,0,0,0,0,0,0,0,0,0,0,0,0,0,0,0,0,0,0,0,0,0,0,0,0,0,0,0,0,0,0,0,0,0,0,0,0,0,0,0,0,0,0,0,0,0,0,0,0,0,0,0,0,0,0,0,0,0,0,0,0,0,0,0,0,0,0,0,0,0,0,0,0,0,0,0,0,0,0,0,0,0,0,0,0,0,0,0,0,0,0,0,0,0,0,0,0,0,0,0,0,0,0,0,0,0,0,0,0,0,0,0,0,0,0,0,0,0,0]
[11,0,0,0,0,0,1,1,1,2,1,0,0,0,0,0,0,0,0,0,0,0,0,0,0,0,0,0,0,0,0,0,0,0,0,0,0,0,0,0,0,0,0,0,0,0,0,0,0,0,0,0,0,0,0,0,0,0,0,0,0,0,0,0,0,0,0,0,0,0,0,0,0,0,0,0,0,0,0,0,0,0,0,0,0,0,0,0,0,0,0,1,0,0,0,0,0,0,0,0,0,0,0,0,0,0,0,0,0,0,0,0,0,0,0,0,0,0,0,0,0,0,0,0,0,0,0,0,0,0,0,0,0,0,0,0,0,0,0,0,0,0,0,0,0,0,0,0,0,0,0,0,0,0,0,0,0,0,0,0,0,0,0,0,0,0,0,0,0,0,0,0,0,0,0,0,0,0,0,0,0,0,0,0,0,0,0,0,0,0,0,0,0,0,0,0,0,0,0,0,0,0,0,0,0,0,0,0,0,0,0,0,0,0,0,0,0,0,0,0,0,0,0,0,0,0,0,0,0,0,0]
[5,0,0,0,0,0,0,0,0,4,1,0,0,0,5,1,0,0,0,0,0,0,0,0,0,0,0,0,0,0,0,0,0,0,0,0,0,0,0,0,0,0,0,0,0,0,0,0,0,0,0,0,0,0,0,0,0,0,0,0,0,0,0,0,0,0,0,0,0,0,0,0,0,0,0,5,1,0,0,0,0,0,0,0,0,0,0,0,0,0,1,0,1,0,3,0,0,1,1,0,1,0,0,0,0,0,0,0,0,0,0,0,0,0,0,0,0,0,0,1,2,0,0,0,0,0,0,0,1,0,0,0,0,0,0,0,0,0,0,0,1,0,0,0,0,0,0,0,0,0,0,0,0,0,0,0,0,0,0,0,0,0,0,0,0,0,0,0,0,0,0,0,0,0,0,0,0,0,0,0,0,0,0,0,0,0,0,0,0,0,0,0,0,0,0,0,0,0,0,0,0,0,0,0,0,0,0,0,0,0,0,0,0,0,0,0,0,0,0,0,0,0,0,0,0,0,0,0,0,0,0]
[2,0,0,0,0,0,0,0,5,3,1,0,0,5,2,0,0,0,0,0,0,0,0,0,0,0,0,0,0,0,0,0,0,0,0,0,0,0,0,0,0,0,0,0,0,0,0,0,0,0,0,0,0,0,0,0,0,0,0,0,0,0,0,0,0,0,0,0,0,0,0,0,0,0,2,1,0,0,0,0,0,0,0,0,0,0,0,0,0,1,1,0,0,0,1,0,0,1,1,2,1,0,0,0,0,0,0,0,0,0,0,0,0,0,0,0,0,0,0,0,0,0,0,0,0,0,0,0,0,0,0,0,0,0,0,0,0,0,0,0,0,0,0,0,0,0,0,0,0,0,0,0,0,0,0,0,0,0,0,0,0,0,0,0,0,0,0,0,0,0,0,0,0,0,0,0,0,0,0,0,0,0,0,0,0,0,0,0,0,0,0,0,0,0,0,0,0,0,0,0,0,0,0,0,0,0,0,0,0,0,0,0,0,0,0,0,0,0,0,0,0,0,0,0,0,0,0,0,0,0,0]
[6,0,0,0,0,0,0,1,1,3,2,0,1,1,4,1,0,0,0,0,0,0,0,0,0,0,0,0,0,0,0,0,0,0,0,0,0,0,0,0,0,0,0,0,0,0,0,0,0,0,0,0,0,0,0,0,0,0,0,0,0,0,0,0,0,0,0,0,0,0,0,0,0,1,1,2,2,0,0,0,0,0,0,0,0,0,0,0,0,0,0,0,1,0,1,0,0,0,1,0,0,0,0,0,0,0,0,0,0,0,0,0,0,0,0,0,0,0,0,0,2,0,0,0,2,0,0,1,0,0,0,1,0,0,0,0,0,0,0,0,0,0,0,0,0,0,0,0,0,0,0,0,0,0,0,0,0,0,0,0,0,0,0,0,0,0,0,0,0,0,0,0,0,0,0,0,0,0,0,0,0,0,0,0,0,0,0,0,0,0,0,0,0,0,0,0,0,0,0,0,0,0,0,0,0,0,0,0,0,0,0,0,0,0,0,0,0,0,0,0,0,0,0,0,0,0,0,0,0,0,0]
[7,0,0,0,0,0,0,0,2,3,0,0,0,0,0,0,0,0,0,0,0,0,0,0,0,0,0,0,0,0,0,0,0,0,0,0,0,0,0,0,0,0,0,0,0,0,0,0,0,0,0,0,0,0,0,0,0,0,0,0,0,0,0,0,0,0,0,0,0,0,0,0,0,0,0,0,0,0,0,0,0,0,0,0,0,0,0,0,0,0,0,0,0,0,1,0,0,0,0,0,0,0,0,0,0,0,0,0,0,0,1,0,0,0,0,0,0,0,0,0,0,0,0,0,0,0,0,0,0,0,0,0,0,0,0,0,0,0,0,0,0,0,0,0,0,0,0,0,0,0,0,0,0,0,0,0,0,0,0,0,0,0,0,0,0,0,0,0,0,0,0,0,0,0,0,0,0,0,0,0,0,0,0,0,0,0,0,0,0,0,0,0,0,0,0,0,0,0,0,0,0,0,0,0,0,0,0,0,0,0,0,0,0,0,0,0,0,0,0,0,0,0,0,0,0,0,0,0,0,0,0]
[8,0,0,0,0,0,0,1,1,2,2,0,0,0,0,0,0,0,0,0,0,0,0,0,0,0,0,0,0,0,0,0,0,0,0,0,0,0,0,0,0,0,0,0,0,0,0,0,0,0,0,0,0,0,0,0,0,0,0,0,0,0,0,0,0,0,0,0,0,0,0,0,0,0,0,0,0,0,0,0,0,0,0,0,0,0,0,0,0,0,0,0,0,0,1,0,0,0,1,0,0,0,0,0,0,0,0,0,0,0,0,0,0,0,0,0,0,0,0,0,0,0,0,0,0,0,0,0,0,0,0,0,0,0,0,0,0,0,0,0,0,0,0,0,0,0,0,0,0,0,0,0,0,0,0,0,0,0,0,0,0,0,0,0,0,0,0,0,0,0,0,0,0,0,0,0,0,0,0,0,0,0,0,0,0,0,0,0,0,0,0,0,0,0,0,0,0,0,0,0,0,0,0,0,0,0,0,0,0,0,0,0,0,0,0,0,0,0,0,0,0,0,0,0,0,0,0,0,0,0,0]
[9,0,0,0,0,0,0,0,0,2,0,0,0,0,0,0,0,0,0,0,0,0,0,0,0,0,0,0,0,0,0,0,0,0,0,0,0,0,0,0,0,0,0,0,0,0,0,0,0,0,0,0,0,0,0,0,0,0,0,0,0,0,0,0,0,0,0,0,0,0,0,0,0,0,0,0,0,0,0,0,0,0,0,0,0,0,0,0,0,0,0,0,0,0,0,0,0,0,0,0,0,0,0,0,0,0,0,0,0,0,3,0,0,0,0,0,0,0,0,0,0,0,0,1,0,0,2,0,0,0,0,0,1,0,1,0,0,0,0,0,0,0,0,0,0,0,0,0,0,0,0,0,0,0,0,0,0,0,0,0,0,0,0,0,0,0,0,0,0,0,0,0,0,0,0,0,0,0,0,0,0,0,0,0,0,0,0,0,0,0,0,0,0,0,0,0,0,0,0,0,0,0,0,0,0,0,0,0,0,0,0,0,0,0,0,0,0,0,0,0,0,0,0,0,0,0,0,0,0,0,0]
[10,0,0,0,0,0,0,0,0,1,0,0,0,0,0,0,0,0,0,0,0,0,0,0,0,0,0,0,0,0,0,0,0,0,0,0,0,0,0,0,0,0,0,0,0,0,0,0,0,0,0,0,0,0,0,0,0,0,0,0,0,0,0,0,0,0,0,0,0,0,0,0,0,0,0,0,0,0,0,0,0,0,0,0,0,0,0,0,0,0,1,0,0,0,2,0,0,0,0,0,0,0,0,0,1,0,0,0,0,0,0,0,0,0,0,0,0,0,0,0,0,0,0,0,0,0,0,0,0,0,0,0,0,0,0,0,0,0,0,0,0,0,0,0,0,0,0,0,0,0,0,0,0,0,0,0,0,0,0,0,0,0,0,0,0,0,0,0,0,0,0,0,0,0,0,0,0,0,0,0,0,0,0,0,0,0,0,0,0,0,0,0,0,0,0,0,0,0,0,0,0,0,0,0,0,0,0,0,0,0,0,0,0,0,0,0,0,0,0,0,0,0,0,0,0,0,0,0,0,0,0]
[4,0,0,0,0,0,0,0,0,0,1,0,0,0,0,1,0,0,0,0,0,0,0,0,0,1,0,0,0,0,0,0,0,0,0,0,0,0,0,0,0,0,0,0,0,0,0,0,0,0,0,0,0,0,0,0,0,0,0,0,0,0,0,0,0,0,0,0,0,0,0,0,0,0,0,0,1,0,0,0,0,0,0,0,0,0,0,0,0,0,0,0,1,0,1,0,0,0,0,0,0,0,3,0,0,0,0,0,0,0,0,0,0,0,0,0,0,0,0,0,0,0,0,0,0,0,0,0,0,0,0,0,0,0,0,0,0,0,0,0,0,0,0,0,0,0,0,0,0,0,0,0,0,0,0,0,0,0,0,0,0,0,0,0,0,0,0,0,0,0,0,0,0,0,0,0,0,0,0,0,0,0,0,0,0,0,0,0,0,0,0,0,0,0,0,0,0,0,0,0,0,0,0,0,0,0,0,0,0,0,0,0,0,0,0,0,0,0,0,0,0,0,0,0,0,0,0,0,0,0,0]
[3,0,0,0,0,0,0,0,0,0,1,0,0,0,0,2,0,0,0,0,0,0,0,0,0,0,0,0,0,0,0,0,0,0,0,0,0,0,0,0,0,0,0,0,0,0,0,0,0,0,0,0,0,0,0,0,0,0,0,0,0,0,0,0,0,0,0,0,0,0,0,0,0,0,0,0,1,0,0,0,0,0,0,0,0,0,0,0,0,0,0,0,0,0,2,0,0,0,0,0,0,0,1,0,0,0,0,0,0,0,0,0,0,0,0,0,0,0,0,0,0,0,0,0,0,0,0,0,0,0,0,0,0,0,0,0,0,0,1,0,0,0,0,0,0,0,0,0,0,0,0,0,0,0,0,0,0,0,0,0,0,0,0,0,0,0,0,0,0,0,0,0,0,0,0,0,0,0,0,0,0,0,0,0,0,0,0,0,0,0,0,0,0,0,0,0,0,0,0,0,0,0,0,0,0,0,0,0,0,0,0,0,0,0,0,0,0,0,0,0,0,0,0,0,0,0,0,0,0,0,0]
["T",0,0,0,0,0,1,3,10,20,10,0,1,6,11,5,0,0,0,0,0,0,0,0,0,1,0,0,0,0,0,0,0,0,0,0,0,0,0,0,0,0,0,0,0,0,0,0,0,0,0,0,0,0,0,0,0,0,0,0,0,0,0,0,0,0,0,0,0,0,0,0,0,1,3,8,7,0,0,0,0,0,0,0,0,0,0,0,0,1,4,1,3,0,14,0,0,2,4,2,2,0,4,0,1,0,0,0,0,0,4,0,0,0,0,0,0,0,0,1,4,0,0,1,2,0,2,1,1,0,0,1,1,0,1,0,0,0,1,0,1,0,0,0,0,0,0,0,0,0,0,0,0,0,0,0,0,0,0,0,0,0,0,0,0,0,0,0,0,0,0,0,0,0,0,0,0,0,0,0,0,0,0,0,0,0,0,0,0,0,0,0,0,0,0,0,0,0,0,0,0,0,0,0,0,0,0,0,0,0,0,0,0,0,0,0,0,0,0,0,0,0,0,0,0,0,0,0,0,0,0]
[]
[]
[]
[]
[]
[]
["TOTAL"]
[{"$f":"COUNT(A162:A178)","v":11},{"$f":"SUM(B162:B178)","v":0},{"$f":"SUM(C162:C178)","v":0},0,0,0,2,6,20,40,20,0,2,12,22,10,0,0,0,0,0,0,0,0,0,2,0,0,0,0,0,0,0,0,0,0,0,0,0,0,0,0,0,0,0,0,0,0,0,0,0,0,0,0,0,0,0,0,0,0,0,0,0,0,0,0,{"$f":"SUM(BO162:BO178)","v":0},0,0,0,0,0,0,2,6,16,14,0,0,0,0,0,0,0,0,0,0,0,0,2,8,2,6,0,28,0,0,4,8,4,4,0,8,0,2,0,0,0,0,0,8,0,0,0,0,0,0,0,0,2,8,0,0,2,4,0,4,2,2,0,{"$f":"SUM(EA162:EA178)","v":0},2,2,0,2,0,0,0,2,0,2,0,0,0,0,0,0,0,0,0,0,0,0,0,0,0,0,0,0,0,0,0,0,0,0,0,0,0,0,0,0,0,0,0,0,0,0,0,0,0,0,0,0,0,0,0,0,0,0,0,0,0,0,0,{"$f":"SUM(GM162:GM178)","v":0},0,0,0,0,0,0,0,0,0,0,0,0,0,0,0,0,0,0,0,0,0,0,0,0,0,0,0,0,0,0,0,0,0,0,0,0]
[{"$f":"CONCATENATE(A162,\"-\",A163,\"-\",A164,\"-\",A165,\"-\",A166,\"-\",A167,\"-\",A168,\"-\",A169,\"-\",A170,\"-\",A171,\"-\",A172,\"-\",A173)","v":"1-11-5-2-6-7-8-9-10-4-3-T"}]
[null," BAS001"," BAS002"," BAS003"," BAS004"," BAS005"," BAS006"," BAS007"," BAS008"," BAS009"," BAS010"," BAS011"," BAS012"," BAS013"," BAS014"," BAS015"," BAS016"," BAS017"," BAS018"," BAS019"," BAS020"," BAS021"," BAS022"," BAS023"," BAS024"," BAS025"," BAS026"," BAS027"," BAS028"," BAS029"," BAS030"," BAS031"," BAS032"," BAS033"," BAS034"," BAS035"," BAS036"," BAS037"," BAS038"," BAS039"," BAS040"," BAS041"," BAS042"," BAS043"," BAS044"," BAS045"," BAS046"," BAS047"," BAS048"," BAS049"," BAS050"," BAS051"," BAS052"," BAS053"," BAS054"," BAS055"," BAS056"," BAS057"," BAS058"," BAS059"," BAS060"," BAS061"," BAS062"," BAS063"," BAS064"," BAS065"," BAS066"," BAS067"," BAS068"," BAS069"," BAS070"," BAS071"," BAS072"," BAS073"," BAS074"," BAS075"," BAS076"," BAS077"," BAS078"," BAS079"," BAS080"," BAS081"," BAS082"," BAS083"," BAS084"," BAS085"," BAS086"," BAS087"," BAS088"," BAS089"," BAS090"," BAS091"," BAS092"," BAS093"," BAS094"," BAS095"," BAS096"," BAS097"," BAS098"," BAS099"," BAS100"," BAS101"," BAS102"," BAS103"," BAS104"," BAS105"," BAS106"," BAS107"," BAS108"," BAS109"," BAS110"," BAS111"," BAS112"," BAS113"," BAS114"," BAS115"," BAS116"," BAS117"," BAS118"," BAS119"," BAS120"," BAS121"," BAS122"," BAS123"," BAS124"," BAS125"," BAS126"," BAS127"," BAS128"," BAS129"," BAS130"," BAS131"," BAS132"," BAS133"," BAS134"," BAS135"," BAS136"," BAS137"," BAS138"," BAS139"," BAS140"," BAS141"," BAS142"," BAS143"," BAS144"," BAS145"," BAS146"," BAS147"," BAS148"," BAS149"," BAS150"," BAS151"," BAS152"," BAS153"," BAS154"," BAS155"," BAS156"," BAS157"," BAS158"," BAS159"," BAS160"," BAS161"," BAS162"," BAS163"," BAS164"," BAS165"," BAS166"," BAS167"," BAS168"," BAS169"," BAS170"," BAS171"," BAS172"," BAS173"," BAS174"," BAS175"," BAS176"," BAS177"," BAS178"," BAS179"," BAS180"," BAS181"," BAS182"," BAS183"," BAS184"," BAS185"," BAS186"," BAS187"," BAS188"," BAS189"," BAS190"," BAS191"," BAS192"," BAS193"," BAS194"," BAS195"," BAS196"," BAS197"," BAS198"," BAS199"," BAS200"," BAS201"," BAS202"," BAS203"," BAS204"," BAS205"," BAS206"," BAS207"," BAS208"," BAS209"," BAS210"," BAS211"," BAS212"," BAS213"," BAS214"," BAS215"," BAS216"," BAS217"," BAS218"," BAS219"," BAS220"," BAS221"," BAS222"," BAS223"," BAS224"," BAS225"," BAS226"," BAS227"," BAS228"," BAS229"," BAS230"]
[null,{"$f":"IF(B183=B161,\"SI\",\"NO\")","v":"SI"},{"$f":"IF(C183=C161,\"SI\",\"NO\")","v":"SI"},"SI","SI","SI","SI","SI","SI","SI","SI","SI","SI","SI","SI","SI","SI","SI","SI","SI","SI","SI","SI","SI","SI","SI","SI","SI","SI","SI","SI","SI","SI","SI","SI","SI","SI","SI","SI","SI","SI","SI","SI","SI","SI","SI","SI","SI","SI","SI","SI","SI","SI","SI","SI","SI","SI","SI","SI","SI","SI","SI","SI","SI","SI","SI",{"$f":"IF(BO183=BO161,\"SI\",\"NO\")","v":"SI"},"SI","SI","SI","SI","SI","SI","SI","SI","SI","SI","SI","SI","SI","SI","SI","SI","SI","SI","SI","SI","SI","SI","SI","SI","SI","SI","SI","SI","SI","SI","SI","SI","SI","SI","SI","SI","SI","SI","SI","SI","SI","SI","SI","SI","SI","SI","SI","SI","SI","SI","SI","SI","SI","SI","SI","SI","SI","SI","SI","SI","SI","SI","SI",{"$f":"IF(EA183=EA161,\"SI\",\"NO\")","v":"SI"},"SI","SI","SI","SI","SI","SI","SI","SI","SI","SI","SI","SI","SI","SI","SI","SI","SI","SI","SI","SI","SI","SI","SI","SI","SI","SI","SI","SI","SI","SI","SI","SI","SI","SI","SI","SI","SI","SI","SI","SI","SI","SI","SI","SI","SI","SI","SI","SI","SI","SI","SI","SI","SI","SI","SI","SI","SI","SI","SI","SI","SI","SI","SI",{"$f":"IF(GM183=GM161,\"SI\",\"NO\")","v":"SI"},"SI","SI","SI","SI","SI","SI","SI","SI","SI","SI","SI","SI","SI","SI","SI","SI","SI","SI","SI","SI","SI","SI","SI","SI","SI","SI","SI","SI","SI","SI","SI","SI","SI","SI","SI","SI"]
[]
["TUBERCU_03"]
["anno",2024]
["cod_red","03"]
["codmic","(Todas)"]
["cod_prov","(Todas)"]
["coddist","(Todas)"]
["cod_estab","(Todas)"]
["cod_eje","(Todas)"]
[]
[null,"Valores"]
["Etiquetas de fila"," BAS001"," BAS002"," BAS003"," BAS004"," BAS005"," BAS006"," BAS007"," BAS008"," BAS009"," BAS010"," BAS011"," BAS012"," BAS013"," BAS014"," BAS015"," BAS016"," BAS017"," BAS018"," BAS019"," BAS020"," BAS021"," BAS022"," BAS023"," BAS024"," BAS025"," BAS026"," BAS027"," BAS028"," BAS029"," BAS030"," BAS031"," BAS032"," BAS033"," BAS034"," BAS035"," BAS036"," BAS037"," BAS038"," BAS039"," BAS040"," BAS041"," BAS042"," BAS043"," BAS044"," BAS045"," BAS046"," BAS047"," BAS048"," BAS049"," BAS050"," BAS051"," BAS052"," BAS053"," BAS054"," BAS055"," BAS056"," BAS057"," BAS058"," BAS059"," BAS060"," BAS061"," BAS062"," BAS063"," BAS064"," BAS065"," BAS066"," BAS067"," BAS068"," BAS069"," BAS070"," BAS071"," BAS072"," BAS073"," BAS074"," BAS075"," BAS076"," BAS077"," BAS078"," BAS079"," BAS080"," BAS081"," BAS082"," BAS083"," BAS084"," BAS085"," BAS086"," BAS087"," BAS088"," BAS089"," BAS090"," BAS091"," BAS092"," BAS093"," BAS094"," BAS095"," BAS096"," BAS097"," BAS098"," BAS099"," BAS100"," BAS101"," BAS102"," BAS103"," BAS104"," BAS105"," BAS106"," BAS107"," BAS108"," BAS109"," BAS110"," BAS111"," BAS112"," BAS113"," BAS114"," BAS115"," BAS116"," BAS117"," BAS118"," BAS119"," BAS120"," BAS121"," BAS122"," BAS123"," BAS124"," BAS125"," BAS126"," BAS127"," BAS128"," BAS129"," BAS130"," BAS131"," BAS132"," BAS133"," BAS134"," BAS135"," BAS136"," BAS137"," BAS138"," BAS139"," BAS140"," BAS141"," BAS142"," BAS143"," BAS144"," BAS145"," BAS146"," BAS147"," BAS148"," BAS149"," BAS150"," BAS151"," BAS152"," BAS153"," BAS154"," BAS155"," BAS156"," BAS157"," BAS158"," BAS159"," BAS160"," BAS161"," BAS162"," BAS163"," BAS164"," BAS165"," BAS166"," BAS167"," BAS168"," BAS169"," BAS170"," BAS171"," BAS172"," BAS173"," BAS174"," BAS175"," BAS176"," BAS177"," BAS178"," BAS179"," BAS180"," BAS181"," BAS182"," BAS183"," BAS184"," BAS185"," BAS186"," BAS187"," BAS188"," BAS189"," BAS190"," BAS191"," BAS192"," BAS193"," BAS194"," BAS195"," BAS196"," BAS197"," BAS198"," BAS199"," BAS200"," BAS201"," BAS202"," BAS203"," BAS204"," BAS205"," BAS206"," BAS207"," BAS208"," BAS209"," BAS210"," BAS211"," BAS212"," BAS213"," BAS214"," BAS215"," BAS216"," BAS217"," BAS218"," BAS219"," BAS220"," BAS221"," BAS222"," BAS223"," BAS224"," BAS225"," BAS226"," BAS227"," BAS228"," BAS229"," BAS230"]
[1,2,2,2,4,0,1,1,0,0,0,0,0,0,0,0,0,1,0,0,0,0,0,0,0,0,0,0,0,0,0,0,0,0,0,0,0,0,0,0,0,0,0,0,0,0,0,0,0,0,0,0,0,0,0,0,0,0,0,0,0,0,0,0,0,0,0,0,0,0,0,0,0,0,0,0,0,0,0,0,0,0,0,0,0,0,0,0,0,0,0,0,0,0,0,0,0,0,0,0,0,0,0,0,0,0,0,0,0,0,0,0,0,0,0,0,0,0,0,0,0,0,0,0,0,0,0,0,0,0,0,0,0,0,0,0,0,0,0,0,0,0,0,0,0,0,0,0,0,0,0,0,0,0,0,0,0,0,0,0,0,0,0,0,0,0,0,0,0,0,0,0,0,0,0,0,0,0,0,0,0,0,0,0,0,0,0,0,0,0,0,0,0,0,0,0,0,0,0,0,0,0,0,0,0,0,0,0,0,0,0,0,0,0,0,0,0,0,0,0,0,0,0,0,0,0,0,0,0,0,0]
[11,0,0,0,0,0,0,0,0,1,0,0,0,1,0,0,0,24,8,1,0,0,0,0,0,0,0,0,0,0,0,0,0,0,0,0,0,0,0,0,0,0,0,0,0,0,0,0,0,0,0,0,0,0,0,0,0,0,0,0,0,0,0,0,0,0,0,0,0,0,0,0,0,0,0,0,0,0,0,0,0,0,0,0,0,0,0,0,0,0,0,0,0,0,0,0,0,0,0,0,0,0,0,0,0,0,0,0,0,0,0,0,0,0,0,0,0,0,0,0,0,0,0,0,0,0,0,0,0,0,0,0,0,0,0,0,0,0,0,0,0,0,0,0,0,0,0,0,0,0,0,0,0,0,0,0,0,0,0,0,0,0,0,0,0,0,0,0,0,0,0,0,0,0,0,0,0,0,0,0,0,0,0,0,0,0,0,0,0,0,0,0,0,0,0,0,0,0,0,0,0,0,0,0,0,0,0,0,0,0,0,0,0,0,0,0,0,0,0,0,0,0,0,0,0,0,0,0,0,0,0]
[5,6,6,1,2,0,0,0,1,0,0,0,0,0,0,0,0,37,7,0,0,0,0,0,0,0,0,0,0,0,0,0,0,0,0,0,0,0,0,0,0,0,0,0,0,0,0,0,0,0,0,0,0,0,0,0,0,0,0,0,0,0,0,0,0,0,0,0,0,0,0,0,0,0,0,0,0,0,0,0,0,0,0,0,0,0,0,0,0,0,0,0,0,0,0,0,0,0,0,0,0,0,0,0,0,0,0,0,0,0,0,0,0,0,0,0,0,0,0,0,0,0,0,0,0,0,0,0,0,0,0,0,0,0,0,0,0,0,0,0,0,0,0,0,0,0,0,0,0,0,0,0,0,0,0,0,0,0,0,0,0,0,0,0,0,0,0,0,0,0,0,0,0,0,0,0,0,0,0,0,0,0,0,0,0,0,0,0,0,0,0,0,0,0,0,0,0,0,0,0,0,0,0,0,0,0,0,0,0,0,0,0,0,0,0,0,0,0,0,0,0,0,0,0,0,0,0,0,0,0,0]
[2,9,9,1,1,0,0,0,0,0,0,0,0,0,0,0,0,3,0,0,0,0,0,0,0,0,0,0,0,0,0,0,0,0,0,0,0,0,0,0,0,0,0,0,0,0,0,0,0,0,0,0,0,0,0,0,0,0,0,0,0,0,0,0,0,0,0,0,0,0,0,0,0,0,0,0,0,0,0,0,0,0,0,0,0,0,0,0,0,0,0,0,0,0,0,0,0,0,0,0,0,0,0,0,0,0,0,0,0,0,0,0,0,0,0,0,0,0,0,0,0,0,0,0,0,0,0,0,0,0,0,0,0,0,0,0,0,0,0,0,0,0,0,0,0,0,0,0,0,0,0,0,0,0,0,0,0,0,0,0,0,0,0,0,0,0,0,0,0,0,0,0,0,0,0,0,0,0,0,0,0,0,0,0,0,0,0,0,0,0,0,0,0,0,0,0,0,0,0,0,0,0,0,0,0,0,0,0,0,0,0,0,0,0,0,0,0,0,0,0,0,0,0,0,0,0,0,0,0,0,0]
[6,8,6,0,1,0,0,0,0,0,0,0,0,0,0,0,0,24,46,0,2,0,2,0,0,0,0,0,0,0,0,0,0,0,0,0,0,0,0,0,0,0,0,0,0,0,0,0,0,0,0,0,0,0,0,0,0,0,0,0,0,0,0,0,0,0,0,0,0,0,0,0,0,0,0,0,0,0,0,0,0,0,0,0,0,0,0,0,0,0,0,0,0,0,0,0,0,0,0,0,0,0,0,0,0,0,0,0,0,0,0,0,0,0,0,0,0,0,0,0,0,0,0,0,0,0,0,0,0,0,0,0,0,0,0,0,0,0,0,0,0,0,0,0,0,0,0,0,0,0,0,0,0,0,0,0,0,0,0,0,0,0,0,0,0,0,0,0,0,0,0,0,0,0,0,0,0,0,0,0,0,0,0,0,0,0,0,0,0,0,0,0,0,0,0,0,0,0,0,0,0,0,0,0,0,0,0,0,0,0,0,0,0,0,0,0,0,0,0,0,0,0,0,0,0,0,0,0,0,0,0]
[7,0,0,0,0,0,0,0,0,0,0,0,0,0,0,0,0,34,3,0,3,0,3,0,0,0,0,0,0,0,0,0,0,0,0,0,0,0,0,0,0,0,0,0,0,0,0,0,0,0,0,0,0,0,0,0,0,0,0,0,0,0,0,0,0,0,0,0,0,0,0,0,0,0,0,0,0,0,0,0,0,0,0,0,0,0,0,0,0,0,0,0,0,0,0,0,0,0,0,0,0,0,0,0,0,0,0,0,0,0,0,0,0,0,0,0,0,0,0,0,0,0,0,0,0,0,0,0,0,0,0,0,0,0,0,0,0,0,0,0,0,0,0,0,0,0,0,0,0,0,0,0,0,0,0,0,0,0,0,0,0,0,0,0,0,0,0,0,0,0,0,0,0,0,0,0,0,0,0,0,0,0,0,0,0,0,0,0,0,0,0,0,0,0,0,0,0,0,0,0,0,0,0,0,0,0,0,0,0,0,0,0,0,0,0,0,0,0,0,0,0,0,0,0,0,0,0,0,0,0,0]
[8,0,0,0,0,0,0,0,0,0,0,0,0,0,0,0,0,50,58,0,2,0,2,0,0,0,0,0,0,0,0,0,0,0,0,0,0,0,0,0,0,0,0,0,0,0,0,0,0,0,0,0,0,0,0,0,0,0,0,0,0,0,0,0,0,0,0,0,0,0,0,0,0,0,0,0,0,0,0,0,0,0,0,0,0,0,0,0,0,0,0,0,0,0,0,0,0,0,0,0,0,0,0,0,0,0,0,0,0,0,0,0,0,0,0,0,0,0,0,0,0,0,0,0,0,0,0,0,0,0,0,0,0,0,0,0,0,0,0,0,0,0,0,0,0,0,0,0,0,0,0,0,0,0,0,0,0,0,0,0,0,0,0,0,0,0,0,0,0,0,0,0,0,0,0,0,0,0,0,0,0,0,0,0,0,0,0,0,0,0,0,0,0,0,0,0,0,0,0,0,0,0,0,0,0,0,0,0,0,0,0,0,0,0,0,0,0,0,0,0,0,0,0,0,0,0,0,0,0,0,0]
[9,1,0,0,0,0,0,0,0,0,0,0,0,0,0,0,0,36,26,0,0,0,0,0,0,0,0,0,0,0,0,0,0,0,0,0,0,0,0,0,0,0,0,0,0,0,0,0,0,0,0,0,0,0,0,0,0,0,0,0,0,0,0,0,0,0,0,0,0,0,0,0,0,0,0,0,0,0,0,0,0,0,0,0,0,0,0,0,0,0,0,0,0,0,0,0,0,0,0,0,0,0,0,0,0,0,0,0,0,0,0,0,0,0,0,0,0,0,0,0,0,0,0,0,0,0,0,0,0,0,0,0,0,0,0,0,0,0,0,0,0,0,0,0,0,0,0,0,0,0,0,0,0,0,0,0,0,0,0,0,0,0,0,0,0,0,0,0,0,0,0,0,0,0,0,0,0,0,0,0,0,0,0,0,0,0,0,0,0,0,0,0,0,0,0,0,0,0,0,0,0,0,0,0,0,0,0,0,0,0,0,0,0,0,0,0,0,0,0,0,0,0,0,0,0,0,0,0,0,0,0]
[10,1,0,0,0,0,0,0,0,0,0,0,0,0,0,0,0,19,24,0,2,0,2,0,0,0,0,0,0,0,0,0,0,0,0,0,0,0,0,0,0,0,0,0,0,0,0,0,0,0,0,0,0,0,0,0,0,0,0,0,0,0,0,0,0,0,0,0,0,0,0,0,0,0,0,0,0,0,0,0,0,0,0,0,0,0,0,0,0,0,0,0,0,0,0,0,0,0,0,0,0,0,0,0,0,0,0,0,0,0,0,0,0,0,0,0,0,0,0,0,0,0,0,0,0,0,0,0,0,0,0,0,0,0,0,0,0,0,0,0,0,0,0,0,0,0,0,0,0,0,0,0,0,0,0,0,0,0,0,0,0,0,0,0,0,0,0,0,0,0,0,0,0,0,0,0,0,0,0,0,0,0,0,0,0,0,0,0,0,0,0,0,0,0,0,0,0,0,0,0,0,0,0,0,0,0,0,0,0,0,0,0,0,0,0,0,0,0,0,0,0,0,0,0,0,0,0,0,0,0,0]
[4,3,3,3,7,0,0,0,3,0,0,0,0,0,0,0,0,15,5,0,1,0,1,0,0,0,0,0,0,0,0,0,0,0,0,0,0,0,0,0,0,0,0,0,0,0,0,0,0,0,0,0,0,0,0,0,0,0,0,0,0,0,0,0,0,0,0,0,0,0,0,0,0,0,0,0,0,0,0,0,0,0,0,0,0,0,0,0,0,0,0,0,0,0,0,0,0,0,0,0,0,0,0,0,0,0,0,0,0,0,0,0,0,0,0,0,0,0,0,0,0,0,0,0,0,0,0,0,0,0,0,0,0,0,0,0,0,0,0,0,0,0,0,0,0,0,0,0,0,0,0,0,0,0,0,0,0,0,0,0,0,0,0,0,0,0,0,0,0,0,0,0,0,0,0,0,0,0,0,0,0,0,0,0,0,0,0,0,0,0,0,0,0,0,0,0,0,0,0,0,0,0,0,0,0,0,0,0,0,0,0,0,0,0,0,0,0,0,0,0,0,0,0,0,0,0,0,0,0,0,0]
[3,3,0,0,0,0,0,0,1,0,0,0,0,0,0,0,0,3,0,0,0,0,0,0,0,0,0,0,0,0,0,0,0,0,0,0,0,0,0,0,0,0,0,0,0,0,0,0,0,0,0,0,0,0,0,0,0,0,0,0,0,0,0,0,0,0,0,0,0,0,0,0,0,0,0,0,0,0,0,0,0,0,0,0,0,0,0,0,0,0,0,0,0,0,0,0,0,0,0,0,0,0,0,0,0,0,0,0,0,0,0,0,0,0,0,0,0,0,0,0,0,0,0,0,0,0,0,0,0,0,0,0,0,0,0,0,0,0,0,0,0,0,0,0,0,0,0,0,0,0,0,0,0,0,0,0,0,0,0,0,0,0,0,0,0,0,0,0,0,0,0,0,0,0,0,0,0,0,0,0,0,0,0,0,0,0,0,0,0,0,0,0,0,0,0,0,0,0,0,0,0,0,0,0,0,0,0,0,0,0,0,0,0,0,0,0,0,0,0,0,0,0,0,0,0,0,0,0,0,0,0]
["T",33,26,7,15,0,1,1,5,1,0,0,0,1,0,0,0,246,177,1,10,0,10,0,0,0,0,0,0,0,0,0,0,0,0,0,0,0,0,0,0,0,0,0,0,0,0,0,0,0,0,0,0,0,0,0,0,0,0,0,0,0,0,0,0,0,0,0,0,0,0,0,0,0,0,0,0,0,0,0,0,0,0,0,0,0,0,0,0,0,0,0,0,0,0,0,0,0,0,0,0,0,0,0,0,0,0,0,0,0,0,0,0,0,0,0,0,0,0,0,0,0,0,0,0,0,0,0,0,0,0,0,0,0,0,0,0,0,0,0,0,0,0,0,0,0,0,0,0,0,0,0,0,0,0,0,0,0,0,0,0,0,0,0,0,0,0,0,0,0,0,0,0,0,0,0,0,0,0,0,0,0,0,0,0,0,0,0,0,0,0,0,0,0,0,0,0,0,0,0,0,0,0,0,0,0,0,0,0,0,0,0,0,0,0,0,0,0,0,0,0,0,0,0,0,0,0,0,0,0,0]
[]
[]
[]
[]
[]
[]
["TOTAL"]
[{"$f":"COUNT(A197:A213)","v":11},{"$f":"SUM(B197:B213)","v":66},{"$f":"SUM(C197:C213)","v":52},14,30,0,2,2,10,2,0,0,0,2,0,0,0,492,354,2,20,0,20,0,0,0,0,0,0,0,0,0,0,0,0,0,0,0,0,0,0,0,0,0,0,0,0,0,0,0,0,0,0,0,0,0,0,0,0,0,0,0,0,0,0,0,{"$f":"SUM(BO197:BO213)","v":0},0,0,0,0,0,0,0,0,0,0,0,0,0,0,0,0,0,0,0,0,0,0,0,0,0,0,0,0,0,0,0,0,0,0,0,0,0,0,0,0,0,0,0,0,0,0,0,0,0,0,0,0,0,0,0,0,0,0,0,0,0,0,0,{"$f":"SUM(EA197:EA213)","v":0},0,0,0,0,0,0,0,0,0,0,0,0,0,0,0,0,0,0,0,0,0,0,0,0,0,0,0,0,0,0,0,0,0,0,0,0,0,0,0,0,0,0,0,0,0,0,0,0,0,0,0,0,0,0,0,0,0,0,0,0,0,0,0,{"$f":"SUM(GM197:GM213)","v":0},0,0,0,0,0,0,0,0,0,0,0,0,0,0,0,0,0,0,0,0,0,0,0,0,0,0,0,0,0,0,0,0,0,0,0,0]
[{"$f":"CONCATENATE(A197,\"-\",A198,\"-\",A199,\"-\",A200,\"-\",A201,\"-\",A202,\"-\",A203,\"-\",A204,\"-\",A205,\"-\",A206,\"-\",A207,\"-\",A208)","v":"1-11-5-2-6-7-8-9-10-4-3-T"}]
[null," BAS001"," BAS002"," BAS003"," BAS004"," BAS005"," BAS006"," BAS007"," BAS008"," BAS009"," BAS010"," BAS011"," BAS012"," BAS013"," BAS014"," BAS015"," BAS016"," BAS017"," BAS018"," BAS019"," BAS020"," BAS021"," BAS022"," BAS023"," BAS024"," BAS025"," BAS026"," BAS027"," BAS028"," BAS029"," BAS030"," BAS031"," BAS032"," BAS033"," BAS034"," BAS035"," BAS036"," BAS037"," BAS038"," BAS039"," BAS040"," BAS041"," BAS042"," BAS043"," BAS044"," BAS045"," BAS046"," BAS047"," BAS048"," BAS049"," BAS050"," BAS051"," BAS052"," BAS053"," BAS054"," BAS055"," BAS056"," BAS057"," BAS058"," BAS059"," BAS060"," BAS061"," BAS062"," BAS063"," BAS064"," BAS065"," BAS066"," BAS067"," BAS068"," BAS069"," BAS070"," BAS071"," BAS072"," BAS073"," BAS074"," BAS075"," BAS076"," BAS077"," BAS078"," BAS079"," BAS080"," BAS081"," BAS082"," BAS083"," BAS084"," BAS085"," BAS086"," BAS087"," BAS088"," BAS089"," BAS090"," BAS091"," BAS092"," BAS093"," BAS094"," BAS095"," BAS096"," BAS097"," BAS098"," BAS099"," BAS100"," BAS101"," BAS102"," BAS103"," BAS104"," BAS105"," BAS106"," BAS107"," BAS108"," BAS109"," BAS110"," BAS111"," BAS112"," BAS113"," BAS114"," BAS115"," BAS116"," BAS117"," BAS118"," BAS119"," BAS120"," BAS121"," BAS122"," BAS123"," BAS124"," BAS125"," BAS126"," BAS127"," BAS128"," BAS129"," BAS130"," BAS131"," BAS132"," BAS133"," BAS134"," BAS135"," BAS136"," BAS137"," BAS138"," BAS139"," BAS140"," BAS141"," BAS142"," BAS143"," BAS144"," BAS145"," BAS146"," BAS147"," BAS148"," BAS149"," BAS150"," BAS151"," BAS152"," BAS153"," BAS154"," BAS155"," BAS156"," BAS157"," BAS158"," BAS159"," BAS160"," BAS161"," BAS162"," BAS163"," BAS164"," BAS165"," BAS166"," BAS167"," BAS168"," BAS169"," BAS170"," BAS171"," BAS172"," BAS173"," BAS174"," BAS175"," BAS176"," BAS177"," BAS178"," BAS179"," BAS180"," BAS181"," BAS182"," BAS183"," BAS184"," BAS185"," BAS186"," BAS187"," BAS188"," BAS189"," BAS190"," BAS191"," BAS192"," BAS193"," BAS194"," BAS195"," BAS196"," BAS197"," BAS198"," BAS199"," BAS200"," BAS201"," BAS202"," BAS203"," BAS204"," BAS205"," BAS206"," BAS207"," BAS208"," BAS209"," BAS210"," BAS211"," BAS212"," BAS213"," BAS214"," BAS215"," BAS216"," BAS217"," BAS218"," BAS219"," BAS220"," BAS221"," BAS222"," BAS223"," BAS224"," BAS225"," BAS226"," BAS227"," BAS228"," BAS229"," BAS230"]
[null,{"$f":"IF(B218=B196,\"SI\",\"NO\")","v":"SI"},{"$f":"IF(C218=C196,\"SI\",\"NO\")","v":"SI"},"SI","SI","SI","SI","SI","SI","SI","SI","SI","SI","SI","SI","SI","SI","SI","SI","SI","SI","SI","SI","SI","SI","SI","SI","SI","SI","SI","SI","SI","SI","SI","SI","SI","SI","SI","SI","SI","SI","SI","SI","SI","SI","SI","SI","SI","SI","SI","SI","SI","SI","SI","SI","SI","SI","SI","SI","SI","SI","SI","SI","SI","SI","SI",{"$f":"IF(BO218=BO196,\"SI\",\"NO\")","v":"SI"},"SI","SI","SI","SI","SI","SI","SI","SI","SI","SI","SI","SI","SI","SI","SI","SI","SI","SI","SI","SI","SI","SI","SI","SI","SI","SI","SI","SI","SI","SI","SI","SI","SI","SI","SI","SI","SI","SI","SI","SI","SI","SI","SI","SI","SI","SI","SI","SI","SI","SI","SI","SI","SI","SI","SI","SI","SI","SI","SI","SI","SI","SI","SI",{"$f":"IF(EA218=EA196,\"SI\",\"NO\")","v":"SI"},"SI","SI","SI","SI","SI","SI","SI","SI","SI","SI","SI","SI","SI","SI","SI","SI","SI","SI","SI","SI","SI","SI","SI","SI","SI","SI","SI","SI","SI","SI","SI","SI","SI","SI","SI","SI","SI","SI","SI","SI","SI","SI","SI","SI","SI","SI","SI","SI","SI","SI","SI","SI","SI","SI","SI","SI","SI","SI","SI","SI","SI","SI","SI",{"$f":"IF(GM218=GM196,\"SI\",\"NO\")","v":"SI"},"SI","SI","SI","SI","SI","SI","SI","SI","SI","SI","SI","SI","SI","SI","SI","SI","SI","SI","SI","SI","SI","SI","SI","SI","SI","SI","SI","SI","SI","SI","SI","SI","SI","SI","SI","SI"]
[]
["LABORATORIO 01"]
["anno",2024]
["cod_red","03"]
["codmic","(Todas)"]
["cod_prov","(Todas)"]
["coddist","(Todas)"]
["cod_estab","(Todas)"]
["cod_eje","(Todas)"]
[]
[null,"Valores"]
["Etiquetas de fila"," BAS001"," BAS002"," BAS003"," BAS004"," BAS005"," BAS006"," BAS007"," BAS008"," BAS009"," BAS010"," BAS011"," BAS012"," BAS013"," BAS014"," BAS015"," BAS016"," BAS017"," BAS018"," BAS019"," BAS020"," BAS021"," BAS022"," BAS023"," BAS024"," BAS025"," BAS026"," BAS027"," BAS028"," BAS029"," BAS030"," BAS031"," BAS032"," BAS033"," BAS034"," BAS035"," BAS036"," BAS037"," BAS038"," BAS039"," BAS040"," BAS041"," BAS042"," BAS043"," BAS044"," BAS045"," BAS046"," BAS047"," BAS048"," BAS049"," BAS050"," BAS051"," BAS052"," BAS053"," BAS054"," BAS055"," BAS056"," BAS057"," BAS058"," BAS059"," BAS060"," BAS061"," BAS062"," BAS063"," BAS064"," BAS065"," BAS066"," BAS067"," BAS068"," BAS069"," BAS070"," BAS071"," BAS072"," BAS073"," BAS074"," BAS075"," BAS076"," BAS077"," BAS078"," BAS079"," BAS080"," BAS081"," BAS082"," BAS083"," BAS084"," BAS085"," BAS086"," BAS087"," BAS088"," BAS089"," BAS090"," BAS091"," BAS092"," BAS093"," BAS094"," BAS095"," BAS096"," BAS097"," BAS098"," BAS099"," BAS100"," BAS101"," BAS102"," BAS103"," BAS104"," BAS105"," BAS106"," BAS107"," BAS108"," BAS109"," BAS110"," BAS111"," BAS112"," BAS113"," BAS114"," BAS115"," BAS116"," BAS117"," BAS118"," BAS119"," BAS120"," BAS121"," BAS122"," BAS123"," BAS124"," BAS125"," BAS126"," BAS127"," BAS128"," BAS129"," BAS130"," BAS131"," BAS132"," BAS133"," BAS134"," BAS135"," BAS136"," BAS137"," BAS138"," BAS139"," BAS140"," BAS141"," BAS142"," BAS143"," BAS144"," BAS145"," BAS146"," BAS147"," BAS148"," BAS149"," BAS150"," BAS151"," BAS152"," BAS153"," BAS154"," BAS155"," BAS156"," BAS157"," BAS158"," BAS159"," BAS160"," BAS161"," BAS162"," BAS163"," BAS164"," BAS165"," BAS166"," BAS167"," BAS168"," BAS169"," BAS170"," BAS171"," BAS172"," BAS173"," BAS174"," BAS175"," BAS176"," BAS177"," BAS178"," BAS179"," BAS180"," BAS181"," BAS182"," bas183"," bas184"," bas185"," bas186"," bas187"," bas188"," bas189"," bas190"," bas191"," bas192"," bas193"," bas194"," bas195"," bas196"," bas197"," bas198"," bas199"," bas200"," bas201"," bas202"," bas203"," bas204"," bas205"," bas206"," bas207"," bas208"," bas209"," bas210"," bas211"," bas212"," bas213"," bas214"," bas215"," bas216"," bas217"," bas218"," bas219"," bas220"," bas221"," bas222"," bas223"," bas224"," bas225"," bas226"," bas227"," bas228"," bas229"," bas230"]
[3,0,0,0,0,0,0,0,0,0,0,0,0,0,0,0,0,0,0,0,0,0,0,0,0,0,0,0,0,0,0,0,0,0,0,0,0,0,0,0,0,0,0,0,0,0,0,0,0,0,0,0,0,0,0,0,0,0,0,0,0,0,0,0,0,0,0,0,0,0,0,0,0,0,0,0,0,0,0,0,0,0,0,0,0,0,0,0,0,0,0,0,0,0,0,0,0,0,0,0,0,0,0,0,0,0,0,0,0,0,0,0,0,0,0,0,0,0,0,0,0,0,0,0,0,0,0,0,0,0,0,0,0,0,0,0,0,0,0,0,0,0,0,0,0,0,0,0,0,0,0,0,0,0,0,0,0,0,0,0,0,0,0,0,0,0,0,0,0,0,0,0,0,0,0,0,0,0,0,0,0,0,0,0,0,0,0,0,0,0,0,0,0,0,0,0,0,0,0,0,0,0,0,0,0,0,0,0,0,0,0,0,0,0,0,0,0,0,0,0,0,0,0,0,0,0,0,0,0,0,0]
[1,0,0,0,0,0,0,0,0,0,0,0,0,0,0,0,0,0,0,0,0,0,0,0,0,0,0,0,0,0,0,0,0,0,0,0,0,0,0,0,0,0,0,0,0,0,0,0,0,0,0,0,0,0,0,0,0,0,0,0,0,0,0,0,0,0,0,0,0,0,0,0,0,0,0,0,0,0,0,0,0,0,0,0,0,0,0,0,0,0,0,0,0,0,0,0,0,0,0,0,0,0,0,0,0,0,0,0,0,0,0,0,0,0,0,0,0,0,0,0,0,0,0,0,0,0,0,0,0,0,0,0,0,0,0,0,0,0,0,0,0,0,0,0,0,0,0,0,0,0,0,0,0,0,0,0,0,0,0,0,0,0,0,0,0,0,0,0,0,0,0,0,0,0,0,0,0,0,0,0,0,0,0,0,0,0,0,0,0,0,0,0,0,0,0,0,0,0,0,0,0,0,0,0,0,0,0,0,0,0,0,0,0,0,0,0,0,0,0,0,0,0,0,0,0,0,0,0,0,0,0]
[2,0,0,0,0,0,0,0,0,0,0,0,0,0,0,0,0,0,0,0,0,0,0,0,0,0,0,0,0,0,0,0,0,0,0,0,0,0,0,0,0,0,0,0,0,0,0,0,0,0,0,0,0,0,0,0,0,0,0,0,0,0,0,0,0,0,0,0,0,0,0,0,0,0,0,0,0,0,0,0,0,0,0,0,0,0,0,0,0,0,0,0,0,0,0,0,0,0,0,0,0,0,0,0,0,0,0,0,0,0,0,0,0,0,0,0,0,0,0,0,0,0,0,0,0,0,0,0,0,0,0,0,0,0,0,0,0,0,0,0,0,0,0,0,0,0,0,0,0,0,0,0,0,0,0,0,0,0,0,0,0,0,0,0,0,0,0,0,0,0,0,0,0,0,0,0,0,0,0,0,0,0,0,0,0,0,0,0,0,0,0,0,0,0,0,0,0,0,0,0,0,0,0,0,0,0,0,0,0,0,0,0,0,0,0,0,0,0,0,0,0,0,0,0,0,0,0,0,0,0,0]
[4,0,0,0,0,0,0,0,0,0,0,0,0,0,0,0,0,0,0,0,0,0,0,0,0,0,0,0,0,0,0,0,0,0,0,0,0,0,0,0,0,0,0,0,0,0,0,0,0,0,0,0,0,0,0,0,0,0,0,0,0,0,0,0,0,0,0,0,0,0,0,0,0,0,0,0,0,0,0,0,0,0,0,0,0,0,0,0,0,0,0,0,0,0,0,0,0,0,0,0,0,0,0,0,0,0,0,0,0,0,0,0,0,0,0,0,0,0,0,0,0,0,0,0,0,0,0,0,0,0,0,0,0,0,0,0,0,0,0,0,0,0,0,0,0,0,0,0,0,0,0,0,0,0,0,0,0,0,0,0,0,0,0,0,0,0,0,0,0,0,0,0,0,0,0,0,0,0,0,0,0,0,0,0,0,0,0,0,0,0,0,0,0,0,0,0,0,0,0,0,0,0,0,0,0,0,0,0,0,0,0,0,0,0,0,0,0,0,0,0,0,0,0,0,0,0,0,0,0,0,0]
[5,0,0,0,0,0,0,0,0,0,0,0,0,0,0,0,0,0,0,0,0,0,0,0,0,0,0,0,0,0,0,0,0,0,0,0,0,0,0,0,0,0,0,0,0,0,0,0,0,0,0,0,0,0,0,0,0,0,0,0,0,0,0,0,0,0,0,0,0,0,0,0,0,0,0,0,0,0,0,0,0,0,0,0,0,0,0,0,0,0,0,0,0,0,0,0,0,0,0,0,0,0,0,0,0,0,0,0,0,0,0,0,0,0,0,0,0,0,0,0,0,0,0,0,0,0,0,0,0,0,0,0,0,0,0,0,0,0,0,0,0,0,0,0,0,0,0,0,0,0,0,0,0,0,0,0,0,0,0,0,0,0,0,0,0,0,0,0,0,0,0,0,0,0,0,0,0,0,0,0,0,0,0,0,0,0,0,0,0,0,0,0,0,0,0,0,0,0,0,0,0,0,0,0,0,0,0,0,0,0,0,0,0,0,0,0,0,0,0,0,0,0,0,0,0,0,0,0,0,0,0]
[11,0,0,0,0,0,0,0,0,0,0,0,0,0,0,0,0,0,0,0,0,0,0,0,0,0,0,0,0,0,0,0,0,0,0,0,0,0,0,0,0,0,0,0,0,0,0,0,0,0,0,0,0,0,0,0,0,0,0,0,0,0,0,0,0,0,0,0,0,0,0,0,0,0,0,0,0,0,0,0,0,0,0,0,0,0,0,0,0,0,0,0,0,0,0,0,0,0,0,0,0,0,0,0,0,0,0,0,0,0,0,0,0,0,0,0,0,0,0,0,0,0,0,0,0,0,0,0,0,0,0,0,0,0,0,0,0,0,0,0,0,0,0,0,0,0,0,0,0,0,0,0,0,0,0,0,0,0,0,0,0,0,0,0,0,0,0,0,0,0,0,0,0,0,0,0,0,0,0,0,0,0,0,0,0,0,0,0,0,0,0,0,0,0,0,0,0,0,0,0,0,0,0,0,0,0,0,0,0,0,0,0,0,0,0,0,0,0,0,0,0,0,0,0,0,0,0,0,0,0,0]
[10,0,0,0,0,0,0,0,0,0,0,0,0,0,0,0,0,0,0,0,0,0,0,0,0,0,0,0,0,0,0,0,0,0,0,0,0,0,0,0,0,0,0,0,0,0,0,0,0,0,0,0,0,0,0,0,0,0,0,0,0,0,0,0,0,0,0,0,0,0,0,0,0,0,0,0,0,0,0,0,0,0,0,0,0,0,0,0,0,0,0,0,0,0,0,0,0,0,0,0,0,0,0,0,0,0,0,0,0,0,0,0,0,0,0,0,0,0,0,0,0,0,0,0,0,0,0,0,0,0,0,0,0,0,0,0,0,0,0,0,0,0,0,0,0,0,0,0,0,0,0,0,0,0,0,0,0,0,0,0,0,0,0,0,0,0,0,0,0,0,0,0,0,0,0,0,0,0,0,0,0,0,0,0,0,0,0,0,0,0,0,0,0,0,0,0,0,0,0,0,0,0,0,0,0,0,0,0,0,0,0,0,0,0,0,0,0,0,0,0,0,0,0,0,0,0,0,0,0,0,0]
[9,0,0,0,0,0,0,0,0,0,0,0,0,0,0,0,0,0,0,0,0,0,0,0,0,0,0,0,0,0,0,0,0,0,0,0,0,0,0,0,0,0,0,0,0,0,0,0,0,0,0,0,0,0,0,0,0,0,0,0,0,0,0,0,0,0,0,0,0,0,0,0,0,0,0,0,0,0,0,0,0,0,0,0,0,0,0,0,0,0,0,0,0,0,0,0,0,0,0,0,0,0,0,0,0,0,0,0,0,0,0,0,0,0,0,0,0,0,0,0,0,0,0,0,0,0,0,0,0,0,0,0,0,0,0,0,0,0,0,0,0,0,0,0,0,0,0,0,0,0,0,0,0,0,0,0,0,0,0,0,0,0,0,0,0,0,0,0,0,0,0,0,0,0,0,0,0,0,0,0,0,0,0,0,0,0,0,0,0,0,0,0,0,0,0,0,0,0,0,0,0,0,0,0,0,0,0,0,0,0,0,0,0,0,0,0,0,0,0,0,0,0,0,0,0,0,0,0,0,0,0]
[8,0,0,0,0,0,0,0,0,0,0,0,0,0,0,0,0,0,0,0,0,0,0,0,0,0,0,0,0,0,0,0,0,0,0,0,0,0,0,0,0,0,0,0,0,0,0,0,0,0,0,0,0,0,0,0,0,0,0,0,0,0,0,0,0,0,0,0,0,0,0,0,0,0,0,0,0,0,0,0,0,0,0,0,0,0,0,0,0,0,0,0,0,0,0,0,0,0,0,0,0,0,0,0,0,0,0,0,0,0,0,0,0,0,0,0,0,0,0,0,0,0,0,0,0,0,0,0,0,0,0,0,0,0,0,0,0,0,0,0,0,0,0,0,0,0,0,0,0,0,0,0,0,0,0,0,0,0,0,0,0,0,0,0,0,0,0,0,0,0,0,0,0,0,0,0,0,0,0,0,0,0,0,0,0,0,0,0,0,0,0,0,0,0,0,0,0,0,0,0,0,0,0,0,0,0,0,0,0,0,0,0,0,0,0,0,0,0,0,0,0,0,0,0,0,0,0,0,0,0,0]
[7,0,0,0,0,0,0,0,0,0,0,0,0,0,0,0,0,0,0,0,0,0,0,0,0,0,0,0,0,0,0,0,0,0,0,0,0,0,0,0,0,0,0,0,0,0,0,0,0,0,0,0,0,0,0,0,0,0,0,0,0,0,0,0,0,0,0,0,0,0,0,0,0,0,0,0,0,0,0,0,0,0,0,0,0,0,0,0,0,0,0,0,0,0,0,0,0,0,0,0,0,0,0,0,0,0,0,0,0,0,0,0,0,0,0,0,0,0,0,0,0,0,0,0,0,0,0,0,0,0,0,0,0,0,0,0,0,0,0,0,0,0,0,0,0,0,0,0,0,0,0,0,0,0,0,0,0,0,0,0,0,0,0,0,0,0,0,0,0,0,0,0,0,0,0,0,0,0,0,0,0,0,0,0,0,0,0,0,0,0,0,0,0,0,0,0,0,0,0,0,0,0,0,0,0,0,0,0,0,0,0,0,0,0,0,0,0,0,0,0,0,0,0,0,0,0,0,0,0,0,0]
[6,0,0,0,0,0,0,0,0,0,0,0,0,0,0,0,0,0,0,0,0,0,0,0,0,0,0,0,0,0,0,0,0,0,0,0,0,0,0,0,0,0,0,0,0,0,0,0,0,0,0,0,0,0,0,0,0,0,0,0,0,0,0,0,0,0,0,0,0,0,0,0,0,0,0,0,0,0,0,0,0,0,0,0,0,0,0,0,0,0,0,0,0,0,0,0,0,0,0,0,0,0,0,0,0,0,0,0,0,0,0,0,0,0,0,0,0,0,0,0,0,0,0,0,0,0,0,0,0,0,0,0,0,0,0,0,0,0,0,0,0,0,0,0,0,0,0,0,0,0,0,0,0,0,0,0,0,0,0,0,0,0,0,0,0,0,0,0,0,0,0,0,0,0,0,0,0,0,0,0,0,0,0,0,0,0,0,0,0,0,0,0,0,0,0,0,0,0,0,0,0,0,0,0,0,0,0,0,0,0,0,0,0,0,0,0,0,0,0,0,0,0,0,0,0,0,0,0,0,0,0]
["T",0,0,0,0,0,0,0,0,0,0,0,0,0,0,0,0,0,0,0,0,0,0,0,0,0,0,0,0,0,0,0,0,0,0,0,0,0,0,0,0,0,0,0,0,0,0,0,0,0,0,0,0,0,0,0,0,0,0,0,0,0,0,0,0,0,0,0,0,0,0,0,0,0,0,0,0,0,0,0,0,0,0,0,0,0,0,0,0,0,0,0,0,0,0,0,0,0,0,0,0,0,0,0,0,0,0,0,0,0,0,0,0,0,0,0,0,0,0,0,0,0,0,0,0,0,0,0,0,0,0,0,0,0,0,0,0,0,0,0,0,0,0,0,0,0,0,0,0,0,0,0,0,0,0,0,0,0,0,0,0,0,0,0,0,0,0,0,0,0,0,0,0,0,0,0,0,0,0,0,0,0,0,0,0,0,0,0,0,0,0,0,0,0,0,0,0,0,0,0,0,0,0,0,0,0,0,0,0,0,0,0,0,0,0,0,0,0,0,0,0,0,0,0,0,0,0,0,0,0,0]
[]
[]
[]
[]
[]
["TOTAL"]
[{"$f":"COUNT(A232:A247)","v":11},{"$f":"SUM(B232:B247)","v":0},{"$f":"SUM(C232:C247)","v":0},0,0,0,0,0,0,0,0,0,0,0,0,0,0,0,0,0,0,0,0,0,0,0,0,0,0,0,0,0,0,0,0,0,0,0,0,0,0,0,0,0,0,0,0,0,0,0,0,0,0,0,0,0,0,0,0,0,0,0,0,0,0,0,{"$f":"SUM(BO232:BO247)","v":0},0,0,0,0,0,0,0,0,0,0,0,0,0,0,0,0,0,0,0,0,0,0,0,0,0,0,0,0,0,0,0,0,0,0,0,0,0,0,0,0,0,0,0,0,0,0,0,0,0,0,0,0,0,0,0,0,0,0,0,0,0,0,0,{"$f":"SUM(EA232:EA247)","v":0},0,0,0,0,0,0,0,0,0,0,0,0,0,0,0,0,0,0,0,0,0,0,0,0,0,0,0,0,0,0,0,0,0,0,0,0,0,0,0,0,0,0,0,0,0,0,0,0,0,0,0,0,0,0,0,0,0,0,0,0,0,0,0,{"$f":"SUM(GM232:GM247)","v":0},0,0,0,0,0,0,0,0,0,0,0,0,0]
[{"$f":"CONCATENATE(A232,\"-\",A233,\"-\",A234,\"-\",A235,\"-\",A236,\"-\",A237,\"-\",A238,\"-\",A239,\"-\",A240,\"-\",A241,\"-\",A242,\"-\",A243)","v":"3-1-2-4-5-11-10-9-8-7-6-T"}]
[]
[null," BAS001"," BAS002"," BAS003"," BAS004"," BAS005"," BAS006"," BAS007"," BAS008"," BAS009"," BAS010"," BAS011"," BAS012"," BAS013"," BAS014"," BAS015"," BAS016"," BAS017"," BAS018"," BAS019"," BAS020"," BAS021"," BAS022"," BAS023"," BAS024"," BAS025"," BAS026"," BAS027"," BAS028"," BAS029"," BAS030"," BAS031"," BAS032"," BAS033"," BAS034"," BAS035"," BAS036"," BAS037"," BAS038"," BAS039"," BAS040"," BAS041"," BAS042"," BAS043"," BAS044"," BAS045"," BAS046"," BAS047"," BAS048"," BAS049"," BAS050"," BAS051"," BAS052"," BAS053"," BAS054"," BAS055"," BAS056"," BAS057"," BAS058"," BAS059"," BAS060"," BAS061"," BAS062"," BAS063"," BAS064"," BAS065"," BAS066"," BAS067"," BAS068"," BAS069"," BAS070"," BAS071"," BAS072"," BAS073"," BAS074"," BAS075"," BAS076"," BAS077"," BAS078"," BAS079"," BAS080"," BAS081"," BAS082"," BAS083"," BAS084"," BAS085"," BAS086"," BAS087"," BAS088"," BAS089"," BAS090"," BAS091"," BAS092"," BAS093"," BAS094"," BAS095"," BAS096"," BAS097"," BAS098"," BAS099"," BAS100"," BAS101"," BAS102"," BAS103"," BAS104"," BAS105"," BAS106"," BAS107"," BAS108"," BAS109"," BAS110"," BAS111"," BAS112"," BAS113"," BAS114"," BAS115"," BAS116"," BAS117"," BAS118"," BAS119"," BAS120"," BAS121"," BAS122"," BAS123"," BAS124"," BAS125"," BAS126"," BAS127"," BAS128"," BAS129"," BAS130"," BAS131"," BAS132"," BAS133"," BAS134"," BAS135"," BAS136"," BAS137"," BAS138"," BAS139"," BAS140"," BAS141"," BAS142"," BAS143"," BAS144"," BAS145"," BAS146"," BAS147"," BAS148"," BAS149"," BAS150"," BAS151"," BAS152"," BAS153"," BAS154"," BAS155"," BAS156"," BAS157"," BAS158"," BAS159"," BAS160"," BAS161"," BAS162"," BAS163"," BAS164"," BAS165"," BAS166"," BAS167"," BAS168"," BAS169"," BAS170"," BAS171"," BAS172"," BAS173"," BAS174"," BAS175"," BAS176"," BAS177"," BAS178"," BAS179"," BAS180"," BAS181"," BAS182"," BAS183"," BAS184"," BAS185"," BAS186"," BAS187"," BAS188"," BAS189"," BAS190"," BAS191"," BAS192"," BAS193"," BAS194"," BAS195"," BAS196"," BAS197"," BAS198"," BAS199"," BAS200"," BAS201"," BAS202"," BAS203"," BAS204"," BAS205"," BAS206"," BAS207"," BAS208"," BAS209"," BAS210"," BAS211"," BAS212"," BAS213"," BAS214"," BAS215"," BAS216"," BAS217"," BAS218"," BAS219"," BAS220"," BAS221"," BAS222"," BAS223"," BAS224"," BAS225"," BAS226"," BAS227"," BAS228"," BAS229"," BAS230"]
[null,{"$f":"IF(B253=B231,\"SI\",\"NO\")","v":"SI"},{"$f":"IF(C253=C231,\"SI\",\"NO\")","v":"SI"},"SI","SI","SI","SI","SI","SI","SI","SI","SI","SI","SI","SI","SI","SI","SI","SI","SI","SI","SI","SI","SI","SI","SI","SI","SI","SI","SI","SI","SI","SI","SI","SI","SI","SI","SI","SI","SI","SI","SI","SI","SI","SI","SI","SI","SI","SI","SI","SI","SI","SI","SI","SI","SI","SI","SI","SI","SI","SI","SI","SI","SI","SI","SI",{"$f":"IF(BO253=BO231,\"SI\",\"NO\")","v":"SI"},"SI","SI","SI","SI","SI","SI","SI","SI","SI","SI","SI","SI","SI","SI","SI","SI","SI","SI","SI","SI","SI","SI","SI","SI","SI","SI","SI","SI","SI","SI","SI","SI","SI","SI","SI","SI","SI","SI","SI","SI","SI","SI","SI","SI","SI","SI","SI","SI","SI","SI","SI","SI","SI","SI","SI","SI","SI","SI","SI","SI","SI","SI","SI",{"$f":"IF(EA253=EA231,\"SI\",\"NO\")","v":"SI"},"SI","SI","SI","SI","SI","SI","SI","SI","SI","SI","SI","SI","SI","SI","SI","SI","SI","SI","SI","SI","SI","SI","SI","SI","SI","SI","SI","SI","SI","SI","SI","SI","SI","SI","SI","SI","SI","SI","SI","SI","SI","SI","SI","SI","SI","SI","SI","SI","SI","SI","SI","SI","SI","SI","SI","SI","SI","SI","SI","SI","SI","SI","SI",{"$f":"IF(GM253=GM231,\"SI\",\"NO\")","v":"SI"},"SI","SI","SI","SI","SI","SI","SI","SI","SI","SI","SI","SI","SI","SI","SI","SI","SI","SI","SI","SI","SI","SI","SI","SI","SI","SI","SI","SI","SI","SI","SI","SI","SI","SI","SI","SI"]
[]
[]
["POBLACION GENERAL"]
["anno","2024"]
["cod_red","03"]
["codmic","(Todas)"]
["cod_prov","(Todas)"]
["coddist","(Todas)"]
["cod_estab","(Todas)"]
["cod_eje","(Todas)"]
[]
["Valores"]
["Suma de total","Suma de emay15"]
[]
[]
[]
[]
["TBC_NEW"]
["ANNO",2024]
["cod_red","03"]
["codmic","(Todas)"]
["cod_prov","(Todas)"]
["coddist","(Todas)"]
["cod_estab","(Todas)"]
["cod_eje","(Todas)"]
[]
[null,"Valores"]
["Etiquetas de fila"," BAS001"," BAS002"," BAS003"," BAS004"," BAS005"," BAS006"," BAS007"," BAS008"," BAS009"," BAS010"," BAS011"," BAS012"," BAS013"," BAS014"," BAS015"," BAS016"," BAS017"," BAS018"," BAS019"," BAS020"," BAS021"," BAS022"," BAS023"," BAS024"," BAS025"," BAS026"," BAS027"," BAS028"," BAS029"," BAS030"," BAS031"," BAS032"," BAS033"," BAS034"," BAS035"," BAS036"," BAS037"," BAS038"," BAS039"," BAS040"," BAS041"," BAS042"," BAS043"," BAS044"," BAS045"," BAS046"," BAS047"," BAS048"," BAS049"," BAS050"," BAS051"," BAS052"," BAS053"," BAS054"," BAS055"," BAS056"," BAS057"," BAS058"," BAS059"," BAS060"," BAS061"," BAS062"," BAS063"," BAS064"," BAS065"," BAS066"," BAS067"," BAS068"," BAS069"," BAS070"," BAS071"," BAS072"," BAS073"," BAS074"," BAS075"," BAS076"," BAS077"," BAS078"," BAS079"," BAS080"," BAS081"," BAS082"," BAS083"," BAS084"," BAS085"," BAS086"," BAS087"," BAS088"," BAS089"," BAS090"," BAS091"," BAS092"," BAS093"," BAS094"," BAS095"," BAS096"," BAS097"," BAS098"," BAS099"," BAS100"," BAS101"," BAS102"," BAS103"," BAS104"," BAS105"," BAS106"," BAS107"," BAS108"," BAS109"," BAS110"," BAS111"," BAS112"," BAS113"," BAS114"," BAS115"," BAS116"," BAS117"," BAS118"," BAS119"," BAS120"," BAS121"," BAS122"," BAS123"," BAS124"," BAS125"," BAS126"," BAS127"," BAS128"," BAS129"," BAS130"," BAS131"," BAS132"," BAS133"," BAS134"," BAS135"," BAS136"," BAS137"," BAS138"," BAS139"," BAS140"," BAS141"," BAS142"," BAS143"," BAS144"," BAS145"," BAS146"," BAS147"," BAS148"," BAS149"," BAS150"," BAS151"," BAS152"," BAS153"," BAS154"," BAS155"," BAS156"," BAS157"," BAS158"," BAS159"," BAS160"," BAS161"," BAS162"," BAS163"," BAS164"," BAS165"," BAS166"," BAS167"," BAS168"," BAS169"," BAS170"," BAS171"," BAS172"," BAS173"," BAS174"," BAS175"," BAS176"," BAS177"," BAS178"," BAS179"," BAS180"," BAS181"," BAS182"," BAS183"," BAS184"," BAS185"," BAS186"," BAS187"," BAS188"," BAS189"," BAS190"," BAS191"," BAS192"," BAS193"," BAS194"," BAS195"," BAS196"," BAS197"," BAS198"," BAS199"," BAS200"," BAS201"," BAS202"," BAS203"," BAS204"," BAS205"," BAS206"," BAS207"," BAS208"," BAS209"," BAS210"," BAS211"," BAS212"," BAS213"," BAS214"," BAS215"," BAS216"," BAS217"," BAS218"," BAS219"," BAS220"," BAS221"," BAS222"," BAS223"," BAS224"," BAS225"," BAS226"," BAS227"," BAS228"," BAS229"," BAS230"]
[1,0,0,0,0,0,0,0,0,0,0,0,0,0,1,0,0,0,0,0,0,0,0,0,0,0,0,0,0,0,0,0,0,0,0,0,0,0,0,23,0,0,0,0,0,0,0,0,0,0,0,0,0,0,0,0,0,0,0,0,0,0,0,0,0,0,0,0,0,0,0,0,0,0,0,0,0,0,0,0,0,0,0,0,23,0,0,0,0,0,0,0,0,0,0,0,0,0,0,0,0,0,0,0,0,0,0,0,0,0,0,0,0,0,0,0,0,0,0,0,0,0,0,0,0,0,0,0,0,0,0,0,0,0,0,0,0,0,0,0,0,0,0,0,0,0,0,0,0,0,0,0,0,0,0,0,0,0,0,0,0,0,0,0,0,0,0,0,0,0,0,0,0,0,0,0,0,0,0,0,0,0,0,0,0,0,0,0,0,0,0,0,0,0,0,0,0,0,0,0,0,0,0,0,0,0,0,0,0,0,0,0,0,0,0,0,0,0,0,0,0,0,0,0,0,0,0,0,0,0,0]
[2,0,0,0,0,0,0,0,0,0,0,0,0,0,8,0,0,0,0,0,0,0,0,0,0,0,0,0,0,1,0,0,0,1,0,0,0,0,0,21,0,0,0,0,0,0,0,0,0,0,0,0,0,0,0,0,0,0,0,0,0,0,0,0,0,0,0,0,0,0,0,0,0,0,0,0,0,0,0,0,0,0,0,0,21,0,0,0,0,0,0,0,0,0,0,0,0,0,0,0,0,0,0,0,0,0,0,0,0,0,0,0,0,0,0,0,0,0,0,0,0,0,0,0,0,0,0,0,0,0,0,0,0,0,0,0,0,0,0,0,0,0,0,0,0,0,0,0,0,0,0,0,0,0,0,0,0,0,0,0,0,0,0,0,0,0,0,0,0,0,0,0,0,0,0,0,0,0,0,0,0,0,0,0,0,0,0,0,0,0,0,0,0,0,0,0,0,0,0,0,0,0,0,0,0,0,0,0,0,0,0,0,0,0,0,0,0,0,0,0,0,0,0,0,0,0,0,0,0,0,0]
[3,0,0,0,0,0,0,0,0,0,0,0,0,0,1,0,0,0,0,0,0,0,0,0,0,0,0,0,0,0,0,0,0,0,0,0,0,0,0,22,0,0,0,0,0,0,0,0,0,0,0,0,0,0,0,0,0,0,0,0,0,0,0,0,0,0,0,0,0,0,0,0,0,0,0,0,0,0,0,0,0,0,0,0,22,0,0,0,0,0,0,0,0,0,0,0,0,0,0,0,0,0,0,0,0,0,0,0,0,0,0,0,0,0,0,0,0,0,0,0,0,0,0,0,0,0,0,0,0,0,0,0,0,0,0,0,0,0,0,0,0,0,0,0,0,0,0,0,0,0,0,0,0,0,0,0,0,0,0,0,0,0,0,0,0,0,0,0,0,0,0,0,0,0,0,0,0,0,0,0,0,0,0,0,0,0,0,0,0,0,0,0,0,0,0,0,0,0,0,0,0,0,0,0,0,0,0,0,0,0,0,0,0,0,0,0,0,0,0,0,0,0,0,0,0,0,0,0,0,0,0]
[4,0,0,0,0,0,0,0,0,0,0,0,0,0,1,0,0,0,0,0,0,0,0,0,0,0,0,0,1,0,0,0,0,0,0,0,0,0,0,28,0,1,0,0,0,0,0,0,0,0,0,0,0,0,0,0,0,0,0,0,0,0,0,0,0,0,0,0,0,0,0,0,0,0,0,0,0,0,0,0,0,0,0,0,42,0,0,0,0,0,0,0,0,0,0,0,0,0,0,0,0,0,0,0,0,0,0,0,0,0,0,0,0,0,0,0,0,0,0,0,0,0,0,0,0,0,0,0,0,0,0,0,0,0,0,0,0,0,0,0,0,0,0,0,0,0,0,0,0,0,0,0,0,0,0,0,0,0,0,0,0,0,0,0,0,0,0,0,0,0,0,0,0,0,0,0,0,0,0,0,0,0,0,0,0,0,0,0,0,0,0,0,0,0,0,0,0,0,0,0,0,0,0,0,0,0,0,0,0,0,0,0,0,0,0,0,0,0,0,0,0,0,0,0,0,0,0,0,0,0,0]
[5,57,0,0,0,0,0,0,0,0,0,0,0,0,4,0,0,0,0,0,0,0,0,0,0,0,0,0,0,0,0,0,0,0,0,4,0,0,0,17,0,0,0,1,0,0,0,0,0,0,0,0,0,0,0,0,0,0,0,0,0,0,0,0,0,0,0,0,0,0,0,0,0,0,0,0,0,0,0,0,0,0,0,0,19,0,0,0,0,0,0,0,0,0,0,0,0,0,0,0,0,0,0,0,0,0,0,0,0,0,0,0,0,0,0,0,0,0,0,0,0,0,0,0,0,0,0,0,0,0,0,0,0,0,0,0,0,0,0,0,0,0,0,0,0,0,0,0,0,0,0,0,0,0,0,0,0,0,0,0,0,0,0,0,0,0,0,0,0,0,0,0,0,0,0,0,0,0,0,0,0,0,0,0,0,0,0,0,0,0,0,0,0,0,0,0,0,0,0,0,0,0,0,0,0,0,0,0,0,0,0,0,0,0,0,0,0,0,0,0,0,0,0,0,0,0,0,0,0,0,0]
[9,1062,0,0,1,0,0,0,0,1,1,0,0,0,2,0,6,0,0,0,0,0,0,0,4,0,0,0,538,70,24,0,0,2,0,9,0,0,0,82,0,53,0,71,0,0,0,0,27,0,11,0,0,0,0,0,1,19,0,17,0,0,0,0,0,0,0,0,0,0,0,0,0,0,0,0,0,0,0,0,0,0,0,0,82,0,12,0,0,0,0,0,0,0,1,0,0,0,0,0,0,0,0,0,214,10,0,3,0,0,0,0,0,0,182,6,0,4,0,27,0,0,0,0,1,0,0,0,0,0,0,0,0,0,0,0,0,0,0,0,0,0,0,0,0,0,0,0,0,0,0,0,0,0,0,0,0,0,0,0,0,0,0,0,0,0,0,0,0,0,0,0,0,0,0,0,0,0,0,0,0,0,0,0,0,0,0,0,0,0,0,0,0,0,0,0,0,0,0,0,0,0,0,0,0,0,0,0,0,0,0,0,0,0,0,0,0,0,0,0,0,0,0,0,0,0,0,0,0,0,0]
[11,1296,0,0,0,0,0,0,0,4,0,0,0,0,6,6,5,0,0,0,0,0,0,0,6,1,0,0,562,87,19,0,0,5,0,0,0,0,0,91,0,60,0,69,0,0,0,6,19,0,4,0,0,0,0,0,0,5,0,0,0,0,0,0,0,0,0,0,0,0,0,0,0,0,0,0,0,0,0,0,0,0,0,0,91,0,0,0,0,0,0,0,0,0,3,0,0,0,0,0,0,0,0,0,313,2,1,1,0,17,0,0,0,0,257,3,0,1,0,58,0,0,0,0,0,0,0,0,0,0,0,0,0,0,0,0,0,0,0,0,0,0,0,0,0,0,0,0,0,0,0,0,0,0,0,0,0,0,0,0,0,0,0,0,0,0,0,0,0,0,0,0,0,0,0,0,0,0,0,0,0,0,0,0,0,0,0,0,0,0,0,0,0,0,0,0,0,0,0,0,0,0,0,0,0,0,0,0,0,0,0,0,0,0,0,0,0,0,0,0,0,0,0,0,0,0,0,0,0,0,0]
[8,1131,0,0,2,0,0,0,0,5,0,0,1,0,5,3,10,0,0,0,0,0,0,0,1,0,0,0,714,94,32,0,0,4,42,28,0,4,0,111,0,77,0,68,0,0,0,3,11,0,16,0,34,0,0,12,0,21,0,8,0,29,0,0,17,0,0,0,0,0,0,0,0,0,0,0,0,0,0,0,0,0,0,0,111,0,0,0,0,0,0,0,0,0,1,0,0,0,0,0,0,0,0,0,225,1,3,5,0,0,0,0,0,0,173,1,2,5,0,69,0,0,0,0,2,0,0,0,0,0,0,0,0,0,0,0,0,0,0,0,0,0,0,0,0,0,0,0,0,0,0,0,0,0,0,0,0,0,0,0,0,0,0,0,0,0,0,0,0,0,0,0,0,0,0,0,0,0,0,0,0,0,0,0,0,0,0,0,0,0,0,0,0,0,0,0,0,0,0,0,0,0,0,0,0,0,0,0,0,0,0,0,0,0,0,0,0,0,0,0,0,0,0,0,0,0,0,0,0,0,0]
[6,32,0,0,0,0,0,0,0,0,0,0,0,0,6,0,0,0,0,0,0,0,0,0,0,0,0,0,0,0,1,0,0,0,0,0,0,0,0,19,0,9,0,44,0,0,0,0,0,0,0,0,0,0,0,0,0,0,0,0,0,0,0,0,0,0,0,0,0,0,0,0,0,0,0,0,0,0,0,0,0,0,0,0,20,0,0,0,0,0,0,0,0,0,0,0,0,0,0,0,0,0,0,0,7,0,0,0,0,0,0,0,0,0,7,0,0,0,0,0,0,0,0,0,0,0,0,0,0,0,0,0,0,0,0,0,0,0,0,0,0,0,0,0,0,0,0,0,0,0,0,0,0,0,0,0,0,0,0,0,0,0,0,0,0,0,0,0,0,0,0,0,0,0,0,0,0,0,0,0,0,0,0,0,0,0,0,0,0,0,0,0,0,0,0,0,0,0,0,0,0,0,0,0,0,0,0,0,0,0,0,0,0,0,0,0,0,0,0,0,0,0,0,0,0,0,0,0,0,0,0]
[7,946,1,0,2,0,0,0,0,3,3,0,0,0,5,3,8,0,0,0,0,0,0,0,4,0,0,0,447,60,15,0,0,6,3,0,0,3,0,42,0,68,0,46,0,0,0,3,6,1,17,0,0,0,0,0,0,7,0,23,0,0,0,0,0,0,0,0,0,0,0,0,0,0,0,0,0,0,0,0,0,0,0,0,42,0,0,0,0,0,0,0,0,0,0,0,0,0,0,0,0,0,0,0,200,3,2,0,0,22,0,0,0,0,118,3,0,0,0,38,0,0,0,0,2,0,0,0,0,0,0,0,0,0,0,0,0,0,0,0,0,0,0,0,0,0,0,0,0,0,0,0,0,0,0,0,0,0,0,0,0,0,0,0,0,0,0,0,0,0,0,0,0,0,0,0,0,0,0,0,0,0,0,0,0,0,0,0,0,0,0,0,0,0,0,0,0,0,0,0,0,0,0,0,0,0,0,0,0,0,0,0,0,0,0,0,0,0,0,0,0,0,0,0,0,0,0,0,0,0,0]
[10,1311,0,0,0,0,0,0,2,0,2,0,0,0,1,1,1,0,0,0,0,0,0,0,9,1,0,0,535,91,22,0,0,12,0,8,0,0,0,49,0,44,0,28,0,0,0,1,0,0,0,0,0,0,0,0,0,0,0,0,0,0,0,0,0,0,0,0,0,0,0,0,0,0,0,0,0,0,0,0,0,0,0,0,49,0,34,0,0,0,0,0,0,0,0,0,0,0,0,0,0,0,0,0,353,7,1,0,1,0,0,0,0,0,317,4,1,0,1,38,0,0,0,0,0,0,0,0,0,0,0,0,0,0,0,0,0,0,0,0,0,0,0,0,0,0,0,0,0,0,0,0,0,0,0,0,0,0,0,0,0,0,0,0,0,0,0,0,0,0,0,0,0,0,0,0,0,0,0,0,0,0,0,0,0,0,0,0,0,0,0,0,0,0,0,0,0,0,0,0,0,0,0,0,0,0,0,0,0,0,0,0,0,0,0,0,0,0,0,0,0,0,0,0,0,0,0,0,0,0,0]
["T",5835,1,0,5,0,0,0,2,13,6,0,1,0,40,13,30,0,0,0,0,0,0,0,24,2,0,0,2797,403,113,0,0,30,45,49,0,7,0,505,0,312,0,327,0,0,0,13,63,1,48,0,34,0,0,12,1,52,0,48,0,29,0,0,17,0,0,0,0,0,0,0,0,0,0,0,0,0,0,0,0,0,0,0,522,0,46,0,0,0,0,0,0,0,5,0,0,0,0,0,0,0,0,0,1312,23,7,9,1,39,0,0,0,0,1054,17,3,10,1,230,0,0,0,0,5,0,0,0,0,0,0,0,0,0,0,0,0,0,0,0,0,0,0,0,0,0,0,0,0,0,0,0,0,0,0,0,0,0,0,0,0,0,0,0,0,0,0,0,0,0,0,0,0,0,0,0,0,0,0,0,0,0,0,0,0,0,0,0,0,0,0,0,0,0,0,0,0,0,0,0,0,0,0,0,0,0,0,0,0,0,0,0,0,0,0,0,0,0,0,0,0,0,0,0,0,0,0,0,0,0,0]
[]
[]
[]
[]
[]
[]
["TOTAL"]
[{"$f":"COUNT(A283:A299)","v":11},{"$f":"SUM(B283:B299)","v":11670},{"$f":"SUM(C283:C299)","v":2},0,10,0,0,0,4,26,12,0,2,0,80,26,60,0,0,0,0,0,0,0,48,4,0,0,5594,806,226,0,0,60,90,98,0,14,0,1010,0,624,0,654,0,0,0,26,126,2,96,0,68,0,0,24,2,104,0,96,0,58,0,0,34,0,{"$f":"SUM(BO283:BO299)","v":0},0,0,0,0,0,0,0,0,0,0,0,0,0,0,0,0,0,1044,0,92,0,0,0,0,0,0,0,10,0,0,0,0,0,0,0,0,0,2624,46,14,18,2,78,0,0,0,0,2108,34,6,20,2,460,0,0,0,0,10,0,0,0,0,0,{"$f":"SUM(EA283:EA299)","v":0},0,0,0,0,0,0,0,0,0,0,0,0,0,0,0,0,0,0,0,0,0,0,0,0,0,0,0,0,0,0,0,0,0,0,0,0,0,0,0,0,0,0,0,0,0,0,0,0,0,0,0,0,0,0,0,0,0,0,0,0,0,0,0,{"$f":"SUM(GM283:GM299)","v":0},0,0,0,0,0,0,0,0,0,0,0,0,0,0,0,0,0,0,0,0,0,0,0,0,0,0,0,0,0,0,0,0,0,0,0,0]
[{"$f":"CONCATENATE(A283,\"-\",A284,\"-\",A285,\"-\",A286,\"-\",A287,\"-\",A288,\"-\",A289,\"-\",A290,\"-\",A291,\"-\",A292,\"-\",A293,\"-\",A294)","v":"1-2-3-4-5-9-11-8-6-7-10-T"}]
[null," BAS001"," BAS002"," BAS003"," BAS004"," BAS005"," BAS006"," BAS007"," BAS008"," BAS009"," BAS010"," BAS011"," BAS012"," BAS013"," BAS014"," BAS015"," BAS016"," BAS017"," BAS018"," BAS019"," BAS020"," BAS021"," BAS022"," BAS023"," BAS024"," BAS025"," BAS026"," BAS027"," BAS028"," BAS029"," BAS030"," BAS031"," BAS032"," BAS033"," BAS034"," BAS035"," BAS036"," BAS037"," BAS038"," BAS039"," BAS040"," BAS041"," BAS042"," BAS043"," BAS044"," BAS045"," BAS046"," BAS047"," BAS048"," BAS049"," BAS050"," BAS051"," BAS052"," BAS053"," BAS054"," BAS055"," BAS056"," BAS057"," BAS058"," BAS059"," BAS060"," BAS061"," BAS062"," BAS063"," BAS064"," BAS065"," BAS066"," BAS067"," BAS068"," BAS069"," BAS070"," BAS071"," BAS072"," BAS073"," BAS074"," BAS075"," BAS076"," BAS077"," BAS078"," BAS079"," BAS080"," BAS081"," BAS082"," BAS083"," BAS084"," BAS085"," BAS086"," BAS087"," BAS088"," BAS089"," BAS090"," BAS091"," BAS092"," BAS093"," BAS094"," BAS095"," BAS096"," BAS097"," BAS098"," BAS099"," BAS100"," BAS101"," BAS102"," BAS103"," BAS104"," BAS105"," BAS106"," BAS107"," BAS108"," BAS109"," BAS110"," BAS111"," BAS112"," BAS113"," BAS114"," BAS115"," BAS116"," BAS117"," BAS118"," BAS119"," BAS120"," BAS121"," BAS122"," BAS123"," BAS124"," BAS125"," BAS126"," BAS127"," BAS128"," BAS129"," BAS130"," BAS131"," BAS132"," BAS133"," BAS134"," BAS135"," BAS136"," BAS137"," BAS138"," BAS139"," BAS140"," BAS141"," BAS142"," BAS143"," BAS144"," BAS145"," BAS146"," BAS147"," BAS148"," BAS149"," BAS150"," BAS151"," BAS152"," BAS153"," BAS154"," BAS155"," BAS156"," BAS157"," BAS158"," BAS159"," BAS160"," BAS161"," BAS162"," BAS163"," BAS164"," BAS165"," BAS166"," BAS167"," BAS168"," BAS169"," BAS170"," BAS171"," BAS172"," BAS173"," BAS174"," BAS175"," BAS176"," BAS177"," BAS178"," BAS179"," BAS180"," BAS181"," BAS182"," BAS183"," BAS184"," BAS185"," BAS186"," BAS187"," BAS188"," BAS189"," BAS190"," BAS191"," BAS192"," BAS193"," BAS194"," BAS195"," BAS196"," BAS197"," BAS198"," BAS199"," BAS200"," BAS201"," BAS202"," BAS203"," BAS204"," BAS205"," BAS206"," BAS207"," BAS208"," BAS209"," BAS210"," BAS211"," BAS212"," BAS213"," BAS214"," BAS215"," BAS216"," BAS217"," BAS218"," BAS219"," BAS220"," BAS221"," BAS222"," BAS223"," BAS224"," BAS225"," BAS226"," BAS227"," BAS228"," BAS229"," BAS230"]
[null,{"$f":"IF(B304=B282,\"SI\",\"NO\")","v":"SI"},{"$f":"IF(C304=C282,\"SI\",\"NO\")","v":"SI"},"SI","SI","SI","SI","SI","SI","SI","SI","SI","SI","SI","SI","SI","SI","SI","SI","SI","SI","SI","SI","SI","SI","SI","SI","SI","SI","SI","SI","SI","SI","SI","SI","SI","SI","SI","SI","SI","SI","SI","SI","SI","SI","SI","SI","SI","SI","SI","SI","SI","SI","SI","SI","SI","SI","SI","SI","SI","SI","SI","SI","SI","SI","SI",{"$f":"IF(BO304=BO282,\"SI\",\"NO\")","v":"SI"},"SI","SI","SI","SI","SI","SI","SI","SI","SI","SI","SI","SI","SI","SI","SI","SI","SI","SI","SI","SI","SI","SI","SI","SI","SI","SI","SI","SI","SI","SI","SI","SI","SI","SI","SI","SI","SI","SI","SI","SI","SI","SI","SI","SI","SI","SI","SI","SI","SI","SI","SI","SI","SI","SI","SI","SI","SI","SI","SI","SI","SI","SI","SI",{"$f":"IF(EA304=EA282,\"SI\",\"NO\")","v":"SI"},"SI","SI","SI","SI","SI","SI","SI","SI","SI","SI","SI","SI","SI","SI","SI","SI","SI","SI","SI","SI","SI","SI","SI","SI","SI","SI","SI","SI","SI","SI","SI","SI","SI","SI","SI","SI","SI","SI","SI","SI","SI","SI","SI","SI","SI","SI","SI","SI","SI","SI","SI","SI","SI","SI","SI","SI","SI","SI","SI","SI","SI","SI","SI",{"$f":"IF(GM304=GM282,\"SI\",\"NO\")","v":"SI"},"SI","SI","SI","SI","SI","SI","SI","SI","SI","SI","SI","SI","SI","SI","SI","SI","SI","SI","SI","SI","SI","SI","SI","SI","SI","SI","SI","SI","SI","SI","SI","SI","SI","SI","SI","SI"]

{"sheet":"INFORME","index":2,"n_rows":183,"n_cols":21,"rows_kept":183,"cut":false,"hidden":false,"merged":[[146,15,147,15],[148,15,149,15],[150,15,151,15],[152,15,153,15],[157,15,158,15],[159,15,160,15],[9,2,9,3],[10,2,10,3],[11,2,11,3],[12,2,12,3],[12,6,12,9],[30,1,30,5],[31,1,31,5],[32,1,32,5],[33,1,33,5],[34,1,34,5],[34,6,43,10],[35,1,35,5],[36,1,36,5],[37,1,37,5],[38,1,38,5],[39,1,39,5],[40,1,40,5],[41,1,41,5],[1,1,1,12],[2,1,2,12],[3,1,3,12],[4,1,4,12],[5,1,5,12],[8,2,8,3],[8,6,8,7],[18,2,18,3],[29,1,29,5],[13,2,13,3],[14,6,14,7],[15,2,15,3],[16,2,16,3],[17,2,17,3],[10,6,10,9],[14,2,14,3],[42,1,42,5],[50,1,50,5],[51,1,51,5],[52,1,52,5],[53,1,53,5],[54,1,54,5],[56,1,56,5],[43,1,43,5],[45,1,45,5],[46,1,46,5],[47,1,47,5],[48,1,48,5],[49,1,49,5],[64,1,64,5],[65,1,65,5],[66,1,66,5],[67,1,67,5],[68,1,68,5],[70,1,70,5],[57,1,57,5],[58,1,58,5],[59,1,59,5],[60,1,60,5],[61,1,61,5],[63,1,63,5],[79,1,79,5],[80,1,80,5],[81,1,81,5],[83,1,83,5],[84,1,84,5],[85,1,85,5],[71,1,71,5],[73,1,73,5],[74,1,74,5],[76,1,76,5],[77,1,77,5],[78,1,78,5],[93,1,93,5],[94,1,94,5],[95,1,95,5],[96,1,96,5],[98,1,98,5],[99,1,99,5],[86,1,86,5],[87,1,87,5],[88,1,88,5],[90,1,90,5],[91,1,91,5],[92,1,92,5],[106,1,106,5],[108,1,108,5],[109,1,109,5],[110,1,110,5],[111,1,111,5],[113,1,113,5],[100,1,100,5],[101,1,101,5],[102,1,102,5],[103,1,103,5],[104,1,104,5],[105,1,105,5],[122,1,122,5],[123,1,123,5],[124,1,124,5],[125,1,125,5],[127,1,127,5],[128,1,128,5],[114,1,114,5],[116,1,116,5],[117,1,117,5],[118,1,118,5],[119,1,119,5],[121,1,121,5],[138,1,138,5],[139,1,139,5],[141,1,142,3],[141,4,142,4],[141,5,141,12],[143,1,145,3],[129,1,129,5],[130,1,130,5],[132,1,132,5],[133,1,133,5],[135,1,135,5],[136,1,136,5],[167,6,167,7],[167,8,167,9],[173,1,173,2],[169,1,169,2],[159,1,160,3],[181,2,181,4],[182,2,182,4],[146,1,147,3],[148,1,149,3],[150,1,151,3],[152,1,153,3],[154,1,156,3],[157,1,158,3],[163,1,163,5],[164,1,164,5],[165,1,165,5],[162,1,162,5],[169,3,169,5],[170,3,170,5],[171,3,171,5],[172,3,172,5],[173,3,173,5],[174,3,174,5],[175,3,175,5]]}
[]
[null,"DIRECCION REGIONAL DE SALUD CUSCO"]
[null,"DIRECCION EJECUTIVA DE INTELIGENCIA SANITARIA"]
[null,"DIRECCION DE ESTADISTICA, INFORMATICA Y TELECOMUNICACION"]
[null,"TUBERCULOSIS"]
[null,"INFORME OPERACIONAL MENSUAL"]
[]
[]
[null,"DIRESA","CUSCO",null,null,"REGION","CUSCO"]
[]
[null,"RED DE SALUD ",{"$f":"+TABLAS!O9","v":"03 - LA CONVENCION"},null,null,"EJECUTORA",{"$f":"+TABLAS!O14","v":""}]
[]
[null,"MICRO RED",{"$f":"+TABLAS!O10","v":""},null,null,"RESPONSABLE"]
[]
[null,"EE.SS.",{"$f":"+TABLAS!O11","v":""},null,null,"COD. RENAES",{"$f":"+TABLAS!Q11","v":""}]
[]
[null,"PROVINCIA",{"$f":"+TABLAS!O12","v":""},null,null,"AÑO",{"$f":"+TABLAS!J16","v":"2024"},"SEMESTRE","1 Sem (   )","2 Sem (   )"]
[]
[null,"DISTRITO",{"$f":"+TABLAS!O13","v":""},null,null,"MES",{"$f":"+TABLAS!N26","v":"FEB - NOV"},"TRIMESTRE","1 Trim (   )","2 Trim (   )","3 Trim (   )","4 Trim (   )"]
[]
[null,"INSTITUCION :  MINSA (  X  )   ESSALUD (     )   FFAA  (     )   PNP  (     )   INPE  (     )   OTROS  (     )",null,null,null,null,null,null,"POBLACION TOTAL",null,null,null,{"$f":"+GETPIVOTDATA(\"Suma de total\",TABLAS!$A$266)","v":0}]
[]
[null,null,null,null,null,null,null,{"$f":"TABLAS!B145","v":0},"TOTAL DE ATENCIONES EN MAYORES DE 15 AÑOS:  ",null,null,null,{"$f":"+GETPIVOTDATA(\"Suma de emay15\",TABLAS!$A$266)","v":0}]
[]
[null,null,null,null,null,null,null,"00-11a","12-17a","18-29a","30-59a","60-+a","TOTAL"]
[null,null,null,null,null,null,null,{"$f":"+GETPIVOTDATA(\"ATC\",TABLAS!$A$59,\"ETAPA\",\"00-11A\")","v":184575},{"$f":"+GETPIVOTDATA(\"ATC\",TABLAS!$A$59,\"ETAPA\",\"12-17A\")","v":69589},{"$f":"+GETPIVOTDATA(\"ATC\",TABLAS!$A$59,\"ETAPA\",\"18-29A\")","v":126644},{"$f":"+GETPIVOTDATA(\"ATC\",TABLAS!$A$59,\"ETAPA\",\"30-59A\")","v":286379},{"$f":"+GETPIVOTDATA(\"ATC\",TABLAS!$A$59,\"ETAPA\",\"80-+A\")","v":123837},{"$f":"SUM(H26:L26)","v":791024}]
[]
[]
[]
[null,"A. DETECCION Y DIAGNÓSTICO DE CASOS",null,null,null,null,"0-11a","12-17a","18-29a","30-59a","60-+a","Total","%"]
[null,"A1.   Sintomáticos Respiratorios (S.R.) Esperados = Atc > 15 años x 0.05",null,null,null,null,null,null,null,null,null,{"$f":"M23*0.05","v":0},null,null,null,null,null,null,null,null,{"$f":"+U26*0.05","v":0}]
[null,"A2.   S.R. Identificados",null,null,null,null,{"$f":"+GETPIVOTDATA(\" BAS007\",TABLAS!$A$124)","v":86},{"$f":"+GETPIVOTDATA(\" BAS008\",TABLAS!$A$124)","v":185},{"$f":"+GETPIVOTDATA(\" BAS009\",TABLAS!$A$124)","v":598},{"$f":"+GETPIVOTDATA(\" BAS010\",TABLAS!$A$124)","v":1801},{"$f":"+GETPIVOTDATA(\" BAS011\",TABLAS!$A$124)","v":1195},{"$f":"SUM(G32:K32)","v":3865},null,null,{"$f":"IF(L33<=L32,\"SI\",\"NO\")","v":"SI"},{"$f":"+L32-L33","v":314},null,null,null,null,{"$f":"+P23*0.05","v":0}]
[null,"A3.   S.R. Examinados",null,null,null,null,{"$f":"+GETPIVOTDATA(\" BAS012\",TABLAS!$A$124)","v":79},{"$f":"+GETPIVOTDATA(\" BAS013\",TABLAS!$A$124)","v":168},{"$f":"+GETPIVOTDATA(\" BAS014\",TABLAS!$A$124)","v":557},{"$f":"+GETPIVOTDATA(\" BAS015\",TABLAS!$A$124)","v":1653},{"$f":"+GETPIVOTDATA(\" BAS016\",TABLAS!$A$124)","v":1094},3551]
[null,"A4.   S.R. Diagnosticados con TB Pulmonar baciloscopía positiva",null,null,null,null,{"$f":"+G49+G60+G67","v":0},{"$f":"+H49+H60+H67","v":1},8,11,19,{"$f":"SUM(G34:K34)","v":39}]
[null,"A5.   Baciloscopías de Diagnóstico esperadas (A1 x 2)",null,null,null,null,"INFORMACION DE LABORATORIO",null,null,null,null,{"$f":"L31*2","v":0}]
[null,"A6.   Baciloscopías de Diagnóstico Total",null,null,null,null,null,null,null,null,null,{"$f":"'INF BACTERIO'!M27","v":0}]
[null,"A7.   Baciloscopías de Diagnóstico BK (+)",null,null,null,null,null,null,null,null,null,{"$f":"'INF BACTERIO'!M36","v":0}]
[null,"A8.   Baciloscopías de Control Total",null,null,null,null,null,null,null,null,null,{"$f":"'INF BACTERIO'!M28","v":0}]
[null,"A9.   Cultivos de Diagnóstico Total",null,null,null,null,null,null,null,null,null,{"$f":"'INF BACTERIO'!M47","v":0}]
[null,"A10. Cultivos de Diagnóstico Positivos",null,null,null,null,null,null,null,null,null,{"$f":"'INF BACTERIO'!M58","v":0}]
[null,"A11. Cultivos de Control Total",null,null,null,null,null,null,null,null,null,{"$f":"'INF BACTERIO'!M48","v":0}]
[null,"A12. Nº de Pruebas de Sensibilidad realizadas",null,null,null,null,null,null,null,null,null,{"$f":"SUM(L43:L44)","v":0}]
[null,"A12.1 Nº de Pruebas de Sensibilidad Rápidas (H y R)"]
[null,"A12.2 Nº de Pruebas de Sensibilidad Convencional"]
[]
[null,"B. CASOS NUEVOS ",null,null,null,null,"0-11a","12-17a","18-29a","30-59a","60-+a","Total","%"]
[null,"Total de Casos Nuevos (B1+B2)",null,null,null,null,{"$f":"+G48+G53","v":8},{"$f":"+H48+H53","v":1},9,15,{"$f":"+K48+K53","v":25},{"$f":"SUM(G47:K47)","v":58},{"$f":"+L47*100000/M21","v":{"$error":"#DIV/0!"}},null,{"$f":"+O48+O53","v":59},{"$f":"IF(O47=L47,\"SI\",\"NO\")","v":"NO"}]
[null,"B1. TB Pulmonar Total (B1.1 +B1.2 + B1.3 + B1.4)",null,null,null,null,{"$f":"SUM(G49:G52)","v":8},{"$f":"SUM(H49:H52)","v":1},{"$f":"SUM(I49:I52)","v":9},{"$f":"SUM(J49:J52)","v":15},{"$f":"SUM(K49:K52)","v":25},58,null,null,{"$f":"+O144","v":59}]
[null,"B1.1 TB Pulmonar frotis positivo.",null,null,null,null,{"$f":"+GETPIVOTDATA(\" BAS022\",TABLAS!$A$124)","v":0},{"$f":"+GETPIVOTDATA(\" BAS023\",TABLAS!$A$124)","v":1},{"$f":"+GETPIVOTDATA(\" BAS024\",TABLAS!$A$124)","v":8},{"$f":"+GETPIVOTDATA(\" BAS025\",TABLAS!$A$124)","v":10},{"$f":"+GETPIVOTDATA(\" BAS026\",TABLAS!$A$124)","v":18},37,{"$f":"+L49*100000/M21","v":{"$error":"#DIV/0!"}},null,{"$f":"+P147","v":37}]
[null,"B1.2 TB Pulmonar cultivo positivo.",null,null,null,null,{"$f":"+GETPIVOTDATA(\" BAS027\",TABLAS!$A$124)","v":1},{"$f":"+GETPIVOTDATA(\" BAS028\",TABLAS!$A$124)","v":0},{"$f":"+GETPIVOTDATA(\" BAS029\",TABLAS!$A$124)","v":0},{"$f":"+GETPIVOTDATA(\" BAS030\",TABLAS!$A$124)","v":0},{"$f":"+GETPIVOTDATA(\" BAS031\",TABLAS!$A$124)","v":4},5,null,null,{"$f":"+P149","v":5}]
[null,"B1.3 TB Pulmonar frotis negativo.",null,null,null,null,{"$f":"+GETPIVOTDATA(\" BAS032\",TABLAS!$A$124)","v":7},{"$f":"+GETPIVOTDATA(\" BAS033\",TABLAS!$A$124)","v":0},{"$f":"+GETPIVOTDATA(\" BAS034\",TABLAS!$A$124)","v":0},{"$f":"+GETPIVOTDATA(\" BAS035\",TABLAS!$A$124)","v":5},{"$f":"+GETPIVOTDATA(\" BAS036\",TABLAS!$A$124)","v":3},15,null,null,{"$f":"+P151","v":15}]
[null,"B1.4 TB Pulmonar sin frotis de esputo.",null,null,null,null,{"$f":"+GETPIVOTDATA(\" BAS037\",TABLAS!$A$124)","v":0},{"$f":"+GETPIVOTDATA(\" BAS038\",TABLAS!$A$124)","v":0},{"$f":"+GETPIVOTDATA(\" BAS039\",TABLAS!$A$124)","v":1},{"$f":"+GETPIVOTDATA(\" BAS040\",TABLAS!$A$124)","v":0},{"$f":"+GETPIVOTDATA(\" BAS041\",TABLAS!$A$124)","v":0},1,null,null,{"$f":"+P153","v":2}]
[null,"B2. TB Extrapulmonar (B2.1 +B2.2)",null,null,null,null,{"$f":"SUM(G54:G55)","v":0},{"$f":"SUM(H54:H55)","v":0},0,0,0,0,null,null,{"$f":"+O155","v":0}]
[null,"B2.1 Con confirmación bacteriológica o histopatológica",null,null,null,null,{"$f":"+GETPIVOTDATA(\" BAS042\",TABLAS!$A$124)","v":0},{"$f":"+GETPIVOTDATA(\" BAS043\",TABLAS!$A$124)","v":0},{"$f":"+GETPIVOTDATA(\" BAS044\",TABLAS!$A$124)","v":0},{"$f":"+GETPIVOTDATA(\" BAS045\",TABLAS!$A$124)","v":0},{"$f":"+GETPIVOTDATA(\" BAS046\",TABLAS!$A$124)","v":0},0]
[null,"B2.2 Sin confirmación bacteriológica o histopatológica",null,null,null,null,{"$f":"+GETPIVOTDATA(\" BAS047\",TABLAS!$A$124)","v":0},{"$f":"+GETPIVOTDATA(\" BAS048\",TABLAS!$A$124)","v":0},{"$f":"+GETPIVOTDATA(\" BAS049\",TABLAS!$A$124)","v":0},{"$f":"+GETPIVOTDATA(\" BAS050\",TABLAS!$A$124)","v":0},{"$f":"+GETPIVOTDATA(\" BAS051\",TABLAS!$A$124)","v":0},0]
[]
[null,"C. RECAÍDAS ",null,null,null,null,"0-11a","12-17a","18-29a","30-59a","60-+a","Total","%"]
[null,"Recaídas (C1+C2)",null,null,null,null,{"$f":"+G59+G62","v":0},0,0,0,{"$f":"+K59+K62","v":1},{"$f":"SUM(G58:K58)","v":1}]
[null,"C1. Recaídas Pulmonar (C1.1 + C1.2)",null,null,null,null,{"$f":"+G60+G61","v":0},0,0,0,{"$f":"+K60+K61","v":1},1]
[null,"C1.1 TB Pulmonar frotis positivo",null,null,null,null,{"$f":"+GETPIVOTDATA(\" BAS052\",TABLAS!$A$124)","v":0},{"$f":"+GETPIVOTDATA(\" BAS053\",TABLAS!$A$124)","v":0},{"$f":"+GETPIVOTDATA(\" BAS054\",TABLAS!$A$124)","v":0},{"$f":"+GETPIVOTDATA(\" BAS055\",TABLAS!$A$124)","v":0},{"$f":"+GETPIVOTDATA(\" BAS056\",TABLAS!$A$124)","v":1},1]
[null,"C1.2 TB Pulmonar frotis negativo ",null,null,null,null,{"$f":"+GETPIVOTDATA(\" BAS057\",TABLAS!$A$124)","v":0},{"$f":"+GETPIVOTDATA(\" BAS058\",TABLAS!$A$124)","v":0},{"$f":"+GETPIVOTDATA(\" BAS059\",TABLAS!$A$124)","v":0},{"$f":"+GETPIVOTDATA(\" BAS060\",TABLAS!$A$124)","v":0},{"$f":"+GETPIVOTDATA(\" BAS061\",TABLAS!$A$124)","v":0},0]
[null,"C2 Recaídas Extrapulmonares",null,null,null,null,{"$f":"+GETPIVOTDATA(\" BAS062\",TABLAS!$A$124)","v":0},{"$f":"+GETPIVOTDATA(\" BAS063\",TABLAS!$A$124)","v":0},{"$f":"+GETPIVOTDATA(\" BAS064\",TABLAS!$A$124)","v":0},{"$f":"+GETPIVOTDATA(\" BAS065\",TABLAS!$A$124)","v":0},{"$f":"+GETPIVOTDATA(\" BAS066\",TABLAS!$A$124)","v":0},0]
[]
[null,"D. ABANDONOS RECUPERADOS",null,null,null,null,"0-11a","12-17a","18-29a","30-59a","60-+a","Total","%"]
[null,"Abandonos Recuperados (D1+D2)",null,null,null,null,{"$f":"+G66+G69","v":0},{"$f":"+H66+H69","v":0},0,1,0,{"$f":"SUM(G65:K65)","v":1}]
[null,"D1. Abandonos recuperados pulmonar (D1.1+D1.2)",null,null,null,null,{"$f":"+G67+G68","v":0},{"$f":"+H67+H68","v":0},0,1,0,1]
[null,"D1.1 TB Pulmonar frotis positivo",null,null,null,null,{"$f":"+GETPIVOTDATA(\" BAS067\",TABLAS!$A$124)","v":0},{"$f":"+GETPIVOTDATA(\" BAS068\",TABLAS!$A$124)","v":0},{"$f":"+GETPIVOTDATA(\" BAS069\",TABLAS!$A$124)","v":0},{"$f":"+GETPIVOTDATA(\" BAS070\",TABLAS!$A$124)","v":1},{"$f":"+GETPIVOTDATA(\" BAS071\",TABLAS!$A$124)","v":0},1]
[null,"D1.2 TB Pulmonar frotis negativo",null,null,null,null,{"$f":"+GETPIVOTDATA(\" BAS072\",TABLAS!$A$124)","v":0},{"$f":"+GETPIVOTDATA(\" BAS073\",TABLAS!$A$124)","v":0},{"$f":"+GETPIVOTDATA(\" BAS074\",TABLAS!$A$124)","v":0},{"$f":"+GETPIVOTDATA(\" BAS075\",TABLAS!$A$124)","v":0},{"$f":"+GETPIVOTDATA(\" BAS076\",TABLAS!$A$124)","v":0},0]
[null,"D2. Abandonos Recuperados  Extrapulmonares",null,null,null,null,{"$f":"+GETPIVOTDATA(\" BAS077\",TABLAS!$A$124)","v":0},{"$f":"+GETPIVOTDATA(\" BAS078\",TABLAS!$A$124)","v":0},{"$f":"+GETPIVOTDATA(\" BAS079\",TABLAS!$A$124)","v":0},{"$f":"+GETPIVOTDATA(\" BAS080\",TABLAS!$A$124)","v":0},{"$f":"+GETPIVOTDATA(\" BAS081\",TABLAS!$A$124)","v":0},0]
[]
[null,"E. FRACASOS",null,null,null,null,"0-11a","12-17a","18-29a","30-59a","60-+a","Total","%"]
[null,"E1. Total de casos que fracasan a esquema con medicamentos de primera línea",null,null,null,null,{"$f":"+GETPIVOTDATA(\" BAS082\",TABLAS!$A$124)","v":0},{"$f":"+GETPIVOTDATA(\" BAS083\",TABLAS!$A$124)","v":0},{"$f":"+GETPIVOTDATA(\" BAS084\",TABLAS!$A$124)","v":0},{"$f":"+GETPIVOTDATA(\" BAS085\",TABLAS!$A$124)","v":0},{"$f":"+GETPIVOTDATA(\" BAS086\",TABLAS!$A$124)","v":0},{"$f":"SUM(G72:K72)","v":0}]
[]
[null,"F. MORBILIDAD TOTAL (B+ C + D + E)",null,null,null,null,"0-11a","12-17a","18-29a","30-59a","60-+a","Total","%"]
[null,"F1. Total de personas afectadas con tuberculosis",null,null,null,null,{"$f":"+G72+G65+G58+G47","v":8},1,9,16,26,{"$f":"SUM(G75:K75)","v":60},{"$f":"+L75*100000/M21","v":{"$error":"#DIV/0!"}}]
[]
[null,"G. CASOS DE TB CON RESISTENCIA A MEDICAMENTOS",null,null,null,null,"0-11a","12-17a","18-29a","30-59a","60-+a","Total","%"]
[null,"G1. Casos nuevos y antes tratados de otras Tuberculosis Drogo Resistente",null,null,null,null,{"$f":"+GETPIVOTDATA(\" BAS092\",TABLAS!$A$124)+GETPIVOTDATA(\" BAS097\",TABLAS!$A$124)","v":0},{"$f":"+GETPIVOTDATA(\" BAS093\",TABLAS!$A$124)+GETPIVOTDATA(\" BAS098\",TABLAS!$A$124)","v":0},{"$f":"+GETPIVOTDATA(\" BAS094\",TABLAS!$A$124)+GETPIVOTDATA(\" BAS099\",TABLAS!$A$124)","v":0},{"$f":"+GETPIVOTDATA(\" BAS095\",TABLAS!$A$124)+GETPIVOTDATA(\" BAS100\",TABLAS!$A$124)","v":0},{"$f":"+GETPIVOTDATA(\" BAS096\",TABLAS!$A$124)+GETPIVOTDATA(\" BAS101\",TABLAS!$A$124)","v":0},{"$f":"SUM(G78:K78)","v":0}]
[null,"G2. Casos nuevos con TBMDR confirmada",null,null,null,null,{"$f":"+GETPIVOTDATA(\" BAS102\",TABLAS!$A$124)","v":0},{"$f":"+GETPIVOTDATA(\" BAS103\",TABLAS!$A$124)","v":0},{"$f":"+GETPIVOTDATA(\" BAS104\",TABLAS!$A$124)","v":0},{"$f":"+GETPIVOTDATA(\" BAS105\",TABLAS!$A$124)","v":0},{"$f":"+GETPIVOTDATA(\" BAS106\",TABLAS!$A$124)","v":0},0]
[null,"G3. Casos antes tratados con TBMDR confirmada",null,null,null,null,{"$f":"+GETPIVOTDATA(\" BAS107\",TABLAS!$A$124)","v":0},{"$f":"+GETPIVOTDATA(\" BAS108\",TABLAS!$A$124)","v":0},{"$f":"+GETPIVOTDATA(\" BAS109\",TABLAS!$A$124)","v":0},{"$f":"+GETPIVOTDATA(\" BAS110\",TABLAS!$A$124)","v":0},{"$f":"+GETPIVOTDATA(\" BAS111\",TABLAS!$A$124)","v":0},0]
[null,"G4. Casos nuevos con TB XDR confirmada",null,null,null,null,{"$f":"+GETPIVOTDATA(\" BAS112\",TABLAS!$A$124)","v":0},{"$f":"+GETPIVOTDATA(\" BAS113\",TABLAS!$A$124)","v":0},{"$f":"+GETPIVOTDATA(\" BAS114\",TABLAS!$A$124)","v":0},{"$f":"+GETPIVOTDATA(\" BAS115\",TABLAS!$A$124)","v":0},{"$f":"+GETPIVOTDATA(\" BAS116\",TABLAS!$A$124)","v":0},0]
[null,"G5. Casos antes tratados con TB XDR confirmada",null,null,null,null,{"$f":"+GETPIVOTDATA(\" BAS117\",TABLAS!$A$124)","v":0},{"$f":"+GETPIVOTDATA(\" BAS118\",TABLAS!$A$124)","v":0},{"$f":"+GETPIVOTDATA(\" BAS119\",TABLAS!$A$124)","v":0},{"$f":"+GETPIVOTDATA(\" BAS120\",TABLAS!$A$124)","v":0},{"$f":"+GETPIVOTDATA(\" BAS121\",TABLAS!$A$124)","v":0},{"$f":"SUM(G82:K82)","v":0}]
[]
[null,"H. ESTUDIO DE CONTACTOS",null,null,null,null,"0-11a","12-17a","18-29a","30-59a","60-+a","Total","%"]
[null,"H1. Contactos Esperados (Morbilidad x 4)",null,null,null,null,null,null,null,null,null,{"$f":"SUM(G85:K85)","v":0}]
[null,"H2. Contactos Censados",null,null,null,null,{"$f":"+GETPIVOTDATA(\" BAS122\",TABLAS!$A$124)","v":15},{"$f":"+GETPIVOTDATA(\" BAS123\",TABLAS!$A$124)","v":6},{"$f":"+GETPIVOTDATA(\" BAS124\",TABLAS!$A$124)","v":6},{"$f":"+GETPIVOTDATA(\" BAS125\",TABLAS!$A$124)","v":22},{"$f":"+GETPIVOTDATA(\" BAS126\",TABLAS!$A$124)","v":7},56,null,null,{"$f":"IF(O47>L86,\"NO\",\"SI\")","v":"NO"},{"$f":"IF(O86=\"NO\",\"VERIFIQUE PORQUE NO EXISTE CONTACTOS \",\"\")","v":"VERIFIQUE PORQUE NO EXISTE CONTACTOS "}]
[null,"H3. Contactos Examinados",null,null,null,null,{"$f":"+GETPIVOTDATA(\" BAS127\",TABLAS!$A$124)+GETPIVOTDATA(\" BAS132\",TABLAS!$A$124)+GETPIVOTDATA(\" BAS143\",TABLAS!$A$124)+GETPIVOTDATA(\" BAS144\",TABLAS!$A$124)+GETPIVOTDATA(\" BAS145\",TABLAS!$A$124)+GETPIVOTDATA(\" BAS146\",TABLAS!$A$124)","v":44},{"$f":"+GETPIVOTDATA(\" BAS128\",TABLAS!$A$124)+GETPIVOTDATA(\" BAS133\",TABLAS!$A$124)+GETPIVOTDATA(\" BAS147\",TABLAS!$A$124)","v":14},{"$f":"+GETPIVOTDATA(\" BAS129\",TABLAS!$A$124)+GETPIVOTDATA(\" BAS134\",TABLAS!$A$124)+GETPIVOTDATA(\" BAS148\",TABLAS!$A$124)","v":18},{"$f":"+GETPIVOTDATA(\" BAS130\",TABLAS!$A$124)+GETPIVOTDATA(\" BAS135\",TABLAS!$A$124)+GETPIVOTDATA(\" BAS149\",TABLAS!$A$124)","v":51},{"$f":"+GETPIVOTDATA(\" BAS131\",TABLAS!$A$124)+GETPIVOTDATA(\" BAS136\",TABLAS!$A$124)+GETPIVOTDATA(\" BAS150\",TABLAS!$A$124)","v":27},154,null,null,{"$f":"IF(L87>L86,\"NO\",\"SI\")","v":"NO"},{"$f":"IF(O87=\"NO\",\"VERIFIQUE EL REGISTRO DE EXAMINADOS QUE DEBE SER IGUAL O MENOR QUE CENSADOS \",\"\")","v":"VERIFIQUE EL REGISTRO DE EXAMINADOS QUE DEBE SER IGUAL O MENOR QUE CENSADOS "}]
[null,"H4. Contactos Examinados con TB",null,null,null,null,{"$f":"+GETPIVOTDATA(\" BAS137\",TABLAS!$A$124)+GETPIVOTDATA(\" BAS212\",TABLAS!$A$124)+GETPIVOTDATA(\" BAS151\",TABLAS!$A$124)","v":14},{"$f":"+GETPIVOTDATA(\" BAS138\",TABLAS!$A$124)+GETPIVOTDATA(\" BAS213\",TABLAS!$A$124)+GETPIVOTDATA(\" BAS152\",TABLAS!$A$124)","v":0},{"$f":"+GETPIVOTDATA(\" BAS139\",TABLAS!$A$124)+GETPIVOTDATA(\" BAS214\",TABLAS!$A$124)+GETPIVOTDATA(\" BAS153\",TABLAS!$A$124)","v":0},{"$f":"+GETPIVOTDATA(\" BAS140\",TABLAS!$A$124)+GETPIVOTDATA(\" BAS215\",TABLAS!$A$124)+GETPIVOTDATA(\" BAS154\",TABLAS!$A$124)","v":6},{"$f":"+GETPIVOTDATA(\" BAS141\",TABLAS!$A$124)+GETPIVOTDATA(\" BAS216\",TABLAS!$A$124)+GETPIVOTDATA(\" BAS155\",TABLAS!$A$124)","v":0},20]
[null,"H5. Contactos Examinados con TB pulmonar frotis positivo",null,null,null,null,{"$f":"+GETPIVOTDATA(\" BAS137\",TABLAS!$A$124)","v":0},{"$f":"+GETPIVOTDATA(\" BAS138\",TABLAS!$A$124)","v":0},{"$f":"+GETPIVOTDATA(\" BAS139\",TABLAS!$A$124)","v":0},{"$f":"+GETPIVOTDATA(\" BAS140\",TABLAS!$A$124)","v":0},{"$f":"+GETPIVOTDATA(\" BAS141\",TABLAS!$A$124)","v":0},{"$f":"SUM(G89:K89)","v":0}]
[]
[null,"I. TERAPIA PREVENTIVA (TPI-TPC)",null,null,null,null,"0-11a","12-17a","18-29a","30-59a","60-+a","Total","%"]
[null,"I1. Contactos Censados < 5 años de pacientes con TBP",null,null,null,null,null,null,null,null,null,{"$f":"+GETPIVOTDATA(\" BAS142\",TABLAS!$A$124)","v":0}]
[null,"I2. Contactos Examinados < 5 años de pacientes con TBP",null,null,null,null,null,null,null,null,null,{"$f":"+GETPIVOTDATA(\" BAS144\",TABLAS!$A$124)","v":2}]
[null,"I3. Nº de Contactos < 5 años con Terapia Preventiva con Isoniacida (TPI)",null,null,null,null,null,null,null,null,null,{"$f":"+GETPIVOTDATA(\" BAS156\",TABLAS!$A$124)","v":0}]
[null,"I4. Nº de personas con VIH positivo",null,null,null,null,{"$f":"+GETPIVOTDATA(\" BAS157\",TABLAS!$A$124)","v":0},{"$f":"+GETPIVOTDATA(\" BAS158\",TABLAS!$A$124)","v":0},{"$f":"+GETPIVOTDATA(\" BAS159\",TABLAS!$A$124)","v":0},{"$f":"+GETPIVOTDATA(\" BAS160\",TABLAS!$A$124)","v":0},{"$f":"+GETPIVOTDATA(\" BAS161\",TABLAS!$A$124)","v":0},{"$f":"SUM(G95:K95)","v":0}]
[null,"I5. N° de personas con VIH que reciben Terapia Preventiva con Isoniacida (TPI)",null,null,null,null,{"$f":"+GETPIVOTDATA(\" BAS162\",TABLAS!$A$124)","v":0},{"$f":"+GETPIVOTDATA(\" BAS163\",TABLAS!$A$124)","v":0},{"$f":"+GETPIVOTDATA(\" BAS164\",TABLAS!$A$124)","v":0},{"$f":"+GETPIVOTDATA(\" BAS165\",TABLAS!$A$124)","v":0},{"$f":"+GETPIVOTDATA(\" BAS166\",TABLAS!$A$124)","v":0},0]
[null,"I6. N° de personas con TB-VIH que reciben Terapia Preventiva con Cotrimoxazol (TPC)",null,null,null,null,{"$f":"+GETPIVOTDATA(\" BAS167\",TABLAS!$A$124)","v":0},{"$f":"+GETPIVOTDATA(\" BAS168\",TABLAS!$A$124)","v":0},{"$f":"+GETPIVOTDATA(\" BAS169\",TABLAS!$A$124)","v":0},{"$f":"+GETPIVOTDATA(\" BAS170\",TABLAS!$A$124)","v":0},{"$f":"+GETPIVOTDATA(\" BAS171\",TABLAS!$A$124)","v":0},{"$f":"SUM(G97:K97)","v":0}]
[]
[null,"J. COINFECCION  TB - VIH  (1ro TB => 2do VIH)",null,null,null,null,"0-11a","12-17a","18-29a","30-59a","60-+a","Total","%"]
[null,"J1. Total de Casos TB-VIH (J1.1+J1.2)",null,null,null,null,{"$f":"+G101+G104","v":0},{"$f":"+H101+H104","v":0},0,1,0,{"$f":"SUM(G100:K100)","v":1}]
[null,"J1.1 Total de casos TB / VIH  Nuevos (J1.1.1 + J1.1.2)",null,null,null,null,{"$f":"SUM(G102:G103)","v":0},{"$f":"SUM(H102:H103)","v":0},0,0,0,{"$f":"SUM(G101:K101)","v":0}]
[null,"J1.1.1 TB Pulmonar",null,null,null,null,{"$f":"+GETPIVOTDATA(\" BAS172\",TABLAS!$A$124)","v":0},{"$f":"+GETPIVOTDATA(\" BAS173\",TABLAS!$A$124)","v":0},{"$f":"+GETPIVOTDATA(\" BAS174\",TABLAS!$A$124)","v":0},{"$f":"+GETPIVOTDATA(\" BAS175\",TABLAS!$A$124)","v":0},{"$f":"+GETPIVOTDATA(\" BAS176\",TABLAS!$A$124)","v":0},0]
[null,"J1.1.2 TB Extrapulmonar",null,null,null,null,{"$f":"+GETPIVOTDATA(\" BAS182\",TABLAS!$A$124)","v":0},{"$f":"+GETPIVOTDATA(\" BAS183\",TABLAS!$A$124)","v":0},{"$f":"+GETPIVOTDATA(\" BAS184\",TABLAS!$A$124)","v":0},{"$f":"+GETPIVOTDATA(\" BAS185\",TABLAS!$A$124)","v":0},{"$f":"+GETPIVOTDATA(\" BAS186\",TABLAS!$A$124)","v":0},0]
[null,"J1.2 Total de casos TB/VIH  antes tratados (J1.2.1 + J1.2.2)",null,null,null,null,{"$f":"SUM(G105:G106)","v":0},{"$f":"SUM(H105:H106)","v":0},0,1,0,1]
[null,"J1.2.1 TB Pulmonar",null,null,null,null,{"$f":"+GETPIVOTDATA(\" BAS192\",TABLAS!$A$124)","v":0},{"$f":"+GETPIVOTDATA(\" BAS193\",TABLAS!$A$124)","v":0},{"$f":"+GETPIVOTDATA(\" BAS194\",TABLAS!$A$124)","v":0},{"$f":"+GETPIVOTDATA(\" BAS195\",TABLAS!$A$124)","v":1},{"$f":"+GETPIVOTDATA(\" BAS196\",TABLAS!$A$124)","v":0},1]
[null,"J1.2.2 TB Extrapulmonar",null,null,null,null,{"$f":"+GETPIVOTDATA(\" BAS197\",TABLAS!$A$124)","v":0},{"$f":"+GETPIVOTDATA(\" BAS198\",TABLAS!$A$124)","v":0},{"$f":"+GETPIVOTDATA(\" BAS199\",TABLAS!$A$124)","v":0},{"$f":"+GETPIVOTDATA(\" BAS200\",TABLAS!$A$124)","v":0},{"$f":"+GETPIVOTDATA(\" BAS201\",TABLAS!$A$124)","v":0},{"$f":"SUM(G106:K106)","v":0}]
[null,"J2. Total de casos TB/VIH que reciben TARGA ",null,null,null,null,{"$f":"+GETPIVOTDATA(\" BAS202\",TABLAS!$A$124)","v":0},{"$f":"+GETPIVOTDATA(\" BAS203\",TABLAS!$A$124)","v":0},{"$f":"+GETPIVOTDATA(\" BAS204\",TABLAS!$A$124)","v":0},{"$f":"+GETPIVOTDATA(\" BAS205\",TABLAS!$A$124)","v":0},{"$f":"+GETPIVOTDATA(\" BAS206\",TABLAS!$A$124)","v":0},{"$f":"SUM(G107:K107)","v":0}]
[]
[null,"K. TAMIZAJE DE VIH EN PACIENTES CON TB  (1ro VIH => 2do TBC)",null,null,null,null,"0-11a","12-17a","18-29a","30-59a","60-+a","Total","%"]
[null,"K1. Total de casos que recibieron consejeria pre test para VIH",null,null,null,null,{"$f":"+GETPIVOTDATA(\" BAS006\",TABLAS!$A$160)+GETPIVOTDATA(\" BAS001\",TABLAS!$A$160)","v":1},{"$f":"+GETPIVOTDATA(\" BAS007\",TABLAS!$A$160)+GETPIVOTDATA(\" BAS002\",TABLAS!$A$160)","v":3},{"$f":"+GETPIVOTDATA(\" BAS008\",TABLAS!$A$160)+GETPIVOTDATA(\" BAS003\",TABLAS!$A$160)","v":10},{"$f":"+GETPIVOTDATA(\" BAS009\",TABLAS!$A$160)+GETPIVOTDATA(\" BAS004\",TABLAS!$A$160)","v":20},{"$f":"+GETPIVOTDATA(\" BAS010\",TABLAS!$A$160)+GETPIVOTDATA(\" BAS005\",TABLAS!$A$160)","v":10},{"$f":"SUM(G110:K110)","v":44}]
[null,"K2. Total de casos que cuentan con resultado de tamizaje de VIH durante el tratamiento",null,null,null,null,{"$f":"+GETPIVOTDATA(\" BAS011\",TABLAS!$A$160)","v":0},{"$f":"+GETPIVOTDATA(\" BAS012\",TABLAS!$A$160)","v":1},{"$f":"+GETPIVOTDATA(\" BAS013\",TABLAS!$A$160)","v":6},{"$f":"+GETPIVOTDATA(\" BAS014\",TABLAS!$A$160)","v":11},{"$f":"+GETPIVOTDATA(\" BAS015\",TABLAS!$A$160)","v":5},23]
[null,"K3. Total de casos que cuentan con resultado de VIH reactivo",null,null,null,null,{"$f":"+GETPIVOTDATA(\" BAS016\",TABLAS!$A$160)+GETPIVOTDATA(\" BAS021\",TABLAS!$A$160)","v":0},{"$f":"+GETPIVOTDATA(\" BAS017\",TABLAS!$A$160)+GETPIVOTDATA(\" BAS022\",TABLAS!$A$160)","v":0},{"$f":"+GETPIVOTDATA(\" BAS018\",TABLAS!$A$160)+GETPIVOTDATA(\" BAS023\",TABLAS!$A$160)","v":0},{"$f":"+GETPIVOTDATA(\" BAS019\",TABLAS!$A$160)+GETPIVOTDATA(\" BAS024\",TABLAS!$A$160)","v":0},{"$f":"+GETPIVOTDATA(\" BAS020\",TABLAS!$A$160)+GETPIVOTDATA(\" BAS025\",TABLAS!$A$160)","v":1},1]
[]
[null,"L. MENINGITIS TB EN MENORES DE 5 Años",null,null,null,null,"0-11a","12-17a","18-29a","30-59a","60-+a","Total","%"]
[null," L1. N° casos de meningitis TB  en < de 5 años",null,null,null,null,null,null,null,null,null,{"$f":"+GETPIVOTDATA(\" BAS026\",TABLAS!$A$160)","v":0}]
[]
[null,"M. GESTANTES CON TUBERCULOSIS",null,null,null,null,"0-11a","12-17a","18-29a","30-59a","60-+a","Total","%"]
[null,"M1. N° de Gestantes con TB (M1.1+ M1.2 )",null,null,null,null,{"$f":"SUM(G119:G120)","v":0},{"$f":"SUM(H119:H120)","v":0},0,0,0,{"$f":"SUM(G118:K118)","v":0}]
[null,"M1.1 TB Pulmonar",null,null,null,null,{"$f":"+GETPIVOTDATA(\" BAS027\",TABLAS!$A$160)","v":0},{"$f":"+GETPIVOTDATA(\" BAS028\",TABLAS!$A$160)","v":0},{"$f":"+GETPIVOTDATA(\" BAS029\",TABLAS!$A$160)","v":0},{"$f":"+GETPIVOTDATA(\" BAS030\",TABLAS!$A$160)","v":0},{"$f":"+GETPIVOTDATA(\" BAS031\",TABLAS!$A$160)","v":0},{"$f":"SUM(G119:K119)","v":0}]
[null,"M1.2 TB Extrapulmonar",null,null,null,null,{"$f":"+GETPIVOTDATA(\" BAS032\",TABLAS!$A$160)","v":0},{"$f":"+GETPIVOTDATA(\" BAS033\",TABLAS!$A$160)","v":0},{"$f":"+GETPIVOTDATA(\" BAS034\",TABLAS!$A$160)","v":0},{"$f":"+GETPIVOTDATA(\" BAS035\",TABLAS!$A$160)","v":0},{"$f":"+GETPIVOTDATA(\" BAS036\",TABLAS!$A$160)","v":0},{"$f":"SUM(G120:K120)","v":0}]
[]
[null,"N. PERSONAL DE SALUD DEL EESS CON TUBERCULOSIS",null,null,null,null,"0-11a","12-17a","18-29a","30-59a","60-+a","Total","%"]
[null,"N1. N°de trabajadores del EESS con TB (N1.1+ N1.2)"]
[null,"N1.1 TB Pulmonar",null,null,null,null,{"$f":"+GETPIVOTDATA(\" BAS037\",TABLAS!$A$160)","v":0},{"$f":"+GETPIVOTDATA(\" BAS038\",TABLAS!$A$160)","v":0},{"$f":"+GETPIVOTDATA(\" BAS039\",TABLAS!$A$160)","v":0},{"$f":"+GETPIVOTDATA(\" BAS040\",TABLAS!$A$160)","v":0},{"$f":"+GETPIVOTDATA(\" BAS041\",TABLAS!$A$160)","v":0},{"$f":"SUM(G124:K124)","v":0}]
[null,"N1.2 TB Extrapulmonar",null,null,null,null,{"$f":"+GETPIVOTDATA(\" BAS042\",TABLAS!$A$160)","v":0},{"$f":"+GETPIVOTDATA(\" BAS043\",TABLAS!$A$160)","v":0},{"$f":"+GETPIVOTDATA(\" BAS044\",TABLAS!$A$160)","v":0},{"$f":"+GETPIVOTDATA(\" BAS045\",TABLAS!$A$160)","v":0},{"$f":"+GETPIVOTDATA(\" BAS046\",TABLAS!$A$160)","v":0},0]
[null,"N2. N° de trabajadores con TB-MDR confirmado ",null,null,null,null,{"$f":"+GETPIVOTDATA(\" BAS047\",TABLAS!$A$160)","v":0},{"$f":"+GETPIVOTDATA(\" BAS048\",TABLAS!$A$160)","v":0},{"$f":"+GETPIVOTDATA(\" BAS049\",TABLAS!$A$160)","v":0},{"$f":"+GETPIVOTDATA(\" BAS050\",TABLAS!$A$160)","v":0},{"$f":"+GETPIVOTDATA(\" BAS051\",TABLAS!$A$160)","v":0},{"$f":"SUM(G126:K126)","v":0}]
[]
[null,"O. COMORBILIDAD TB / DIABETES",null,null,null,null,"0-11a","12-17a","18-29a","30-59a","60-+a","Total","%"]
[null,"O1. Total de casos con TB / DIABETES (O1.1+ O1.2 )",null,null,null,null,{"$f":"SUM(G130:G131)","v":0},{"$f":"SUM(H130:H131)","v":0},0,0,0,{"$f":"SUM(G129:K129)","v":0}]
[null,"O1.1 TB Pulmonar",null,null,null,null,{"$f":"+GETPIVOTDATA(\" BAS052\",TABLAS!$A$160)+GETPIVOTDATA(\" BAS057\",TABLAS!$A$160)","v":0},{"$f":"+GETPIVOTDATA(\" BAS053\",TABLAS!$A$160)+GETPIVOTDATA(\" BAS058\",TABLAS!$A$160)","v":0},{"$f":"+GETPIVOTDATA(\" BAS054\",TABLAS!$A$160)+GETPIVOTDATA(\" BAS059\",TABLAS!$A$160)","v":0},{"$f":"+GETPIVOTDATA(\" BAS055\",TABLAS!$A$160)+GETPIVOTDATA(\" BAS060\",TABLAS!$A$160)","v":0},{"$f":"+GETPIVOTDATA(\" BAS056\",TABLAS!$A$160)+GETPIVOTDATA(\" BAS061\",TABLAS!$A$160)","v":0},{"$f":"SUM(G130:K130)","v":0}]
[null,"O1.2 TB Extrapulmonar",null,null,null,null,{"$f":"+GETPIVOTDATA(\" BAS062\",TABLAS!$A$160)+GETPIVOTDATA(\" BAS067\",TABLAS!$A$160)","v":0},{"$f":"+GETPIVOTDATA(\" BAS063\",TABLAS!$A$160)+GETPIVOTDATA(\" BAS068\",TABLAS!$A$160)","v":0},{"$f":"+GETPIVOTDATA(\" BAS064\",TABLAS!$A$160)+GETPIVOTDATA(\" BAS069\",TABLAS!$A$160)","v":0},{"$f":"+GETPIVOTDATA(\" BAS065\",TABLAS!$A$160)+GETPIVOTDATA(\" BAS070\",TABLAS!$A$160)","v":0},{"$f":"+GETPIVOTDATA(\" BAS066\",TABLAS!$A$160)+GETPIVOTDATA(\" BAS071\",TABLAS!$A$160)","v":0},{"$f":"SUM(G131:K131)","v":0}]
[]
[null,"P. TAMIZAJE DIABETES EN PACIENTES CON TB",null,null,null,null,"0-11a","12-17a","18-29a","30-59a","60-+a","Total","%"]
[null,"P1. Total de casos con TB que cuenten con resultado de glicemia durante el  tratamiento",null,null,null,null,{"$f":"+GETPIVOTDATA(\" BAS072\",TABLAS!$A$160)","v":0},{"$f":"+GETPIVOTDATA(\" BAS073\",TABLAS!$A$160)","v":1},{"$f":"+GETPIVOTDATA(\" BAS074\",TABLAS!$A$160)","v":3},{"$f":"+GETPIVOTDATA(\" BAS075\",TABLAS!$A$160)","v":8},{"$f":"+GETPIVOTDATA(\" BAS076\",TABLAS!$A$160)","v":7},{"$f":"SUM(G134:K134)","v":19}]
[]
[null,"Q. FALLECIDOS",null,null,null,null,"0-11a","12-17a","18-29a","30-59a","60-+a","Total","%"]
[null,"Q1. Nº de Pacientes fallecidos durante tratamiento TB",null,null,null,null,{"$f":"+GETPIVOTDATA(\" BAS077\",TABLAS!$A$160)","v":0},{"$f":"+GETPIVOTDATA(\" BAS078\",TABLAS!$A$160)","v":0},{"$f":"+GETPIVOTDATA(\" BAS079\",TABLAS!$A$160)","v":0},{"$f":"+GETPIVOTDATA(\" BAS080\",TABLAS!$A$160)","v":0},{"$f":"+GETPIVOTDATA(\" BAS081\",TABLAS!$A$160)","v":0},{"$f":"SUM(G137:K137)","v":0}]
[]
[null,"R. RAFA",null,null,null,null,"0-11a","12-17a","18-29a","30-59a","60-+a","Total","%"]
[null,"R1. N° de pacientes con Reacciones Adversas a Fármacos Antituberculosis",null,null,null,null,{"$f":"+GETPIVOTDATA(\" BAS082\",TABLAS!$A$160)","v":0},{"$f":"+GETPIVOTDATA(\" BAS083\",TABLAS!$A$160)","v":0},{"$f":"+GETPIVOTDATA(\" BAS084\",TABLAS!$A$160)","v":0},{"$f":"+GETPIVOTDATA(\" BAS085\",TABLAS!$A$160)","v":0},{"$f":"+GETPIVOTDATA(\" BAS086\",TABLAS!$A$160)","v":0},{"$f":"SUM(G140:K140)","v":0}]
[]
[null,"S. CASOS NUEVOS DE TUBERCULOSIS",null,null,"Sexo","Grupos de Edades según Sexo"]
[null,null,null,null,null,"0-4a","5-14a","15-24a","25-34a","35-44a","45-54a","55-64a","65-+a",null,{"$f":"+O144+O155","v":59}]
[null,"S1. TB Pulmonar Total (S1.1 +S1.2 + S1.3)",null,null,"Total",{"$f":"SUM(F145:F146)","v":2},6,3,9,5,9,0,25,null,{"$f":"SUM(F144:M144)","v":59}]
[null,null,null,null,"M",{"$f":"+F147+F149+F151+F153","v":1},{"$f":"+G147+G149+G151+G153","v":5},1,5,2,6,0,20,null,{"$f":"SUM(F145:M145)","v":40}]
[null,null,null,null,"F",{"$f":"+F148+F150+F152+F154","v":1},1,2,4,3,3,0,5,null,19]
[null,"S1.1 TB Pulmonar frotis positivo",null,null,"M",{"$f":"+GETPIVOTDATA(\" BAS087\",TABLAS!$A$160)","v":0},{"$f":"+GETPIVOTDATA(\" BAS088\",TABLAS!$A$160)","v":0},{"$f":"+GETPIVOTDATA(\" BAS089\",TABLAS!$A$160)","v":1},{"$f":"+GETPIVOTDATA(\" BAS090\",TABLAS!$A$160)","v":4},{"$f":"+GETPIVOTDATA(\" BAS091\",TABLAS!$A$160)","v":1},{"$f":"+GETPIVOTDATA(\" BAS092\",TABLAS!$A$160)","v":3},{"$f":"+GETPIVOTDATA(\" BAS093\",TABLAS!$A$160)","v":0},{"$f":"+GETPIVOTDATA(\" BAS094\",TABLAS!$A$160)","v":14},null,{"$f":"SUM(F147:M147)","v":23},{"$f":"+O147+O148","v":37}]
[null,null,null,null,"F",{"$f":"+GETPIVOTDATA(\" BAS095\",TABLAS!$A$160)","v":0},{"$f":"+GETPIVOTDATA(\" BAS096\",TABLAS!$A$160)","v":0},{"$f":"+GETPIVOTDATA(\" BAS097\",TABLAS!$A$160)","v":2},{"$f":"+GETPIVOTDATA(\" BAS098\",TABLAS!$A$160)","v":4},{"$f":"+GETPIVOTDATA(\" BAS099\",TABLAS!$A$160)","v":2},{"$f":"+GETPIVOTDATA(\" BAS100\",TABLAS!$A$160)","v":2},{"$f":"+GETPIVOTDATA(\" BAS101\",TABLAS!$A$160)","v":0},{"$f":"+GETPIVOTDATA(\" BAS102\",TABLAS!$A$160)","v":4},null,{"$f":"SUM(F148:M148)","v":14}]
[null,"S1.1 TB Pulmonar cultivo positivo FN",null,null,"M",{"$f":"+GETPIVOTDATA(\" BAS103\",TABLAS!$A$160)","v":0},{"$f":"+GETPIVOTDATA(\" BAS104\",TABLAS!$A$160)","v":1},{"$f":"+GETPIVOTDATA(\" BAS105\",TABLAS!$A$160)","v":0},{"$f":"+GETPIVOTDATA(\" BAS106\",TABLAS!$A$160)","v":0},{"$f":"+GETPIVOTDATA(\" BAS107\",TABLAS!$A$160)","v":0},{"$f":"+GETPIVOTDATA(\" BAS108\",TABLAS!$A$160)","v":0},{"$f":"+GETPIVOTDATA(\" BAS109\",TABLAS!$A$160)","v":0},{"$f":"+GETPIVOTDATA(\" BAS110\",TABLAS!$A$160)","v":4},null,5,{"$f":"+O149+O150","v":5}]
[null,null,null,null,"F",{"$f":"+GETPIVOTDATA(\" BAS111\",TABLAS!$A$160)","v":0},{"$f":"+GETPIVOTDATA(\" BAS112\",TABLAS!$A$160)","v":0},{"$f":"+GETPIVOTDATA(\" BAS113\",TABLAS!$A$160)","v":0},{"$f":"+GETPIVOTDATA(\" BAS114\",TABLAS!$A$160)","v":0},{"$f":"+GETPIVOTDATA(\" BAS115\",TABLAS!$A$160)","v":0},{"$f":"+GETPIVOTDATA(\" BAS116\",TABLAS!$A$160)","v":0},{"$f":"+GETPIVOTDATA(\" BAS117\",TABLAS!$A$160)","v":0},{"$f":"+GETPIVOTDATA(\" BAS118\",TABLAS!$A$160)","v":0},null,0]
[null,"S1.3 TB Pulmonar frotis negativo CN",null,null,"M",{"$f":"+GETPIVOTDATA(\" BAS119\",TABLAS!$A$160)","v":1},{"$f":"+GETPIVOTDATA(\" BAS120\",TABLAS!$A$160)","v":4},{"$f":"+GETPIVOTDATA(\" BAS121\",TABLAS!$A$160)","v":0},{"$f":"+GETPIVOTDATA(\" BAS122\",TABLAS!$A$160)","v":0},{"$f":"+GETPIVOTDATA(\" BAS123\",TABLAS!$A$160)","v":1},{"$f":"+GETPIVOTDATA(\" BAS124\",TABLAS!$A$160)","v":2},{"$f":"+GETPIVOTDATA(\" BAS125\",TABLAS!$A$160)","v":0},{"$f":"+GETPIVOTDATA(\" BAS126\",TABLAS!$A$160)","v":2},null,10,{"$f":"+O151+O152","v":15}]
[null,null,null,null,"F",{"$f":"+GETPIVOTDATA(\" BAS127\",TABLAS!$A$160)","v":1},{"$f":"+GETPIVOTDATA(\" BAS128\",TABLAS!$A$160)","v":1},{"$f":"+GETPIVOTDATA(\" BAS129\",TABLAS!$A$160)","v":0},{"$f":"+GETPIVOTDATA(\" BAS130\",TABLAS!$A$160)","v":0},{"$f":"+GETPIVOTDATA(\" BAS131\",TABLAS!$A$160)","v":1},{"$f":"+GETPIVOTDATA(\" BAS132\",TABLAS!$A$160)","v":1},{"$f":"+GETPIVOTDATA(\" BAS133\",TABLAS!$A$160)","v":0},{"$f":"+GETPIVOTDATA(\" BAS134\",TABLAS!$A$160)","v":1},null,5]
[null,"S1.4 TB Pulmonar sin frotis de esputo",null,null,"M",{"$f":"+GETPIVOTDATA(\" BAS135\",TABLAS!$A$160)","v":0},{"$f":"+GETPIVOTDATA(\" BAS136\",TABLAS!$A$160)","v":0},{"$f":"+GETPIVOTDATA(\" BAS137\",TABLAS!$A$160)","v":0},{"$f":"+GETPIVOTDATA(\" BAS138\",TABLAS!$A$160)","v":1},{"$f":"+GETPIVOTDATA(\" BAS139\",TABLAS!$A$160)","v":0},{"$f":"+GETPIVOTDATA(\" BAS140\",TABLAS!$A$160)","v":1},{"$f":"+GETPIVOTDATA(\" BAS141\",TABLAS!$A$160)","v":0},{"$f":"+GETPIVOTDATA(\" BAS142\",TABLAS!$A$160)","v":0},null,2,{"$f":"+O153+O154","v":2}]
[null,null,null,null,"F",{"$f":"+GETPIVOTDATA(\" BAS143\",TABLAS!$A$160)","v":0},{"$f":"+GETPIVOTDATA(\" BAS144\",TABLAS!$A$160)","v":0},{"$f":"+GETPIVOTDATA(\" BAS145\",TABLAS!$A$160)","v":0},{"$f":"+GETPIVOTDATA(\" BAS146\",TABLAS!$A$160)","v":0},{"$f":"+GETPIVOTDATA(\" BAS147\",TABLAS!$A$160)","v":0},{"$f":"+GETPIVOTDATA(\" BAS148\",TABLAS!$A$160)","v":0},{"$f":"+GETPIVOTDATA(\" BAS149\",TABLAS!$A$160)","v":0},{"$f":"+GETPIVOTDATA(\" BAS150\",TABLAS!$A$160)","v":0},null,0]
[null,"S2. TB Extrapulmonar (B2.1 +B2.2)",null,null,"Total",{"$f":"SUM(F156:F157)","v":0},{"$f":"SUM(G156:G157)","v":0},{"$f":"SUM(H156:H157)","v":0},0,0,0,0,0,null,{"$f":"SUM(F155:M155)","v":0}]
[null,null,null,null,"M",{"$f":"+F158+F160","v":0},{"$f":"+G158+G160","v":0},{"$f":"+H158+H160","v":0},0,0,0,0,0,null,{"$f":"SUM(F156:M156)","v":0}]
[null,null,null,null,"F",{"$f":"+F159+F161","v":0},{"$f":"+G159+G161","v":0},0,0,0,0,0,0,null,0]
[null,"S2.1 Con confirmación bacteriológica o histopatológica",null,null,"M",{"$f":"+GETPIVOTDATA(\" BAS151\",TABLAS!$A$160)","v":0},{"$f":"+GETPIVOTDATA(\" BAS152\",TABLAS!$A$160)","v":0},{"$f":"+GETPIVOTDATA(\" BAS153\",TABLAS!$A$160)","v":0},{"$f":"+GETPIVOTDATA(\" BAS154\",TABLAS!$A$160)","v":0},{"$f":"+GETPIVOTDATA(\" BAS155\",TABLAS!$A$160)","v":0},{"$f":"+GETPIVOTDATA(\" BAS156\",TABLAS!$A$160)","v":0},{"$f":"+GETPIVOTDATA(\" BAS157\",TABLAS!$A$160)","v":0},{"$f":"+GETPIVOTDATA(\" BAS158\",TABLAS!$A$160)","v":0},null,0,{"$f":"+O158+O159","v":0}]
[null,null,null,null,"F",{"$f":"+GETPIVOTDATA(\" BAS159\",TABLAS!$A$160)","v":0},{"$f":"+GETPIVOTDATA(\" BAS160\",TABLAS!$A$160)","v":0},{"$f":"+GETPIVOTDATA(\" BAS161\",TABLAS!$A$160)","v":0},{"$f":"+GETPIVOTDATA(\" BAS162\",TABLAS!$A$160)","v":0},{"$f":"+GETPIVOTDATA(\" BAS163\",TABLAS!$A$160)","v":0},{"$f":"+GETPIVOTDATA(\" BAS164\",TABLAS!$A$160)","v":0},{"$f":"+GETPIVOTDATA(\" BAS165\",TABLAS!$A$160)","v":0},{"$f":"+GETPIVOTDATA(\" BAS166\",TABLAS!$A$160)","v":0},null,0]
[null,"S2.2 Sin confirmación bacteriológica o histopatológica",null,null,"M",{"$f":"+GETPIVOTDATA(\" BAS167\",TABLAS!$A$160)","v":0},{"$f":"+GETPIVOTDATA(\" BAS168\",TABLAS!$A$160)","v":0},{"$f":"+GETPIVOTDATA(\" BAS169\",TABLAS!$A$160)","v":0},{"$f":"+GETPIVOTDATA(\" BAS170\",TABLAS!$A$160)","v":0},{"$f":"+GETPIVOTDATA(\" BAS171\",TABLAS!$A$160)","v":0},{"$f":"+GETPIVOTDATA(\" BAS172\",TABLAS!$A$160)","v":0},{"$f":"+GETPIVOTDATA(\" BAS173\",TABLAS!$A$160)","v":0},{"$f":"+GETPIVOTDATA(\" BAS174\",TABLAS!$A$160)","v":0},null,0,{"$f":"+O160+O161","v":0}]
[null,null,null,null,"F",{"$f":"+GETPIVOTDATA(\" BAS175\",TABLAS!$A$160)","v":0},{"$f":"+GETPIVOTDATA(\" BAS176\",TABLAS!$A$160)","v":0},{"$f":"+GETPIVOTDATA(\" BAS177\",TABLAS!$A$160)","v":0},{"$f":"+GETPIVOTDATA(\" BAS178\",TABLAS!$A$160)","v":0},{"$f":"+GETPIVOTDATA(\" BAS179\",TABLAS!$A$160)","v":0},{"$f":"+GETPIVOTDATA(\" BAS180\",TABLAS!$A$160)","v":0},{"$f":"+GETPIVOTDATA(\" BAS181\",TABLAS!$A$160)","v":0},{"$f":"+GETPIVOTDATA(\" BAS182\",TABLAS!$A$160)","v":0},null,0]
[]
[null,"A3.   S.R. Examinados / 1° Muestra",null,null,null,null,{"$f":"+GETPIVOTDATA(\" BAS012\",TABLAS!$A$124)","v":79},{"$f":"+GETPIVOTDATA(\" BAS013\",TABLAS!$A$124)","v":168},{"$f":"+GETPIVOTDATA(\" BAS014\",TABLAS!$A$124)","v":557},{"$f":"+GETPIVOTDATA(\" BAS015\",TABLAS!$A$124)","v":1653},{"$f":"+GETPIVOTDATA(\" BAS016\",TABLAS!$A$124)","v":1094},{"$f":"SUM(G163:K163)","v":3551}]
[null,"A3.   S.R. Examinados / 2° Muestra",null,null,null,null,{"$f":"+GETPIVOTDATA(\" BAS226\",TABLAS!$A$124)","v":65},{"$f":"+GETPIVOTDATA(\" BAS227\",TABLAS!$A$124)","v":163},{"$f":"+GETPIVOTDATA(\" BAS228\",TABLAS!$A$124)","v":521},{"$f":"+GETPIVOTDATA(\" BAS229\",TABLAS!$A$124)","v":1631},{"$f":"+GETPIVOTDATA(\" BAS230\",TABLAS!$A$124)","v":1075},{"$f":"SUM(G164:K164)","v":3455},{"$f":"+L164*100/L163","v":97.296536186989584}]
[null,"I3. Nº de Contactos > 5 años con Terapia Preventiva con Isoniacida (TPI)",null,null,null,null,{"$f":"+GETPIVOTDATA(\" BAS186\",TABLAS!$A$160)","v":0},{"$f":"+GETPIVOTDATA(\" BAS187\",TABLAS!$A$160)","v":0},{"$f":"+GETPIVOTDATA(\" BAS188\",TABLAS!$A$160)","v":0},{"$f":"+GETPIVOTDATA(\" BAS189\",TABLAS!$A$160)","v":0},{"$f":"+GETPIVOTDATA(\" BAS190\",TABLAS!$A$160)","v":0},{"$f":"SUM(G165:K165)","v":0}]
[null,"Registro de Bateria Completa",null,null,null,null,{"$f":"+GETPIVOTDATA(\" BAS221\",TABLAS!$A$124)","v":0},{"$f":"+GETPIVOTDATA(\" BAS222\",TABLAS!$A$124)","v":1},{"$f":"+GETPIVOTDATA(\" BAS223\",TABLAS!$A$124)","v":3},{"$f":"+GETPIVOTDATA(\" BAS224\",TABLAS!$A$124)","v":5},{"$f":"+GETPIVOTDATA(\" BAS225\",TABLAS!$A$124)","v":4},{"$f":"SUM(G166:K166)","v":13}]
[]
[null,null,null,null,null,null,"Primera Fase",null,"Segunda Fase"]
[null,null,null,null,null,null,"1° Dosis","50° Dosis","51° Dosis","TA Dosis"]
[null,"Tratamiento con TBC Sensible",null,"Esquema TBC Sensible (Sin VIH/SIDA)",null,null,{"$f":"+GETPIVOTDATA(\" BAS001\",TABLAS!$A$195)","v":33},{"$f":"+GETPIVOTDATA(\" BAS002\",TABLAS!$A$195)","v":26},{"$f":"+GETPIVOTDATA(\" BAS003\",TABLAS!$A$195)","v":7},{"$f":"+GETPIVOTDATA(\" BAS004\",TABLAS!$A$195)","v":15}]
[null,null,null,"Esquema TBC Sensible Extrapulmonar",null,null,{"$f":"+GETPIVOTDATA(\" BAS005\",TABLAS!$A$195)","v":0},{"$f":"+GETPIVOTDATA(\" BAS006\",TABLAS!$A$195)","v":1},{"$f":"+GETPIVOTDATA(\" BAS007\",TABLAS!$A$195)","v":1},{"$f":"+GETPIVOTDATA(\" BAS008\",TABLAS!$A$195)","v":5}]
[null,null,null,"Esquema TBC Sensible Extrapulmonar C/SNC-O",null,null,{"$f":"+GETPIVOTDATA(\" BAS009\",TABLAS!$A$195)","v":1},{"$f":"+GETPIVOTDATA(\" BAS010\",TABLAS!$A$195)","v":0},{"$f":"+GETPIVOTDATA(\" BAS011\",TABLAS!$A$195)","v":0},{"$f":"+GETPIVOTDATA(\" BAS012\",TABLAS!$A$195)","v":0}]
[null,null,null,"Esquema TBC Sensible (Con VIH/SIDA)",null,null,{"$f":"+GETPIVOTDATA(\" BAS013\",TABLAS!$A$195)","v":1},{"$f":"+GETPIVOTDATA(\" BAS014\",TABLAS!$A$195)","v":0},{"$f":"+GETPIVOTDATA(\" BAS015\",TABLAS!$A$195)","v":0},{"$f":"+GETPIVOTDATA(\" BAS016\",TABLAS!$A$195)","v":0}]
[null,"Tratamiento con MDR",null,"Esquema Individualizado",null,null,{"$f":"+GETPIVOTDATA(\" BAS017\",TABLAS!$A$195)","v":246},null,null,{"$f":"+GETPIVOTDATA(\" BAS018\",TABLAS!$A$195)","v":177}]
[null,null,null,"Esquema Estandarizado",null,null,{"$f":"+GETPIVOTDATA(\" BAS019\",TABLAS!$A$195)","v":1},null,null,{"$f":"+GETPIVOTDATA(\" BAS020\",TABLAS!$A$195)","v":10}]
[null,null,null,"Esquema Empírico",null,null,{"$f":"+GETPIVOTDATA(\" BAS021\",TABLAS!$A$195)","v":0},null,null,{"$f":"+GETPIVOTDATA(\" BAS022\",TABLAS!$A$195)","v":10}]
[]
[]
[]
[]
[]
[]
[null,null,"Firma y Sello del Responsable de la ES PCT"]

{"sheet":"INF BACTERIO","index":3,"n_rows":59,"n_cols":44,"rows_kept":59,"cut":false,"hidden":false,"merged":[[12,3,12,4],[0,0,0,13],[1,0,1,13],[2,0,2,13],[3,0,3,13],[4,0,4,13],[6,3,6,4],[7,3,7,4],[8,3,8,4],[9,3,9,4],[10,3,10,4],[11,3,11,4],[30,0,30,3],[13,3,13,4],[14,3,14,4],[15,3,15,4],[16,3,16,4],[18,0,18,13],[19,0,20,3],[19,4,19,13],[21,0,21,3],[22,0,26,0],[27,0,27,3],[28,0,29,3],[28,4,28,12],[50,4,50,12],[31,0,35,0],[36,0,36,3],[37,0,37,3],[38,0,38,13],[39,0,40,3],[39,4,39,13],[53,0,57,0],[58,0,58,3],[42,0,46,0],[47,0,47,3],[48,0,48,3],[49,0,49,3],[50,0,51,3]]}
["DIRECCION REGIONAL DE SALUD CUSCO"]
["DIRECCION EJECUTIVA DE INTELIGENCIA SANITARIA"]
["DIRECCION DE ESTADISTICA, INFORMATICA Y TELECOMUNICACION"]
[]
["CONSOLIDADO MENSUAL - ESTRATEGIAS Y COMPONENTES"]
[]
[null,"DIRESA",null,{"$f":"INFORME!C9","v":"CUSCO"},null,null,"AÑO",{"$f":"INFORME!G19","v":"FEB - NOV"}]
[]
[null,"RED DE SALUD ",null,{"$f":"INFORME!C11","v":"03 - LA CONVENCION"},null,null,"MES",{"$f":"INFORME!G17","v":"2024"}]
[]
[null,"MICRO RED",null,{"$f":"INFORME!C13","v":""}]
[]
[null,"EE.SS.",null,{"$f":"+INFORME!C15","v":""}]
[]
[null,"PROVINCIA",null,{"$f":"INFORME!C17","v":""}]
[]
[null,"DISTRITO",null,{"$f":"INFORME!C19","v":""}]
[]
["BACTERIOLOGICO (TUBERCULOSIS)",null,null,null,null,null,null,null,null,null,null,null,null,null,null,null,null,null,null,null,null,null,null,null,null,null,null,{"$f":"+GETPIVOTDATA(\" BAS001\",TABLAS!$A$230)","v":0},{"$f":"+GETPIVOTDATA(\" BAS002\",TABLAS!$A$230)","v":0},{"$f":"+GETPIVOTDATA(\" BAS003\",TABLAS!$A$230)","v":0},{"$f":"+GETPIVOTDATA(\" BAS004\",TABLAS!$A$230)","v":0},{"$f":"+GETPIVOTDATA(\" BAS005\",TABLAS!$A$230)","v":0},{"$f":"+GETPIVOTDATA(\" BAS006\",TABLAS!$A$230)","v":0},{"$f":"+GETPIVOTDATA(\" BAS007\",TABLAS!$A$230)","v":0},{"$f":"+GETPIVOTDATA(\" BAS008\",TABLAS!$A$230)","v":0}]
["Tipo",null,null,null,"REALIZADO"]
[null,null,null,null,"0-11a","12-14a","15-17a","18-24a","25-29a","30-44a","45-59a","60-+a","TOTAL","Acumulado"]
["TOTAL",null,null,null,null,null,null,null,null,null,null,null,null,null,null,null,null,null,null,null,null,null,null,null,null,"=+IMPORTARDATOSDINAMICOS(\" BAS",null,null,null,null,"\",TABLAS!$A$179)"]
["DIAGNOSTICO","En Sintomatico Respiratorio",null,null,{"$f":"+GETPIVOTDATA(\" BAS001\",TABLAS!$A$230)","v":0},{"$f":"+GETPIVOTDATA(\" BAS002\",TABLAS!$A$230)","v":0},{"$f":"+GETPIVOTDATA(\" BAS003\",TABLAS!$A$230)","v":0},{"$f":"+GETPIVOTDATA(\" BAS004\",TABLAS!$A$230)","v":0},{"$f":"+GETPIVOTDATA(\" BAS005\",TABLAS!$A$230)","v":0},{"$f":"+GETPIVOTDATA(\" BAS006\",TABLAS!$A$230)","v":0},{"$f":"+GETPIVOTDATA(\" BAS007\",TABLAS!$A$230)","v":0},{"$f":"+GETPIVOTDATA(\" BAS008\",TABLAS!$A$230)","v":0},{"$f":"SUM(E23:L23)","v":0},null,null,null,null,"001","002","003","004","005","006","007","008",null,null,{"$f":"CONCATENATE($Z$22,R23,$AE$22)","v":"=+IMPORTARDATOSDINAMICOS(\" BAS001\",TABLAS!$A$179)"},{"$f":"CONCATENATE($Z$22,S23,$AE$22)","v":"=+IMPORTARDATOSDINAMICOS(\" BAS002\",TABLAS!$A$179)"},"=+IMPORTARDATOSDINAMICOS(\" BAS003\",TABLAS!$A$179)","=+IMPORTARDATOSDINAMICOS(\" BAS004\",TABLAS!$A$179)","=+IMPORTARDATOSDINAMICOS(\" BAS005\",TABLAS!$A$179)","=+IMPORTARDATOSDINAMICOS(\" BAS006\",TABLAS!$A$179)","=+IMPORTARDATOSDINAMICOS(\" BAS007\",TABLAS!$A$179)","=+IMPORTARDATOSDINAMICOS(\" BAS008\",TABLAS!$A$179)",null,"=+IMPORTARDATOSDINAMICOS(\" BAS001\",TABLAS!$A$179)","=+IMPORTARDATOSDINAMICOS(\" BAS002\",TABLAS!$A$179)","=+IMPORTARDATOSDINAMICOS(\" BAS003\",TABLAS!$A$179)","=+IMPORTARDATOSDINAMICOS(\" BAS004\",TABLAS!$A$179)","=+IMPORTARDATOSDINAMICOS(\" BAS005\",TABLAS!$A$179)","=+IMPORTARDATOSDINAMICOS(\" BAS006\",TABLAS!$A$179)","=+IMPORTARDATOSDINAMICOS(\" BAS007\",TABLAS!$A$179)","=+IMPORTARDATOSDINAMICOS(\" BAS008\",TABLAS!$A$179)"]
[null,"En RX Anormal",null,null,{"$f":"+GETPIVOTDATA(\" BAS009\",TABLAS!$A$230)","v":0},{"$f":"+GETPIVOTDATA(\" BAS010\",TABLAS!$A$230)","v":0},{"$f":"+GETPIVOTDATA(\" BAS011\",TABLAS!$A$230)","v":0},{"$f":"+GETPIVOTDATA(\" BAS012\",TABLAS!$A$230)","v":0},{"$f":"+GETPIVOTDATA(\" BAS013\",TABLAS!$A$230)","v":0},{"$f":"+GETPIVOTDATA(\" BAS014\",TABLAS!$A$230)","v":0},{"$f":"+GETPIVOTDATA(\" BAS015\",TABLAS!$A$230)","v":0},{"$f":"+GETPIVOTDATA(\" BAS016\",TABLAS!$A$230)","v":0},0,null,null,null,null,"009","010","011","012","013","014","015","016",null,null,{"$f":"CONCATENATE($Z$22,R24,$AE$22)","v":"=+IMPORTARDATOSDINAMICOS(\" BAS009\",TABLAS!$A$179)"},{"$f":"CONCATENATE($Z$22,S24,$AE$22)","v":"=+IMPORTARDATOSDINAMICOS(\" BAS010\",TABLAS!$A$179)"},{"$f":"CONCATENATE($Z$22,T24,$AE$22)","v":"=+IMPORTARDATOSDINAMICOS(\" BAS011\",TABLAS!$A$179)"},{"$f":"CONCATENATE($Z$22,U24,$AE$22)","v":"=+IMPORTARDATOSDINAMICOS(\" BAS012\",TABLAS!$A$179)"},{"$f":"CONCATENATE($Z$22,V24,$AE$22)","v":"=+IMPORTARDATOSDINAMICOS(\" BAS013\",TABLAS!$A$179)"},{"$f":"CONCATENATE($Z$22,W24,$AE$22)","v":"=+IMPORTARDATOSDINAMICOS(\" BAS014\",TABLAS!$A$179)"},{"$f":"CONCATENATE($Z$22,X24,$AE$22)","v":"=+IMPORTARDATOSDINAMICOS(\" BAS015\",TABLAS!$A$179)"},{"$f":"CONCATENATE($Z$22,Y24,$AE$22)","v":"=+IMPORTARDATOSDINAMICOS(\" BAS016\",TABLAS!$A$179)"},null,"=+IMPORTARDATOSDINAMICOS(\" BAS009\",TABLAS!$A$179)","=+IMPORTARDATOSDINAMICOS(\" BAS010\",TABLAS!$A$179)","=+IMPORTARDATOSDINAMICOS(\" BAS011\",TABLAS!$A$179)","=+IMPORTARDATOSDINAMICOS(\" BAS012\",TABLAS!$A$179)","=+IMPORTARDATOSDINAMICOS(\" BAS013\",TABLAS!$A$179)","=+IMPORTARDATOSDINAMICOS(\" BAS014\",TABLAS!$A$179)","=+IMPORTARDATOSDINAMICOS(\" BAS015\",TABLAS!$A$179)","=+IMPORTARDATOSDINAMICOS(\" BAS016\",TABLAS!$A$179)"]
[null,"En Seguimiento Diagnostico",null,null,{"$f":"+GETPIVOTDATA(\" BAS017\",TABLAS!$A$230)","v":0},{"$f":"+GETPIVOTDATA(\" BAS018\",TABLAS!$A$230)","v":0},{"$f":"+GETPIVOTDATA(\" BAS019\",TABLAS!$A$230)","v":0},{"$f":"+GETPIVOTDATA(\" BAS020\",TABLAS!$A$230)","v":0},{"$f":"+GETPIVOTDATA(\" BAS021\",TABLAS!$A$230)","v":0},{"$f":"+GETPIVOTDATA(\" BAS022\",TABLAS!$A$230)","v":0},{"$f":"+GETPIVOTDATA(\" BAS023\",TABLAS!$A$230)","v":0},{"$f":"+GETPIVOTDATA(\" BAS024\",TABLAS!$A$230)","v":0},0,null,null,null,null,"017","018","019","020","021","022","023","024",null,null,"=+IMPORTARDATOSDINAMICOS(\" BAS017\",TABLAS!$A$179)","=+IMPORTARDATOSDINAMICOS(\" BAS018\",TABLAS!$A$179)","=+IMPORTARDATOSDINAMICOS(\" BAS019\",TABLAS!$A$179)","=+IMPORTARDATOSDINAMICOS(\" BAS020\",TABLAS!$A$179)","=+IMPORTARDATOSDINAMICOS(\" BAS021\",TABLAS!$A$179)","=+IMPORTARDATOSDINAMICOS(\" BAS022\",TABLAS!$A$179)","=+IMPORTARDATOSDINAMICOS(\" BAS023\",TABLAS!$A$179)","=+IMPORTARDATOSDINAMICOS(\" BAS024\",TABLAS!$A$179)",null,"=+IMPORTARDATOSDINAMICOS(\" BAS017\",TABLAS!$A$179)","=+IMPORTARDATOSDINAMICOS(\" BAS018\",TABLAS!$A$179)","=+IMPORTARDATOSDINAMICOS(\" BAS019\",TABLAS!$A$179)","=+IMPORTARDATOSDINAMICOS(\" BAS020\",TABLAS!$A$179)","=+IMPORTARDATOSDINAMICOS(\" BAS021\",TABLAS!$A$179)","=+IMPORTARDATOSDINAMICOS(\" BAS022\",TABLAS!$A$179)","=+IMPORTARDATOSDINAMICOS(\" BAS023\",TABLAS!$A$179)","=+IMPORTARDATOSDINAMICOS(\" BAS024\",TABLAS!$A$179)"]
[null,"En Localizacion Extrapulmonar",null,null,{"$f":"+GETPIVOTDATA(\" BAS025\",TABLAS!$A$230)","v":0},{"$f":"+GETPIVOTDATA(\" BAS026\",TABLAS!$A$230)","v":0},{"$f":"+GETPIVOTDATA(\" BAS027\",TABLAS!$A$230)","v":0},{"$f":"+GETPIVOTDATA(\" BAS028\",TABLAS!$A$230)","v":0},{"$f":"+GETPIVOTDATA(\" BAS029\",TABLAS!$A$230)","v":0},{"$f":"+GETPIVOTDATA(\" BAS030\",TABLAS!$A$230)","v":0},{"$f":"+GETPIVOTDATA(\" BAS031\",TABLAS!$A$230)","v":0},{"$f":"+GETPIVOTDATA(\" BAS032\",TABLAS!$A$230)","v":0},0,null,null,null,null,"025","026","027","028","029","030","031","032",null,null,"=+IMPORTARDATOSDINAMICOS(\" BAS025\",TABLAS!$A$179)","=+IMPORTARDATOSDINAMICOS(\" BAS026\",TABLAS!$A$179)","=+IMPORTARDATOSDINAMICOS(\" BAS027\",TABLAS!$A$179)","=+IMPORTARDATOSDINAMICOS(\" BAS028\",TABLAS!$A$179)","=+IMPORTARDATOSDINAMICOS(\" BAS029\",TABLAS!$A$179)","=+IMPORTARDATOSDINAMICOS(\" BAS030\",TABLAS!$A$179)","=+IMPORTARDATOSDINAMICOS(\" BAS031\",TABLAS!$A$179)","=+IMPORTARDATOSDINAMICOS(\" BAS032\",TABLAS!$A$179)",null,"=+IMPORTARDATOSDINAMICOS(\" BAS025\",TABLAS!$A$179)","=+IMPORTARDATOSDINAMICOS(\" BAS026\",TABLAS!$A$179)","=+IMPORTARDATOSDINAMICOS(\" BAS027\",TABLAS!$A$179)","=+IMPORTARDATOSDINAMICOS(\" BAS028\",TABLAS!$A$179)","=+IMPORTARDATOSDINAMICOS(\" BAS029\",TABLAS!$A$179)","=+IMPORTARDATOSDINAMICOS(\" BAS030\",TABLAS!$A$179)","=+IMPORTARDATOSDINAMICOS(\" BAS031\",TABLAS!$A$179)","=+IMPORTARDATOSDINAMICOS(\" BAS032\",TABLAS!$A$179)"]
[null,"Total de Diagnostico",null,null,{"$f":"SUM(E23:E26)","v":0},{"$f":"SUM(F23:F26)","v":0},0,0,0,0,0,0,0]
["CONTROL DE TRATAMIENTO",null,null,null,{"$f":"+GETPIVOTDATA(\" BAS033\",TABLAS!$A$230)","v":0},{"$f":"+GETPIVOTDATA(\" BAS034\",TABLAS!$A$230)","v":0},{"$f":"+GETPIVOTDATA(\" BAS035\",TABLAS!$A$230)","v":0},{"$f":"+GETPIVOTDATA(\" BAS036\",TABLAS!$A$230)","v":0},{"$f":"+GETPIVOTDATA(\" BAS037\",TABLAS!$A$230)","v":0},{"$f":"+GETPIVOTDATA(\" BAS038\",TABLAS!$A$230)","v":0},{"$f":"+GETPIVOTDATA(\" BAS039\",TABLAS!$A$230)","v":0},{"$f":"+GETPIVOTDATA(\" BAS040\",TABLAS!$A$230)","v":0},0,null,null,null,null,"033","034","035","036","037","038","039","040",null,null,{"$f":"CONCATENATE($Z$22,R28,$AE$22)","v":"=+IMPORTARDATOSDINAMICOS(\" BAS033\",TABLAS!$A$179)"},{"$f":"CONCATENATE($Z$22,S28,$AE$22)","v":"=+IMPORTARDATOSDINAMICOS(\" BAS034\",TABLAS!$A$179)"},{"$f":"CONCATENATE($Z$22,T28,$AE$22)","v":"=+IMPORTARDATOSDINAMICOS(\" BAS035\",TABLAS!$A$179)"},{"$f":"CONCATENATE($Z$22,U28,$AE$22)","v":"=+IMPORTARDATOSDINAMICOS(\" BAS036\",TABLAS!$A$179)"},{"$f":"CONCATENATE($Z$22,V28,$AE$22)","v":"=+IMPORTARDATOSDINAMICOS(\" BAS037\",TABLAS!$A$179)"},{"$f":"CONCATENATE($Z$22,W28,$AE$22)","v":"=+IMPORTARDATOSDINAMICOS(\" BAS038\",TABLAS!$A$179)"},{"$f":"CONCATENATE($Z$22,X28,$AE$22)","v":"=+IMPORTARDATOSDINAMICOS(\" BAS039\",TABLAS!$A$179)"},{"$f":"CONCATENATE($Z$22,Y28,$AE$22)","v":"=+IMPORTARDATOSDINAMICOS(\" BAS040\",TABLAS!$A$179)"},null,"=+IMPORTARDATOSDINAMICOS(\" BAS033\",TABLAS!$A$179)","=+IMPORTARDATOSDINAMICOS(\" BAS034\",TABLAS!$A$179)","=+IMPORTARDATOSDINAMICOS(\" BAS035\",TABLAS!$A$179)","=+IMPORTARDATOSDINAMICOS(\" BAS036\",TABLAS!$A$179)","=+IMPORTARDATOSDINAMICOS(\" BAS037\",TABLAS!$A$179)","=+IMPORTARDATOSDINAMICOS(\" BAS038\",TABLAS!$A$179)","=+IMPORTARDATOSDINAMICOS(\" BAS039\",TABLAS!$A$179)","=+IMPORTARDATOSDINAMICOS(\" BAS040\",TABLAS!$A$179)"]
["Tipo",null,null,null,"POSITIVO"]
[null,null,null,null,"0-11a","12-14a","15-17a","18-24a","25-29a","30-44a","45-59a","60-+a","TOTAL","Acumulado"]
["TOTAL"]
["DIAGNOSTICO","En Sintomatico Respiratorio",null,null,{"$f":"+GETPIVOTDATA(\" BAS041\",TABLAS!$A$230)","v":0},{"$f":"+GETPIVOTDATA(\" BAS042\",TABLAS!$A$230)","v":0},{"$f":"+GETPIVOTDATA(\" BAS043\",TABLAS!$A$230)","v":0},{"$f":"+GETPIVOTDATA(\" BAS044\",TABLAS!$A$230)","v":0},{"$f":"+GETPIVOTDATA(\" BAS045\",TABLAS!$A$230)","v":0},{"$f":"+GETPIVOTDATA(\" BAS046\",TABLAS!$A$230)","v":0},{"$f":"+GETPIVOTDATA(\" BAS047\",TABLAS!$A$230)","v":0},{"$f":"+GETPIVOTDATA(\" BAS048\",TABLAS!$A$230)","v":0},{"$f":"SUM(E32:L32)","v":0},null,null,null,null,"041","042","043","044","045","046","047","048",null,null,{"$f":"CONCATENATE($Z$22,R32,$AE$22)","v":"=+IMPORTARDATOSDINAMICOS(\" BAS041\",TABLAS!$A$179)"},{"$f":"CONCATENATE($Z$22,S32,$AE$22)","v":"=+IMPORTARDATOSDINAMICOS(\" BAS042\",TABLAS!$A$179)"},{"$f":"CONCATENATE($Z$22,T32,$AE$22)","v":"=+IMPORTARDATOSDINAMICOS(\" BAS043\",TABLAS!$A$179)"},{"$f":"CONCATENATE($Z$22,U32,$AE$22)","v":"=+IMPORTARDATOSDINAMICOS(\" BAS044\",TABLAS!$A$179)"},{"$f":"CONCATENATE($Z$22,V32,$AE$22)","v":"=+IMPORTARDATOSDINAMICOS(\" BAS045\",TABLAS!$A$179)"},{"$f":"CONCATENATE($Z$22,W32,$AE$22)","v":"=+IMPORTARDATOSDINAMICOS(\" BAS046\",TABLAS!$A$179)"},{"$f":"CONCATENATE($Z$22,X32,$AE$22)","v":"=+IMPORTARDATOSDINAMICOS(\" BAS047\",TABLAS!$A$179)"},{"$f":"CONCATENATE($Z$22,Y32,$AE$22)","v":"=+IMPORTARDATOSDINAMICOS(\" BAS048\",TABLAS!$A$179)"},null,"=+IMPORTARDATOSDINAMICOS(\" BAS041\",TABLAS!$A$179)","=+IMPORTARDATOSDINAMICOS(\" BAS042\",TABLAS!$A$179)","=+IMPORTARDATOSDINAMICOS(\" BAS043\",TABLAS!$A$179)","=+IMPORTARDATOSDINAMICOS(\" BAS044\",TABLAS!$A$179)","=+IMPORTARDATOSDINAMICOS(\" BAS045\",TABLAS!$A$179)","=+IMPORTARDATOSDINAMICOS(\" BAS046\",TABLAS!$A$179)","=+IMPORTARDATOSDINAMICOS(\" BAS047\",TABLAS!$A$179)","=+IMPORTARDATOSDINAMICOS(\" BAS048\",TABLAS!$A$179)"]
[null,"En RX Anormal",null,null,{"$f":"+GETPIVOTDATA(\" BAS049\",TABLAS!$A$230)","v":0},{"$f":"+GETPIVOTDATA(\" BAS050\",TABLAS!$A$230)","v":0},{"$f":"+GETPIVOTDATA(\" BAS051\",TABLAS!$A$230)","v":0},{"$f":"+GETPIVOTDATA(\" BAS052\",TABLAS!$A$230)","v":0},{"$f":"+GETPIVOTDATA(\" BAS053\",TABLAS!$A$230)","v":0},{"$f":"+GETPIVOTDATA(\" BAS054\",TABLAS!$A$230)","v":0},{"$f":"+GETPIVOTDATA(\" BAS055\",TABLAS!$A$230)","v":0},{"$f":"+GETPIVOTDATA(\" BAS056\",TABLAS!$A$230)","v":0},0,null,null,null,null,"049","050","051","052","053","054","055","056",null,null,"=+IMPORTARDATOSDINAMICOS(\" BAS049\",TABLAS!$A$179)","=+IMPORTARDATOSDINAMICOS(\" BAS050\",TABLAS!$A$179)","=+IMPORTARDATOSDINAMICOS(\" BAS051\",TABLAS!$A$179)","=+IMPORTARDATOSDINAMICOS(\" BAS052\",TABLAS!$A$179)","=+IMPORTARDATOSDINAMICOS(\" BAS053\",TABLAS!$A$179)","=+IMPORTARDATOSDINAMICOS(\" BAS054\",TABLAS!$A$179)","=+IMPORTARDATOSDINAMICOS(\" BAS055\",TABLAS!$A$179)","=+IMPORTARDATOSDINAMICOS(\" BAS056\",TABLAS!$A$179)",null,"=+IMPORTARDATOSDINAMICOS(\" BAS049\",TABLAS!$A$179)","=+IMPORTARDATOSDINAMICOS(\" BAS050\",TABLAS!$A$179)","=+IMPORTARDATOSDINAMICOS(\" BAS051\",TABLAS!$A$179)","=+IMPORTARDATOSDINAMICOS(\" BAS052\",TABLAS!$A$179)","=+IMPORTARDATOSDINAMICOS(\" BAS053\",TABLAS!$A$179)","=+IMPORTARDATOSDINAMICOS(\" BAS054\",TABLAS!$A$179)","=+IMPORTARDATOSDINAMICOS(\" BAS055\",TABLAS!$A$179)","=+IMPORTARDATOSDINAMICOS(\" BAS056\",TABLAS!$A$179)"]
[null,"En Seguimiento Diagnostico",null,null,{"$f":"+GETPIVOTDATA(\" BAS057\",TABLAS!$A$230)","v":0},{"$f":"+GETPIVOTDATA(\" BAS058\",TABLAS!$A$230)","v":0},{"$f":"+GETPIVOTDATA(\" BAS059\",TABLAS!$A$230)","v":0},{"$f":"+GETPIVOTDATA(\" BAS060\",TABLAS!$A$230)","v":0},{"$f":"+GETPIVOTDATA(\" BAS061\",TABLAS!$A$230)","v":0},{"$f":"+GETPIVOTDATA(\" BAS062\",TABLAS!$A$230)","v":0},{"$f":"+GETPIVOTDATA(\" BAS063\",TABLAS!$A$230)","v":0},{"$f":"+GETPIVOTDATA(\" BAS064\",TABLAS!$A$230)","v":0},0,null,null,null,null,"057","058","059","060","061","062","063","064",null,null,"=+IMPORTARDATOSDINAMICOS(\" BAS057\",TABLAS!$A$179)","=+IMPORTARDATOSDINAMICOS(\" BAS058\",TABLAS!$A$179)","=+IMPORTARDATOSDINAMICOS(\" BAS059\",TABLAS!$A$179)","=+IMPORTARDATOSDINAMICOS(\" BAS060\",TABLAS!$A$179)","=+IMPORTARDATOSDINAMICOS(\" BAS061\",TABLAS!$A$179)","=+IMPORTARDATOSDINAMICOS(\" BAS062\",TABLAS!$A$179)","=+IMPORTARDATOSDINAMICOS(\" BAS063\",TABLAS!$A$179)","=+IMPORTARDATOSDINAMICOS(\" BAS064\",TABLAS!$A$179)",null,"=+IMPORTARDATOSDINAMICOS(\" BAS057\",TABLAS!$A$179)","=+IMPORTARDATOSDINAMICOS(\" BAS058\",TABLAS!$A$179)","=+IMPORTARDATOSDINAMICOS(\" BAS059\",TABLAS!$A$179)","=+IMPORTARDATOSDINAMICOS(\" BAS060\",TABLAS!$A$179)","=+IMPORTARDATOSDINAMICOS(\" BAS061\",TABLAS!$A$179)","=+IMPORTARDATOSDINAMICOS(\" BAS062\",TABLAS!$A$179)","=+IMPORTARDATOSDINAMICOS(\" BAS063\",TABLAS!$A$179)","=+IMPORTARDATOSDINAMICOS(\" BAS064\",TABLAS!$A$179)"]
[null,"En Localizacion Extrapulmonar",null,null,{"$f":"+GETPIVOTDATA(\" BAS065\",TABLAS!$A$230)","v":0},{"$f":"+GETPIVOTDATA(\" BAS066\",TABLAS!$A$230)","v":0},{"$f":"+GETPIVOTDATA(\" BAS067\",TABLAS!$A$230)","v":0},{"$f":"+GETPIVOTDATA(\" BAS068\",TABLAS!$A$230)","v":0},{"$f":"+GETPIVOTDATA(\" BAS069\",TABLAS!$A$230)","v":0},{"$f":"+GETPIVOTDATA(\" BAS070\",TABLAS!$A$230)","v":0},{"$f":"+GETPIVOTDATA(\" BAS071\",TABLAS!$A$230)","v":0},{"$f":"+GETPIVOTDATA(\" BAS072\",TABLAS!$A$230)","v":0},0,null,null,null,null,"065","066","067","068","069","070","071","072",null,null,"=+IMPORTARDATOSDINAMICOS(\" BAS065\",TABLAS!$A$179)","=+IMPORTARDATOSDINAMICOS(\" BAS066\",TABLAS!$A$179)","=+IMPORTARDATOSDINAMICOS(\" BAS067\",TABLAS!$A$179)","=+IMPORTARDATOSDINAMICOS(\" BAS068\",TABLAS!$A$179)","=+IMPORTARDATOSDINAMICOS(\" BAS069\",TABLAS!$A$179)","=+IMPORTARDATOSDINAMICOS(\" BAS070\",TABLAS!$A$179)","=+IMPORTARDATOSDINAMICOS(\" BAS071\",TABLAS!$A$179)","=+IMPORTARDATOSDINAMICOS(\" BAS072\",TABLAS!$A$179)",null,"=+IMPORTARDATOSDINAMICOS(\" BAS065\",TABLAS!$A$179)","=+IMPORTARDATOSDINAMICOS(\" BAS066\",TABLAS!$A$179)","=+IMPORTARDATOSDINAMICOS(\" BAS067\",TABLAS!$A$179)","=+IMPORTARDATOSDINAMICOS(\" BAS068\",TABLAS!$A$179)","=+IMPORTARDATOSDINAMICOS(\" BAS069\",TABLAS!$A$179)","=+IMPORTARDATOSDINAMICOS(\" BAS070\",TABLAS!$A$179)","=+IMPORTARDATOSDINAMICOS(\" BAS071\",TABLAS!$A$179)","=+IMPORTARDATOSDINAMICOS(\" BAS072\",TABLAS!$A$179)"]
[null,"Total de Diagnostico",null,null,{"$f":"SUM(E32:E35)","v":0},{"$f":"SUM(F32:F35)","v":0},0,0,0,0,0,0,0]
["CONTROL DE TRATAMIENTO",null,null,null,{"$f":"+GETPIVOTDATA(\" BAS073\",TABLAS!$A$230)","v":0},{"$f":"+GETPIVOTDATA(\" BAS074\",TABLAS!$A$230)","v":0},{"$f":"+GETPIVOTDATA(\" BAS075\",TABLAS!$A$230)","v":0},{"$f":"+GETPIVOTDATA(\" BAS076\",TABLAS!$A$230)","v":0},{"$f":"+GETPIVOTDATA(\" BAS077\",TABLAS!$A$230)","v":0},{"$f":"+GETPIVOTDATA(\" BAS078\",TABLAS!$A$230)","v":0},{"$f":"+GETPIVOTDATA(\" BAS079\",TABLAS!$A$230)","v":0},{"$f":"+GETPIVOTDATA(\" BAS080\",TABLAS!$A$230)","v":0},0,null,null,null,null,"073","074","075","076","077","078","079","080",null,null,{"$f":"CONCATENATE($Z$22,R37,$AE$22)","v":"=+IMPORTARDATOSDINAMICOS(\" BAS073\",TABLAS!$A$179)"},{"$f":"CONCATENATE($Z$22,S37,$AE$22)","v":"=+IMPORTARDATOSDINAMICOS(\" BAS074\",TABLAS!$A$179)"},{"$f":"CONCATENATE($Z$22,T37,$AE$22)","v":"=+IMPORTARDATOSDINAMICOS(\" BAS075\",TABLAS!$A$179)"},{"$f":"CONCATENATE($Z$22,U37,$AE$22)","v":"=+IMPORTARDATOSDINAMICOS(\" BAS076\",TABLAS!$A$179)"},{"$f":"CONCATENATE($Z$22,V37,$AE$22)","v":"=+IMPORTARDATOSDINAMICOS(\" BAS077\",TABLAS!$A$179)"},{"$f":"CONCATENATE($Z$22,W37,$AE$22)","v":"=+IMPORTARDATOSDINAMICOS(\" BAS078\",TABLAS!$A$179)"},{"$f":"CONCATENATE($Z$22,X37,$AE$22)","v":"=+IMPORTARDATOSDINAMICOS(\" BAS079\",TABLAS!$A$179)"},{"$f":"CONCATENATE($Z$22,Y37,$AE$22)","v":"=+IMPORTARDATOSDINAMICOS(\" BAS080\",TABLAS!$A$179)"},null,"=+IMPORTARDATOSDINAMICOS(\" BAS073\",TABLAS!$A$179)","=+IMPORTARDATOSDINAMICOS(\" BAS074\",TABLAS!$A$179)","=+IMPORTARDATOSDINAMICOS(\" BAS075\",TABLAS!$A$179)","=+IMPORTARDATOSDINAMICOS(\" BAS076\",TABLAS!$A$179)","=+IMPORTARDATOSDINAMICOS(\" BAS077\",TABLAS!$A$179)","=+IMPORTARDATOSDINAMICOS(\" BAS078\",TABLAS!$A$179)","=+IMPORTARDATOSDINAMICOS(\" BAS079\",TABLAS!$A$179)","=+IMPORTARDATOSDINAMICOS(\" BAS080\",TABLAS!$A$179)"]
[]
["CULTIVOS (TUBERCULOSIS)"]
["Tipo",null,null,null,"REALIZADO"]
[null,null,null,null,"0-11a","12-14a","15-17a","18-24a","25-29a","30-44a","45-59a","60-+a","TOTAL","Acumulado"]
["TOTAL"]
["DIAGNOSTICO","En Sintomatico Respiratorio",null,null,{"$f":"+GETPIVOTDATA(\" BAS081\",TABLAS!$A$230)","v":0},{"$f":"+GETPIVOTDATA(\" BAS082\",TABLAS!$A$230)","v":0},{"$f":"+GETPIVOTDATA(\" BAS083\",TABLAS!$A$230)","v":0},{"$f":"+GETPIVOTDATA(\" BAS084\",TABLAS!$A$230)","v":0},{"$f":"+GETPIVOTDATA(\" BAS085\",TABLAS!$A$230)","v":0},{"$f":"+GETPIVOTDATA(\" BAS086\",TABLAS!$A$230)","v":0},{"$f":"+GETPIVOTDATA(\" BAS087\",TABLAS!$A$230)","v":0},{"$f":"+GETPIVOTDATA(\" BAS088\",TABLAS!$A$230)","v":0},{"$f":"SUM(E43:L43)","v":0},null,null,null,null,"081","082","083","084","085","086","087","088",null,null,{"$f":"CONCATENATE($Z$22,R43,$AE$22)","v":"=+IMPORTARDATOSDINAMICOS(\" BAS081\",TABLAS!$A$179)"},{"$f":"CONCATENATE($Z$22,S43,$AE$22)","v":"=+IMPORTARDATOSDINAMICOS(\" BAS082\",TABLAS!$A$179)"},{"$f":"CONCATENATE($Z$22,T43,$AE$22)","v":"=+IMPORTARDATOSDINAMICOS(\" BAS083\",TABLAS!$A$179)"},{"$f":"CONCATENATE($Z$22,U43,$AE$22)","v":"=+IMPORTARDATOSDINAMICOS(\" BAS084\",TABLAS!$A$179)"},{"$f":"CONCATENATE($Z$22,V43,$AE$22)","v":"=+IMPORTARDATOSDINAMICOS(\" BAS085\",TABLAS!$A$179)"},{"$f":"CONCATENATE($Z$22,W43,$AE$22)","v":"=+IMPORTARDATOSDINAMICOS(\" BAS086\",TABLAS!$A$179)"},{"$f":"CONCATENATE($Z$22,X43,$AE$22)","v":"=+IMPORTARDATOSDINAMICOS(\" BAS087\",TABLAS!$A$179)"},{"$f":"CONCATENATE($Z$22,Y43,$AE$22)","v":"=+IMPORTARDATOSDINAMICOS(\" BAS088\",TABLAS!$A$179)"},null,"=+IMPORTARDATOSDINAMICOS(\" BAS081\",TABLAS!$A$179)","=+IMPORTARDATOSDINAMICOS(\" BAS082\",TABLAS!$A$179)","=+IMPORTARDATOSDINAMICOS(\" BAS083\",TABLAS!$A$179)","=+IMPORTARDATOSDINAMICOS(\" BAS084\",TABLAS!$A$179)","=+IMPORTARDATOSDINAMICOS(\" BAS085\",TABLAS!$A$179)","=+IMPORTARDATOSDINAMICOS(\" BAS086\",TABLAS!$A$179)","=+IMPORTARDATOSDINAMICOS(\" BAS087\",TABLAS!$A$179)","=+IMPORTARDATOSDINAMICOS(\" BAS088\",TABLAS!$A$179)"]
[null,"En RX Anormal",null,null,{"$f":"+GETPIVOTDATA(\" BAS089\",TABLAS!$A$230)","v":0},{"$f":"+GETPIVOTDATA(\" BAS090\",TABLAS!$A$230)","v":0},{"$f":"+GETPIVOTDATA(\" BAS091\",TABLAS!$A$230)","v":0},{"$f":"+GETPIVOTDATA(\" BAS092\",TABLAS!$A$230)","v":0},{"$f":"+GETPIVOTDATA(\" BAS093\",TABLAS!$A$230)","v":0},{"$f":"+GETPIVOTDATA(\" BAS094\",TABLAS!$A$230)","v":0},{"$f":"+GETPIVOTDATA(\" BAS095\",TABLAS!$A$230)","v":0},{"$f":"+GETPIVOTDATA(\" BAS096\",TABLAS!$A$230)","v":0},0,null,null,null,null,"089","090","091","092","093","094","095","096",null,null,"=+IMPORTARDATOSDINAMICOS(\" BAS089\",TABLAS!$A$179)","=+IMPORTARDATOSDINAMICOS(\" BAS090\",TABLAS!$A$179)","=+IMPORTARDATOSDINAMICOS(\" BAS091\",TABLAS!$A$179)","=+IMPORTARDATOSDINAMICOS(\" BAS092\",TABLAS!$A$179)","=+IMPORTARDATOSDINAMICOS(\" BAS093\",TABLAS!$A$179)","=+IMPORTARDATOSDINAMICOS(\" BAS094\",TABLAS!$A$179)","=+IMPORTARDATOSDINAMICOS(\" BAS095\",TABLAS!$A$179)","=+IMPORTARDATOSDINAMICOS(\" BAS096\",TABLAS!$A$179)",null,"=+IMPORTARDATOSDINAMICOS(\" BAS089\",TABLAS!$A$179)","=+IMPORTARDATOSDINAMICOS(\" BAS090\",TABLAS!$A$179)","=+IMPORTARDATOSDINAMICOS(\" BAS091\",TABLAS!$A$179)","=+IMPORTARDATOSDINAMICOS(\" BAS092\",TABLAS!$A$179)","=+IMPORTARDATOSDINAMICOS(\" BAS093\",TABLAS!$A$179)","=+IMPORTARDATOSDINAMICOS(\" BAS094\",TABLAS!$A$179)","=+IMPORTARDATOSDINAMICOS(\" BAS095\",TABLAS!$A$179)","=+IMPORTARDATOSDINAMICOS(\" BAS096\",TABLAS!$A$179)"]
[null,"En Seguimiento Diagnostico",null,null,{"$f":"+GETPIVOTDATA(\" BAS097\",TABLAS!$A$230)","v":0},{"$f":"+GETPIVOTDATA(\" BAS098\",TABLAS!$A$230)","v":0},{"$f":"+GETPIVOTDATA(\" BAS099\",TABLAS!$A$230)","v":0},{"$f":"+GETPIVOTDATA(\" BAS100\",TABLAS!$A$230)","v":0},{"$f":"+GETPIVOTDATA(\" BAS101\",TABLAS!$A$230)","v":0},{"$f":"+GETPIVOTDATA(\" BAS102\",TABLAS!$A$230)","v":0},{"$f":"+GETPIVOTDATA(\" BAS103\",TABLAS!$A$230)","v":0},{"$f":"+GETPIVOTDATA(\" BAS104\",TABLAS!$A$230)","v":0},0,null,null,null,null,"097","098","099","100","101","102","103","104",null,null,"=+IMPORTARDATOSDINAMICOS(\" BAS097\",TABLAS!$A$179)","=+IMPORTARDATOSDINAMICOS(\" BAS098\",TABLAS!$A$179)","=+IMPORTARDATOSDINAMICOS(\" BAS099\",TABLAS!$A$179)","=+IMPORTARDATOSDINAMICOS(\" BAS100\",TABLAS!$A$179)","=+IMPORTARDATOSDINAMICOS(\" BAS101\",TABLAS!$A$179)","=+IMPORTARDATOSDINAMICOS(\" BAS102\",TABLAS!$A$179)","=+IMPORTARDATOSDINAMICOS(\" BAS103\",TABLAS!$A$179)","=+IMPORTARDATOSDINAMICOS(\" BAS104\",TABLAS!$A$179)",null,"=+IMPORTARDATOSDINAMICOS(\" BAS097\",TABLAS!$A$179)","=+IMPORTARDATOSDINAMICOS(\" BAS098\",TABLAS!$A$179)","=+IMPORTARDATOSDINAMICOS(\" BAS099\",TABLAS!$A$179)","=+IMPORTARDATOSDINAMICOS(\" BAS100\",TABLAS!$A$179)","=+IMPORTARDATOSDINAMICOS(\" BAS101\",TABLAS!$A$179)","=+IMPORTARDATOSDINAMICOS(\" BAS102\",TABLAS!$A$179)","=+IMPORTARDATOSDINAMICOS(\" BAS103\",TABLAS!$A$179)","=+IMPORTARDATOSDINAMICOS(\" BAS104\",TABLAS!$A$179)"]
[null,"En Localizacion Extrapulmonar",null,null,{"$f":"+GETPIVOTDATA(\" BAS105\",TABLAS!$A$230)","v":0},{"$f":"+GETPIVOTDATA(\" BAS106\",TABLAS!$A$230)","v":0},{"$f":"+GETPIVOTDATA(\" BAS107\",TABLAS!$A$230)","v":0},{"$f":"+GETPIVOTDATA(\" BAS108\",TABLAS!$A$230)","v":0},{"$f":"+GETPIVOTDATA(\" BAS109\",TABLAS!$A$230)","v":0},{"$f":"+GETPIVOTDATA(\" BAS110\",TABLAS!$A$230)","v":0},{"$f":"+GETPIVOTDATA(\" BAS111\",TABLAS!$A$230)","v":0},{"$f":"+GETPIVOTDATA(\" BAS112\",TABLAS!$A$230)","v":0},0,null,null,null,null,105,{"$f":"+R46+1","v":106},{"$f":"+S46+1","v":107},108,109,110,111,112,null,null,"=+IMPORTARDATOSDINAMICOS(\" BAS105\",TABLAS!$A$179)","=+IMPORTARDATOSDINAMICOS(\" BAS106\",TABLAS!$A$179)","=+IMPORTARDATOSDINAMICOS(\" BAS107\",TABLAS!$A$179)","=+IMPORTARDATOSDINAMICOS(\" BAS108\",TABLAS!$A$179)","=+IMPORTARDATOSDINAMICOS(\" BAS109\",TABLAS!$A$179)","=+IMPORTARDATOSDINAMICOS(\" BAS110\",TABLAS!$A$179)","=+IMPORTARDATOSDINAMICOS(\" BAS111\",TABLAS!$A$179)","=+IMPORTARDATOSDINAMICOS(\" BAS112\",TABLAS!$A$179)",null,"=+IMPORTARDATOSDINAMICOS(\" BAS105\",TABLAS!$A$179)","=+IMPORTARDATOSDINAMICOS(\" BAS106\",TABLAS!$A$179)","=+IMPORTARDATOSDINAMICOS(\" BAS107\",TABLAS!$A$179)","=+IMPORTARDATOSDINAMICOS(\" BAS108\",TABLAS!$A$179)","=+IMPORTARDATOSDINAMICOS(\" BAS109\",TABLAS!$A$179)","=+IMPORTARDATOSDINAMICOS(\" BAS110\",TABLAS!$A$179)","=+IMPORTARDATOSDINAMICOS(\" BAS111\",TABLAS!$A$179)","=+IMPORTARDATOSDINAMICOS(\" BAS112\",TABLAS!$A$179)"]
[null,"Total de Diagnostico",null,null,{"$f":"SUM(E43:E46)","v":0},{"$f":"SUM(F43:F46)","v":0},0,0,0,0,0,0,0]
["CONTROL DE TRATAMIENTO",null,null,null,{"$f":"+GETPIVOTDATA(\" BAS113\",TABLAS!$A$230)","v":0},{"$f":"+GETPIVOTDATA(\" BAS114\",TABLAS!$A$230)","v":0},{"$f":"+GETPIVOTDATA(\" BAS115\",TABLAS!$A$230)","v":0},{"$f":"+GETPIVOTDATA(\" BAS116\",TABLAS!$A$230)","v":0},{"$f":"+GETPIVOTDATA(\" BAS117\",TABLAS!$A$230)","v":0},{"$f":"+GETPIVOTDATA(\" BAS118\",TABLAS!$A$230)","v":0},{"$f":"+GETPIVOTDATA(\" BAS119\",TABLAS!$A$230)","v":0},{"$f":"+GETPIVOTDATA(\" BAS120\",TABLAS!$A$230)","v":0},0,null,null,null,null,{"$f":"+Y46+1","v":113},{"$f":"+R48+1","v":114},115,116,117,118,119,120,null,null,{"$f":"CONCATENATE($Z$22,R48,$AE$22)","v":"=+IMPORTARDATOSDINAMICOS(\" BAS113\",TABLAS!$A$179)"},{"$f":"CONCATENATE($Z$22,S48,$AE$22)","v":"=+IMPORTARDATOSDINAMICOS(\" BAS114\",TABLAS!$A$179)"},{"$f":"CONCATENATE($Z$22,T48,$AE$22)","v":"=+IMPORTARDATOSDINAMICOS(\" BAS115\",TABLAS!$A$179)"},{"$f":"CONCATENATE($Z$22,U48,$AE$22)","v":"=+IMPORTARDATOSDINAMICOS(\" BAS116\",TABLAS!$A$179)"},{"$f":"CONCATENATE($Z$22,V48,$AE$22)","v":"=+IMPORTARDATOSDINAMICOS(\" BAS117\",TABLAS!$A$179)"},{"$f":"CONCATENATE($Z$22,W48,$AE$22)","v":"=+IMPORTARDATOSDINAMICOS(\" BAS118\",TABLAS!$A$179)"},{"$f":"CONCATENATE($Z$22,X48,$AE$22)","v":"=+IMPORTARDATOSDINAMICOS(\" BAS119\",TABLAS!$A$179)"},{"$f":"CONCATENATE($Z$22,Y48,$AE$22)","v":"=+IMPORTARDATOSDINAMICOS(\" BAS120\",TABLAS!$A$179)"},null,"=+IMPORTARDATOSDINAMICOS(\" BAS113\",TABLAS!$A$179)","=+IMPORTARDATOSDINAMICOS(\" BAS114\",TABLAS!$A$179)","=+IMPORTARDATOSDINAMICOS(\" BAS115\",TABLAS!$A$179)","=+IMPORTARDATOSDINAMICOS(\" BAS116\",TABLAS!$A$179)","=+IMPORTARDATOSDINAMICOS(\" BAS117\",TABLAS!$A$179)","=+IMPORTARDATOSDINAMICOS(\" BAS118\",TABLAS!$A$179)","=+IMPORTARDATOSDINAMICOS(\" BAS119\",TABLAS!$A$179)","=+IMPORTARDATOSDINAMICOS(\" BAS120\",TABLAS!$A$179)"]
["Nº de cultivos contaminados ",null,null,null,{"$f":"+GETPIVOTDATA(\" BAS121\",TABLAS!$A$230)","v":0},{"$f":"+GETPIVOTDATA(\" BAS122\",TABLAS!$A$230)","v":0},{"$f":"+GETPIVOTDATA(\" BAS123\",TABLAS!$A$230)","v":0},{"$f":"+GETPIVOTDATA(\" BAS124\",TABLAS!$A$230)","v":0},{"$f":"+GETPIVOTDATA(\" BAS125\",TABLAS!$A$230)","v":0},{"$f":"+GETPIVOTDATA(\" BAS126\",TABLAS!$A$230)","v":0},{"$f":"+GETPIVOTDATA(\" BAS127\",TABLAS!$A$230)","v":0},{"$f":"+GETPIVOTDATA(\" BAS128\",TABLAS!$A$230)","v":0},0,null,null,null,null,{"$f":"+Y48+1","v":121},{"$f":"+R49+1","v":122},123,124,125,126,127,128,null,null,"=+IMPORTARDATOSDINAMICOS(\" BAS121\",TABLAS!$A$179)","=+IMPORTARDATOSDINAMICOS(\" BAS122\",TABLAS!$A$179)","=+IMPORTARDATOSDINAMICOS(\" BAS123\",TABLAS!$A$179)","=+IMPORTARDATOSDINAMICOS(\" BAS124\",TABLAS!$A$179)","=+IMPORTARDATOSDINAMICOS(\" BAS125\",TABLAS!$A$179)","=+IMPORTARDATOSDINAMICOS(\" BAS126\",TABLAS!$A$179)","=+IMPORTARDATOSDINAMICOS(\" BAS127\",TABLAS!$A$179)","=+IMPORTARDATOSDINAMICOS(\" BAS128\",TABLAS!$A$179)",null,"=+IMPORTARDATOSDINAMICOS(\" BAS121\",TABLAS!$A$179)","=+IMPORTARDATOSDINAMICOS(\" BAS122\",TABLAS!$A$179)","=+IMPORTARDATOSDINAMICOS(\" BAS123\",TABLAS!$A$179)","=+IMPORTARDATOSDINAMICOS(\" BAS124\",TABLAS!$A$179)","=+IMPORTARDATOSDINAMICOS(\" BAS125\",TABLAS!$A$179)","=+IMPORTARDATOSDINAMICOS(\" BAS126\",TABLAS!$A$179)","=+IMPORTARDATOSDINAMICOS(\" BAS127\",TABLAS!$A$179)","=+IMPORTARDATOSDINAMICOS(\" BAS128\",TABLAS!$A$179)"]
["Nº de Pruebas de Sensibilidad",null,null,null,{"$f":"+GETPIVOTDATA(\" BAS129\",TABLAS!$A$230)","v":0},{"$f":"+GETPIVOTDATA(\" BAS130\",TABLAS!$A$230)","v":0},{"$f":"+GETPIVOTDATA(\" BAS131\",TABLAS!$A$230)","v":0},{"$f":"+GETPIVOTDATA(\" BAS132\",TABLAS!$A$230)","v":0},{"$f":"+GETPIVOTDATA(\" BAS133\",TABLAS!$A$230)","v":0},{"$f":"+GETPIVOTDATA(\" BAS134\",TABLAS!$A$230)","v":0},{"$f":"+GETPIVOTDATA(\" BAS135\",TABLAS!$A$230)","v":0},{"$f":"+GETPIVOTDATA(\" BAS136\",TABLAS!$A$230)","v":0},0,null,null,null,null,{"$f":"+Y49+1","v":129},{"$f":"+R50+1","v":130},131,132,133,134,135,136,null,null,"=+IMPORTARDATOSDINAMICOS(\" BAS129\",TABLAS!$A$179)","=+IMPORTARDATOSDINAMICOS(\" BAS130\",TABLAS!$A$179)","=+IMPORTARDATOSDINAMICOS(\" BAS131\",TABLAS!$A$179)","=+IMPORTARDATOSDINAMICOS(\" BAS132\",TABLAS!$A$179)","=+IMPORTARDATOSDINAMICOS(\" BAS133\",TABLAS!$A$179)","=+IMPORTARDATOSDINAMICOS(\" BAS134\",TABLAS!$A$179)","=+IMPORTARDATOSDINAMICOS(\" BAS135\",TABLAS!$A$179)","=+IMPORTARDATOSDINAMICOS(\" BAS136\",TABLAS!$A$179)",null,"=+IMPORTARDATOSDINAMICOS(\" BAS129\",TABLAS!$A$179)","=+IMPORTARDATOSDINAMICOS(\" BAS130\",TABLAS!$A$179)","=+IMPORTARDATOSDINAMICOS(\" BAS131\",TABLAS!$A$179)","=+IMPORTARDATOSDINAMICOS(\" BAS132\",TABLAS!$A$179)","=+IMPORTARDATOSDINAMICOS(\" BAS133\",TABLAS!$A$179)","=+IMPORTARDATOSDINAMICOS(\" BAS134\",TABLAS!$A$179)","=+IMPORTARDATOSDINAMICOS(\" BAS135\",TABLAS!$A$179)","=+IMPORTARDATOSDINAMICOS(\" BAS136\",TABLAS!$A$179)"]
["Tipo",null,null,null,"POSITIVO"]
[null,null,null,null,"0-11a","12-14a","15-17a","18-24a","25-29a","30-44a","45-59a","60-+a","TOTAL","Acumulado"]
["TOTAL"]
["DIAGNOSTICO","En Sintomatico Respiratorio",null,null,{"$f":"+GETPIVOTDATA(\" BAS137\",TABLAS!$A$230)","v":0},{"$f":"+GETPIVOTDATA(\" BAS138\",TABLAS!$A$230)","v":0},{"$f":"+GETPIVOTDATA(\" BAS139\",TABLAS!$A$230)","v":0},{"$f":"+GETPIVOTDATA(\" BAS140\",TABLAS!$A$230)","v":0},{"$f":"+GETPIVOTDATA(\" BAS141\",TABLAS!$A$230)","v":0},{"$f":"+GETPIVOTDATA(\" BAS142\",TABLAS!$A$230)","v":0},{"$f":"+GETPIVOTDATA(\" BAS143\",TABLAS!$A$230)","v":0},{"$f":"+GETPIVOTDATA(\" BAS144\",TABLAS!$A$230)","v":0},{"$f":"SUM(E54:L54)","v":0},null,null,null,null,{"$f":"+Y50+1","v":137},{"$f":"+R54+1","v":138},139,140,141,142,143,144,null,null,{"$f":"CONCATENATE($Z$22,R54,$AE$22)","v":"=+IMPORTARDATOSDINAMICOS(\" BAS137\",TABLAS!$A$179)"},{"$f":"CONCATENATE($Z$22,S54,$AE$22)","v":"=+IMPORTARDATOSDINAMICOS(\" BAS138\",TABLAS!$A$179)"},{"$f":"CONCATENATE($Z$22,T54,$AE$22)","v":"=+IMPORTARDATOSDINAMICOS(\" BAS139\",TABLAS!$A$179)"},{"$f":"CONCATENATE($Z$22,U54,$AE$22)","v":"=+IMPORTARDATOSDINAMICOS(\" BAS140\",TABLAS!$A$179)"},{"$f":"CONCATENATE($Z$22,V54,$AE$22)","v":"=+IMPORTARDATOSDINAMICOS(\" BAS141\",TABLAS!$A$179)"},{"$f":"CONCATENATE($Z$22,W54,$AE$22)","v":"=+IMPORTARDATOSDINAMICOS(\" BAS142\",TABLAS!$A$179)"},{"$f":"CONCATENATE($Z$22,X54,$AE$22)","v":"=+IMPORTARDATOSDINAMICOS(\" BAS143\",TABLAS!$A$179)"},{"$f":"CONCATENATE($Z$22,Y54,$AE$22)","v":"=+IMPORTARDATOSDINAMICOS(\" BAS144\",TABLAS!$A$179)"},null,"=+IMPORTARDATOSDINAMICOS(\" BAS137\",TABLAS!$A$179)","=+IMPORTARDATOSDINAMICOS(\" BAS138\",TABLAS!$A$179)","=+IMPORTARDATOSDINAMICOS(\" BAS139\",TABLAS!$A$179)","=+IMPORTARDATOSDINAMICOS(\" BAS140\",TABLAS!$A$179)","=+IMPORTARDATOSDINAMICOS(\" BAS141\",TABLAS!$A$179)","=+IMPORTARDATOSDINAMICOS(\" BAS142\",TABLAS!$A$179)","=+IMPORTARDATOSDINAMICOS(\" BAS143\",TABLAS!$A$179)","=+IMPORTARDATOSDINAMICOS(\" BAS144\",TABLAS!$A$179)"]
[null,"En RX Anormal",null,null,{"$f":"+GETPIVOTDATA(\" BAS145\",TABLAS!$A$230)","v":0},{"$f":"+GETPIVOTDATA(\" BAS146\",TABLAS!$A$230)","v":0},{"$f":"+GETPIVOTDATA(\" BAS147\",TABLAS!$A$230)","v":0},{"$f":"+GETPIVOTDATA(\" BAS148\",TABLAS!$A$230)","v":0},{"$f":"+GETPIVOTDATA(\" BAS149\",TABLAS!$A$230)","v":0},{"$f":"+GETPIVOTDATA(\" BAS150\",TABLAS!$A$230)","v":0},{"$f":"+GETPIVOTDATA(\" BAS151\",TABLAS!$A$230)","v":0},{"$f":"+GETPIVOTDATA(\" BAS152\",TABLAS!$A$230)","v":0},0,null,null,null,null,{"$f":"+Y54+1","v":145},{"$f":"+R55+1","v":146},{"$f":"+S55+1","v":147},148,149,150,151,152,null,null,"=+IMPORTARDATOSDINAMICOS(\" BAS145\",TABLAS!$A$179)","=+IMPORTARDATOSDINAMICOS(\" BAS146\",TABLAS!$A$179)","=+IMPORTARDATOSDINAMICOS(\" BAS147\",TABLAS!$A$179)","=+IMPORTARDATOSDINAMICOS(\" BAS148\",TABLAS!$A$179)","=+IMPORTARDATOSDINAMICOS(\" BAS149\",TABLAS!$A$179)","=+IMPORTARDATOSDINAMICOS(\" BAS150\",TABLAS!$A$179)","=+IMPORTARDATOSDINAMICOS(\" BAS151\",TABLAS!$A$179)","=+IMPORTARDATOSDINAMICOS(\" BAS152\",TABLAS!$A$179)",null,"=+IMPORTARDATOSDINAMICOS(\" BAS145\",TABLAS!$A$179)","=+IMPORTARDATOSDINAMICOS(\" BAS146\",TABLAS!$A$179)","=+IMPORTARDATOSDINAMICOS(\" BAS147\",TABLAS!$A$179)","=+IMPORTARDATOSDINAMICOS(\" BAS148\",TABLAS!$A$179)","=+IMPORTARDATOSDINAMICOS(\" BAS149\",TABLAS!$A$179)","=+IMPORTARDATOSDINAMICOS(\" BAS150\",TABLAS!$A$179)","=+IMPORTARDATOSDINAMICOS(\" BAS151\",TABLAS!$A$179)","=+IMPORTARDATOSDINAMICOS(\" BAS152\",TABLAS!$A$179)"]
[null,"En Seguimiento Diagnostico",null,null,{"$f":"+GETPIVOTDATA(\" BAS153\",TABLAS!$A$230)","v":0},{"$f":"+GETPIVOTDATA(\" BAS154\",TABLAS!$A$230)","v":0},{"$f":"+GETPIVOTDATA(\" BAS155\",TABLAS!$A$230)","v":0},{"$f":"+GETPIVOTDATA(\" BAS156\",TABLAS!$A$230)","v":0},{"$f":"+GETPIVOTDATA(\" BAS157\",TABLAS!$A$230)","v":0},{"$f":"+GETPIVOTDATA(\" BAS158\",TABLAS!$A$230)","v":0},{"$f":"+GETPIVOTDATA(\" BAS159\",TABLAS!$A$230)","v":0},{"$f":"+GETPIVOTDATA(\" BAS160\",TABLAS!$A$230)","v":0},0,null,null,null,null,{"$f":"+Y55+1","v":153},{"$f":"+R56+1","v":154},155,156,157,158,159,160,null,null,"=+IMPORTARDATOSDINAMICOS(\" BAS153\",TABLAS!$A$179)","=+IMPORTARDATOSDINAMICOS(\" BAS154\",TABLAS!$A$179)","=+IMPORTARDATOSDINAMICOS(\" BAS155\",TABLAS!$A$179)","=+IMPORTARDATOSDINAMICOS(\" BAS156\",TABLAS!$A$179)","=+IMPORTARDATOSDINAMICOS(\" BAS157\",TABLAS!$A$179)","=+IMPORTARDATOSDINAMICOS(\" BAS158\",TABLAS!$A$179)","=+IMPORTARDATOSDINAMICOS(\" BAS159\",TABLAS!$A$179)","=+IMPORTARDATOSDINAMICOS(\" BAS160\",TABLAS!$A$179)",null,"=+IMPORTARDATOSDINAMICOS(\" BAS153\",TABLAS!$A$179)","=+IMPORTARDATOSDINAMICOS(\" BAS154\",TABLAS!$A$179)","=+IMPORTARDATOSDINAMICOS(\" BAS155\",TABLAS!$A$179)","=+IMPORTARDATOSDINAMICOS(\" BAS156\",TABLAS!$A$179)","=+IMPORTARDATOSDINAMICOS(\" BAS157\",TABLAS!$A$179)","=+IMPORTARDATOSDINAMICOS(\" BAS158\",TABLAS!$A$179)","=+IMPORTARDATOSDINAMICOS(\" BAS159\",TABLAS!$A$179)","=+IMPORTARDATOSDINAMICOS(\" BAS160\",TABLAS!$A$179)"]
[null,"En Localizacion Extrapulmonar",null,null,{"$f":"+GETPIVOTDATA(\" BAS161\",TABLAS!$A$230)","v":0},{"$f":"+GETPIVOTDATA(\" BAS162\",TABLAS!$A$230)","v":0},{"$f":"+GETPIVOTDATA(\" BAS163\",TABLAS!$A$230)","v":0},{"$f":"+GETPIVOTDATA(\" BAS164\",TABLAS!$A$230)","v":0},{"$f":"+GETPIVOTDATA(\" BAS165\",TABLAS!$A$230)","v":0},{"$f":"+GETPIVOTDATA(\" BAS166\",TABLAS!$A$230)","v":0},{"$f":"+GETPIVOTDATA(\" BAS167\",TABLAS!$A$230)","v":0},{"$f":"+GETPIVOTDATA(\" BAS168\",TABLAS!$A$230)","v":0},0,null,null,null,null,161,{"$f":"+R57+1","v":162},163,164,165,166,167,168,null,null,"=+IMPORTARDATOSDINAMICOS(\" BAS161\",TABLAS!$A$179)","=+IMPORTARDATOSDINAMICOS(\" BAS162\",TABLAS!$A$179)","=+IMPORTARDATOSDINAMICOS(\" BAS163\",TABLAS!$A$179)","=+IMPORTARDATOSDINAMICOS(\" BAS164\",TABLAS!$A$179)","=+IMPORTARDATOSDINAMICOS(\" BAS165\",TABLAS!$A$179)","=+IMPORTARDATOSDINAMICOS(\" BAS166\",TABLAS!$A$179)","=+IMPORTARDATOSDINAMICOS(\" BAS167\",TABLAS!$A$179)","=+IMPORTARDATOSDINAMICOS(\" BAS168\",TABLAS!$A$179)",null,"=+IMPORTARDATOSDINAMICOS(\" BAS161\",TABLAS!$A$179)","=+IMPORTARDATOSDINAMICOS(\" BAS162\",TABLAS!$A$179)","=+IMPORTARDATOSDINAMICOS(\" BAS163\",TABLAS!$A$179)","=+IMPORTARDATOSDINAMICOS(\" BAS164\",TABLAS!$A$179)","=+IMPORTARDATOSDINAMICOS(\" BAS165\",TABLAS!$A$179)","=+IMPORTARDATOSDINAMICOS(\" BAS166\",TABLAS!$A$179)","=+IMPORTARDATOSDINAMICOS(\" BAS167\",TABLAS!$A$179)","=+IMPORTARDATOSDINAMICOS(\" BAS168\",TABLAS!$A$179)"]
[null,"Total de Diagnostico",null,null,{"$f":"SUM(E54:E57)","v":0},{"$f":"SUM(F54:F57)","v":0},0,0,0,0,0,0,0]
["CONTROL DE TRATAMIENTO",null,null,null,{"$f":"+GETPIVOTDATA(\" BAS169\",TABLAS!$A$230)","v":0},{"$f":"+GETPIVOTDATA(\" BAS170\",TABLAS!$A$230)","v":0},{"$f":"+GETPIVOTDATA(\" BAS171\",TABLAS!$A$230)","v":0},{"$f":"+GETPIVOTDATA(\" BAS172\",TABLAS!$A$230)","v":0},{"$f":"+GETPIVOTDATA(\" BAS173\",TABLAS!$A$230)","v":0},{"$f":"+GETPIVOTDATA(\" BAS174\",TABLAS!$A$230)","v":0},{"$f":"+GETPIVOTDATA(\" BAS175\",TABLAS!$A$230)","v":0},{"$f":"+GETPIVOTDATA(\" BAS176\",TABLAS!$A$230)","v":0},{"$f":"SUM(E59:L59)","v":0},null,null,null,null,{"$f":"+Y57+1","v":169},{"$f":"+R59+1","v":170},171,172,173,174,175,176,null,null,{"$f":"CONCATENATE($Z$22,R59,$AE$22)","v":"=+IMPORTARDATOSDINAMICOS(\" BAS169\",TABLAS!$A$179)"},{"$f":"CONCATENATE($Z$22,S59,$AE$22)","v":"=+IMPORTARDATOSDINAMICOS(\" BAS170\",TABLAS!$A$179)"},{"$f":"CONCATENATE($Z$22,T59,$AE$22)","v":"=+IMPORTARDATOSDINAMICOS(\" BAS171\",TABLAS!$A$179)"},{"$f":"CONCATENATE($Z$22,U59,$AE$22)","v":"=+IMPORTARDATOSDINAMICOS(\" BAS172\",TABLAS!$A$179)"},{"$f":"CONCATENATE($Z$22,V59,$AE$22)","v":"=+IMPORTARDATOSDINAMICOS(\" BAS173\",TABLAS!$A$179)"},{"$f":"CONCATENATE($Z$22,W59,$AE$22)","v":"=+IMPORTARDATOSDINAMICOS(\" BAS174\",TABLAS!$A$179)"},{"$f":"CONCATENATE($Z$22,X59,$AE$22)","v":"=+IMPORTARDATOSDINAMICOS(\" BAS175\",TABLAS!$A$179)"},{"$f":"CONCATENATE($Z$22,Y59,$AE$22)","v":"=+IMPORTARDATOSDINAMICOS(\" BAS176\",TABLAS!$A$179)"},null,"=+IMPORTARDATOSDINAMICOS(\" BAS169\",TABLAS!$A$179)","=+IMPORTARDATOSDINAMICOS(\" BAS170\",TABLAS!$A$179)","=+IMPORTARDATOSDINAMICOS(\" BAS171\",TABLAS!$A$179)","=+IMPORTARDATOSDINAMICOS(\" BAS172\",TABLAS!$A$179)","=+IMPORTARDATOSDINAMICOS(\" BAS173\",TABLAS!$A$179)","=+IMPORTARDATOSDINAMICOS(\" BAS174\",TABLAS!$A$179)","=+IMPORTARDATOSDINAMICOS(\" BAS175\",TABLAS!$A$179)","=+IMPORTARDATOSDINAMICOS(\" BAS176\",TABLAS!$A$179)"]

{"sheet":"Datos","index":4,"n_rows":444,"n_cols":32,"rows_kept":444,"cut":false,"hidden":true,"merged":[]}
[]
[]
[]
[]
[]
[]
[]
[]
[null,"ANO",null,"MESES",null,"COD_RED","DESC_RED","CONCATENAR",null,"COD_RED","COD_MIC","DESC_MICRO","CONCATENAR",null,"COD_ESTAB","DESC_ESTAB","COD_RED","COD_MIC","COD_PROV","COD_DIST","REDMIC","CONCATENAR",null,"COD_PROV","DESC_PROV","CONCATENAR",null,"COD_PROV","COD_DIST","DESC_DIST","PROVDIST","CONCATENAR"]
[null,2024,null,"01-Enero",null,"00","NO TIENE ASIGNADO NINGUNA RED",{"$f":"CONCATENATE(F10,\" - \",G10)","v":"00 - NO TIENE ASIGNADO NINGUNA RED"},null,"00","00","NO PERTENECE A NINGUNA MICRORED                                                                     ",{"$f":"CONCATENATE(J10,K10,\" - \",L10)","v":"0000 - NO PERTENECE A NINGUNA MICRORED                                                                     "},null,"000000000","(All)","00","00",null,null,{"$f":"CONCATENATE(Q10,R10)","v":"0000"},{"$f":"CONCATENATE(O10,\" - \",P10)","v":"000000000 - (All)"},null,"00","(All)",{"$f":"CONCATENATE(X10,\" - \",Y10)","v":"00 - (All)"},null,"01","00","(All)",{"$f":"CONCATENATE(AB10,AC10)","v":"0100"},{"$f":"CONCATENATE(AB10,AC10,\" - \",AD10)","v":"0100 - (All)"}]
[null,null,null,"02-Febrero",null,"01","CUSCO SUR",{"$f":"CONCATENATE(F11,\" - \",G11)","v":"01 - CUSCO SUR"},null,"00","99","(All)","0099 - (All)",null,"000028190","SAMUE CUSCO","00","00","01","01",{"$f":"CONCATENATE(Q11,R11)","v":"0000"},{"$f":"CONCATENATE(O11,\" - \",P11)","v":"000028190 - SAMUE CUSCO"},null,"01","CUSCO",{"$f":"CONCATENATE(X11,\" - \",Y11)","v":"01 - CUSCO"},null,"01","01","CUSCO",{"$f":"CONCATENATE(AB11,AC11)","v":"0101"},{"$f":"CONCATENATE(AB11,AC11,\" - \",AD11)","v":"0101 - CUSCO"}]
[null,null,null,"03-Marzo",null,"02","CUSCO NORTE","02 - CUSCO NORTE",null,"01","00","NO PERTENECE A NINGUNA MICRORED                                                                     ","0100 - NO PERTENECE A NINGUNA MICRORED                                                                     ",null,"000002289","HOSPITAL DE APOYO DEPARTAMENTAL CUSCO","00","00","01","01","0000","000002289 - HOSPITAL DE APOYO DEPARTAMENTAL CUSCO",null,"02","ACOMAYO",{"$f":"CONCATENATE(X12,\" - \",Y12)","v":"02 - ACOMAYO"},null,"01","02","CCORCA","0102","0102 - CCORCA"]
[null,null,null,"04-Abril",null,"03","LA CONVENCION","03 - LA CONVENCION",null,"01","16","CUSCO                                                                                               ","0116 - CUSCO                                                                                               ",null,"000002305","ANTONIO LORENA DEL CUSCO","00","00","01","06","0000","000002305 - ANTONIO LORENA DEL CUSCO",null,"03","ANTA","03 - ANTA",null,"01","03","POROY","0103","0103 - POROY"]
[null,null,null,"05-Mayo",null,"04","CANAS-CANCHIS-ESPINAR","04 - CANAS-CANCHIS-ESPINAR",null,"01","03","PARURO                                                                                              ","0103 - PARURO                                                                                              ",null,"999999999","(All)","00","99",null,null,"0099","999999999 - (All)",null,"04","CALCA","04 - CALCA",null,"01","04","SAN JERONIMO","0104","0104 - SAN JERONIMO"]
[null,null,null,"06-Junio",null,"05","KIMBIRI PICHARI","05 - KIMBIRI PICHARI",null,"01","06","PAUCARTAMBO                                                                                         ","0106 - PAUCARTAMBO                                                                                         ",null,"000025210","TUPAC AMARU","01","00","01","05","0100","000025210 - TUPAC AMARU",null,"05","CANAS","05 - CANAS",null,"01","05","SAN SEBASTIAN","0105","0105 - SAN SEBASTIAN"]
[null,null,null,"07-Julio",null,"06","CHUMBIVILCAS","06 - CHUMBIVILCAS",null,"01","12","URCOS                                                                                               ","0112 - URCOS                                                                                               ",null,"000000000","(All)","01","03",null,null,"0103","000000000 - (All)",null,"06","CANCHIS","06 - CANCHIS",null,"01","06","SANTIAGO","0106","0106 - SANTIAGO"]
[null,null,null,"08-Agosto",null,"99","(All)","99 - (All)",null,"01","13","ACOMAYO                                                                                             ","0113 - ACOMAYO                                                                                             ",null,"000002499","PARURO","01","03","10","01","0103","000002499 - PARURO",null,"07","CHUMBIVILCAS","07 - CHUMBIVILCAS",null,"01","07","SAYLLA","0107","0107 - SAYLLA"]
[null,null,null,"09-Setiembre",null,null,null,null,null,"01","15","OCONGATE                                                                                            ","0115 - OCONGATE                                                                                            ",null,"000002500","ACCHA","01","03","10","02","0103","000002500 - ACCHA",null,"08","ESPINAR","08 - ESPINAR",null,"01","08","WANCHAQ","0108","0108 - WANCHAQ"]
[null,null,null,"10-Octubre",null,null,null,null,null,"01","99","(All)","0199 - (All)",null,"000002501","CCAPI","01","03","10","03","0103","000002501 - CCAPI",null,"09","LA CONVENCION","09 - LA CONVENCION",null,"02","00","(All)","0200","0200 - (All)"]
[null,null,null,"11-Noviembre",null,"EJECUTORAS",null,null,null,"02","01","BELEMPAMPA                                                                                          ","0201 - BELEMPAMPA                                                                                          ",null,"000002502","CCOYABAMBA","01","03","10","03","0103","000002502 - CCOYABAMBA",null,"10","PARURO","10 - PARURO",null,"02","01","ACOMAYO","0201","0201 - ACOMAYO"]
[null,null,null,"12-Diciembre",null,"COD_RED","DESC_RED","CONCATENAR",null,"02","02","WANCHAQ                                                                                             ","0202 - WANCHAQ                                                                                             ",null,"000002503","COLCHA","01","03","10","04","0103","000002503 - COLCHA",null,"11","PAUCARTAMBO","11 - PAUCARTAMBO",null,"02","02","ACOPIA","0202","0202 - ACOPIA"]
[null,null,null,null,null,"01","HOSPITAL REGIONAL CUSCO",{"$f":"CONCATENATE(F22,\" - \",G22)","v":"01 - HOSPITAL REGIONAL CUSCO"},null,"02","03","ANTA                                                                                                ","0203 - ANTA                                                                                                ",null,"000002504","HUANOQUITE","01","03","10","05","0103","000002504 - HUANOQUITE",null,"12","QUISPICANCHI","12 - QUISPICANCHI",null,"02","03","ACOS","0203","0203 - ACOS"]
[null,null,null,null,null,"02","HOSPITAL ANTONIO LORENA",{"$f":"CONCATENATE(F23,\" - \",G23)","v":"02 - HOSPITAL ANTONIO LORENA"},null,"02","04","LIMATAMBO                                                                                           ","0204 - LIMATAMBO                                                                                           ",null,"000002505","OMACHA","01","03","10","06","0103","000002505 - OMACHA",null,"13","URUBAMBA","13 - URUBAMBA",null,"02","04","MOSOC LLACTA","0204","0204 - MOSOC LLACTA"]
[null,null,null,null,null,"03","CUSCO NORTE","03 - CUSCO NORTE",null,"02","05","PISAC                                                                                               ","0205 - PISAC                                                                                               ",null,"000002506","ANTAPALLPA","01","03","10","06","0103","000002506 - ANTAPALLPA",null,null,null,null,null,"02","05","POMACANCHI","0205","0205 - POMACANCHI"]
[null,null,null,null,null,"04","CUSCO SUR","04 - CUSCO SUR",null,"02","06","CALCA                                                                                               ","0206 - CALCA                                                                                               ",null,"000002507","PACCARECTAMBO","01","03","10","07","0103","000002507 - PACCARECTAMBO",null,null,null,null,null,"02","06","RONDOCAN","0206","0206 - RONDOCAN"]
[null,null,null,null,null,"05","LA CONVENCION","05 - LA CONVENCION",null,"02","07","URUBAMBA                                                                                            ","0207 - URUBAMBA                                                                                            ",null,"000002509","YAURISQUE","01","03","10","09","0103","000002509 - YAURISQUE",null,null,null,null,null,"02","07","SANGARARA","0207","0207 - SANGARARA"]
[null,null,null,null,null,"06","HOSPITAL QUILLABAMBA","06 - HOSPITAL QUILLABAMBA",null,"02","08","YANATILE                                                                                            ","0208 - YANATILE                                                                                            ",null,"000006978","CCOCHIRIHUAY","01","03","10","04","0103","000006978 - CCOCHIRIHUAY",null,null,null,null,null,"03","00","(All)","0300","0300 - (All)"]
[null,null,null,null,null,"07","CANAS CANCHIS ESPINAR","07 - CANAS CANCHIS ESPINAR",null,"02","09","SIETE CUARTONES                                                                                     ","0209 - SIETE CUARTONES                                                                                     ",null,"000007147","PUESTO DE SALUD DE HUASQUILLAY","01","03","10","06","0103","000007147 - PUESTO DE SALUD DE HUASQUILLAY",null,null,null,null,null,"03","01","ANTA","0301","0301 - ANTA"]
[null,null,null,null,null,"08","HOSPITAL SICUANI","08 - HOSPITAL SICUANI",null,"02","99","(All)","0299 - (All)",null,"000012924","SAHUA SAHUA","01","03","10","06","0103","000012924 - SAHUA SAHUA",null,null,null,null,null,"03","02","ANCAHUASI","0302","0302 - ANCAHUASI"]
[null,null,null,null,null,"09","HOSPITAL ESPINAR","09 - HOSPITAL ESPINAR",null,"03","00","NO PERTENECE A NINGUNA MICRORED                                                                     ","0300 - NO PERTENECE A NINGUNA MICRORED                                                                     ",null,"000000000","(All)","01","06",null,null,"0106","000000000 - (All)",null,null,null,null,null,"03","03","CACHIMAYO","0303","0303 - CACHIMAYO"]
[null,null,null,null,null,"10","KIMBIRI PICHARI","10 - KIMBIRI PICHARI",null,"03","01","SANTA ANA                                                                                           ","0301 - SANTA ANA                                                                                           ",null,"000002510","PAUCARTAMBO","01","06","11","01","0106","000002510 - PAUCARTAMBO",null,null,null,null,null,"03","04","CHINCHAYPUJIO","0304","0304 - CHINCHAYPUJIO"]
[null,null,null,null,null,"11","CHUMBIVILCAS","11 - CHUMBIVILCAS",null,"03","02","MARANURA                                                                                            ","0302 - MARANURA                                                                                            ",null,"000002511","MOLLOMARCA","01","06","11","01","0106","000002511 - MOLLOMARCA",null,null,null,null,null,"03","05","HUAROCONDO","0305","0305 - HUAROCONDO"]
[null,null,null,null,null,"99","(ALL)",{"$f":"CONCATENATE(F33,\" - \",G33)","v":"99 - (ALL)"},null,"03","03","QUELLOUNO                                                                                           ","0303 - QUELLOUNO                                                                                           ",null,"000002512","CAICAY","01","06","11","02","0106","000002512 - CAICAY",null,null,null,null,null,"03","06","LIMATAMBO","0306","0306 - LIMATAMBO"]
[null,null,null,null,null,null,null,null,null,"03","04","KITENI                                                                                              ","0304 - KITENI                                                                                              ",null,"000002513","HUASAC","01","06","11","02","0106","000002513 - HUASAC",null,null,null,null,null,"03","07","MOLLEPATA","0307","0307 - MOLLEPATA"]
[null,null,null,null,null,null,null,null,null,"03","05","KAMISEA                                                                                             ","0305 - KAMISEA                                                                                             ",null,"000002514","CHALLABAMBA","01","06","11","03","0106","000002514 - CHALLABAMBA",null,null,null,null,null,"03","08","PUCYURA","0308","0308 - PUCYURA"]
[null,null,null,null,null,null,null,null,null,"03","06","PUCYURA                                                                                             ","0306 - PUCYURA                                                                                             ",null,"000002516","COLQUEPATA","01","06","11","04","0106","000002516 - COLQUEPATA",null,null,null,null,null,"03","09","ZURITE","0309","0309 - ZURITE"]
[null,null,null,null,null,null,null,null,null,"03","07","PALMA REAL","0307 - PALMA REAL",null,"000002517","PICHIHUA COLQUEPATA","01","06","11","04","0106","000002517 - PICHIHUA COLQUEPATA",null,null,null,null,null,"04","00","(All)","0400","0400 - (All)"]
[null,null,null,null,null,null,null,null,null,"03","99","(All)","0399 - (All)",null,"000002518","VIZCOCHONI","01","06","11","04","0106","000002518 - VIZCOCHONI",null,null,null,null,null,"04","01","CALCA","0401","0401 - CALCA"]
[null,null,null,null,null,null,null,null,null,"04","00","NO PERTENECE A NINGUNA MICRORED                                                                     ","0400 - NO PERTENECE A NINGUNA MICRORED                                                                     ",null,"000002519","AYRE","01","06","11","04","0106","000002519 - AYRE",null,null,null,null,null,"04","02","COYA","0402","0402 - COYA"]
[null,null,null,null,null,null,null,null,null,"04","01","YANAOCA                                                                                             ","0401 - YANAOCA                                                                                             ",null,"000002520","HUANCARANI","01","06","11","05","0106","000002520 - HUANCARANI",null,null,null,null,null,"04","03","LAMAY","0403","0403 - LAMAY"]
[null,null,null,null,null,null,null,null,null,"04","02","EL DESCANSO                                                                                         ","0402 - EL DESCANSO                                                                                         ",null,"000002521","PILCOPATA","01","06","11","06","0106","000002521 - PILCOPATA",null,null,null,null,null,"04","04","LARES","0404","0404 - LARES"]
[null,null,null,null,null,null,null,null,null,"04","03","COMBAPATA                                                                                           ","0403 - COMBAPATA                                                                                           ",null,"000002522","PATRIA","01","06","11","06","0106","000002522 - PATRIA",null,null,null,null,null,"04","05","PISAC","0405","0405 - PISAC"]
[null,null,null,null,null,null,null,null,null,"04","04","TECHO OBRERO                                                                                        ","0404 - TECHO OBRERO                                                                                        ",null,"000006979","TOCRA","01","06","11","04","0106","000006979 - TOCRA",null,null,null,null,null,"04","06","SAN SALVADOR","0406","0406 - SAN SALVADOR"]
[null,null,null,null,null,null,null,null,null,"04","05","PAMPAPHALLA                                                                                         ","0405 - PAMPAPHALLA                                                                                         ",null,"000010077","PAUCARTAMBO -ESSALUD","01","06","11","01","0106","000010077 - PAUCARTAMBO -ESSALUD",null,null,null,null,null,"04","07","TARAY","0407","0407 - TARAY"]
[null,null,null,null,null,null,null,null,null,"04","06","YAURI                                                                                               ","0406 - YAURI                                                                                               ",null,"000033777","MENTAL COMUNITARIO VIRGEN DEL ROSARIO","01","06","11","01","0106","000033777 - MENTAL COMUNITARIO VIRGEN DEL ROSARIO",null,null,null,null,null,"04","08","YANATILE","0408","0408 - YANATILE"]
[null,null,null,null,null,null,null,null,null,"04","99","(All)","0499 - (All)",null,"000000000","(All)","01","12",null,null,"0112","000000000 - (All)",null,null,null,null,null,"05","00","(All)","0500","0500 - (All)"]
[null,null,null,null,null,null,null,null,null,"05","00","NO PERTENECE A NINGUNA MICRORED                                                                     ","0500 - NO PERTENECE A NINGUNA MICRORED                                                                     ",null,"000002523","URCOS","01","12","12","01","0112","000002523 - URCOS",null,null,null,null,null,"05","01","YANAOCA","0501","0501 - YANAOCA"]
[null,null,null,null,null,null,null,null,null,"05","01","KIMBIRI                                                                                             ","0501 - KIMBIRI                                                                                             ",null,"000002525","ANDAHUAYLILLAS","01","12","12","02","0112","000002525 - ANDAHUAYLILLAS",null,null,null,null,null,"05","02","CHECCA","0502","0502 - CHECCA"]
[null,null,null,null,null,null,null,null,null,"05","02","PICHARI                                                                                             ","0502 - PICHARI                                                                                             ",null,"000002530","CUSIPATA","01","12","12","06","0112","000002530 - CUSIPATA",null,null,null,null,null,"05","03","KUNTURKANKI","0503","0503 - KUNTURKANKI"]
[null,null,null,null,null,null,null,null,null,"05","99","(All)","0599 - (All)",null,"000002532","HUARO","01","12","12","07","0112","000002532 - HUARO",null,null,null,null,null,"05","04","LANGUI","0504","0504 - LANGUI"]
[null,null,null,null,null,null,null,null,null,"06","00","NO PERTENECE A NINGUNA MICRORED                                                                     ","0600 - NO PERTENECE A NINGUNA MICRORED                                                                     ",null,"000002533","URPAY","01","12","12","07","0112","000002533 - URPAY",null,null,null,null,null,"05","05","LAYO","0505","0505 - LAYO"]
[null,null,null,null,null,null,null,null,null,"06","09","SANTO TOMAS                                                                                         ","0609 - SANTO TOMAS                                                                                         ",null,"000002534","LUCRE","01","12","12","08","0112","000002534 - LUCRE",null,null,null,null,null,"05","06","PAMPAMARCA","0506","0506 - PAMPAMARCA"]
[null,null,null,null,null,null,null,null,null,"06","01","LIVITACA                                                                                            ","0601 - LIVITACA                                                                                            ",null,"000002537","OROPESA","01","12","12","11","0112","000002537 - OROPESA",null,null,null,null,null,"05","07","QUEHUE","0507","0507 - QUEHUE"]
[null,null,null,null,null,null,null,null,null,"06","99","(All)","0699 - (All)",null,"000002538","QUIQUIJANA","01","12","12","12","0112","000002538 - QUIQUIJANA",null,null,null,null,null,"05","08","TUPAC AMARU","0508","0508 - TUPAC AMARU"]
[null,null,null,null,null,null,null,null,null,"99","99","(All)","9999 - (All)",null,"000002539","CCOLCA","01","12","12","12","0112","000002539 - CCOLCA",null,null,null,null,null,"06","00","(All)","0600","0600 - (All)"]
[null,null,null,null,null,null,null,null,null,null,null,null,null,null,"000006980","CHILLIHUANI","01","12","12","06","0112","000006980 - CHILLIHUANI",null,null,null,null,null,"06","01","SICUANI","0601","0601 - SICUANI"]
[null,null,null,null,null,null,null,null,null,null,null,null,null,null,"000008911","HUARA HUARA","01","12","12","05","0112","000008911 - HUARA HUARA",null,null,null,null,null,"06","02","CHECACUPE","0602","0602 - CHECACUPE"]
[null,null,null,null,null,null,null,null,null,null,null,null,null,null,"000011747","POSTA MEDICA POLICIAL PUCUTO","01","12","12","07","0112","000011747 - POSTA MEDICA POLICIAL PUCUTO",null,null,null,null,null,"06","03","COMBAPATA","0603","0603 - COMBAPATA"]
[null,null,null,null,null,null,null,null,null,null,null,null,null,null,"000026385","URCOS - ESSALUD","01","12","12","01","0112","000026385 - URCOS - ESSALUD",null,null,null,null,null,"06","04","MARANGANI","0604","0604 - MARANGANI"]
[null,null,null,null,null,null,null,null,null,null,null,null,null,null,"000030708","MENTAL COMUNITARIO HUARO","01","12","12","07","0112","000030708 - MENTAL COMUNITARIO HUARO",null,null,null,null,null,"06","05","PITUMARCA","0605","0605 - PITUMARCA"]
[null,null,null,null,null,null,null,null,null,null,null,null,null,null,"000000000","(All)","01","13",null,null,"0113","000000000 - (All)",null,null,null,null,null,"06","06","SAN PABLO","0606","0606 - SAN PABLO"]
[null,null,null,null,null,null,null,null,null,null,null,null,null,null,"000002317","ACOMAYO","01","13","02","01","0113","000002317 - ACOMAYO",null,null,null,null,null,"06","07","SAN PEDRO","0607","0607 - SAN PEDRO"]
[null,null,null,null,null,null,null,null,null,null,null,null,null,null,"000002318","ACOPIA","01","13","02","02","0113","000002318 - ACOPIA",null,null,null,null,null,"06","08","TINTA","0608","0608 - TINTA"]
[null,null,null,null,null,null,null,null,null,null,null,null,null,null,"000002319","ACOS","01","13","02","03","0113","000002319 - ACOS",null,null,null,null,null,"07","00","(All)","0700","0700 - (All)"]
[null,null,null,null,null,null,null,null,null,null,null,null,null,null,"000002321","POMACANCHI","01","13","02","05","0113","000002321 - POMACANCHI",null,null,null,null,null,"07","01","SANTO TOMAS","0701","0701 - SANTO TOMAS"]
[null,null,null,null,null,null,null,null,null,null,null,null,null,null,"000002322","SAN JUAN DE POMACANCHI","01","13","02","05","0113","000002322 - SAN JUAN DE POMACANCHI",null,null,null,null,null,"07","02","CAPACMARCA","0702","0702 - CAPACMARCA"]
[null,null,null,null,null,null,null,null,null,null,null,null,null,null,"000002324","PUESTO DE SALUD SANGARARA","01","13","02","07","0113","000002324 - PUESTO DE SALUD SANGARARA",null,null,null,null,null,"07","03","CHAMACA","0703","0703 - CHAMACA"]
[null,null,null,null,null,null,null,null,null,null,null,null,null,null,"000002325","PUESTO DE SALUD MARCACONGA","01","13","02","07","0113","000002325 - PUESTO DE SALUD MARCACONGA",null,null,null,null,null,"07","04","COLQUEMARCA","0704","0704 - COLQUEMARCA"]
[null,null,null,null,null,null,null,null,null,null,null,null,null,null,"000002508","PILLPINTO","01","13","10","08","0113","000002508 - PILLPINTO",null,null,null,null,null,"07","05","LIVITACA","0705","0705 - LIVITACA"]
[null,null,null,null,null,null,null,null,null,null,null,null,null,null,"000010076","ACOMAYO - ESSALUD","01","13","02","01","0113","000010076 - ACOMAYO - ESSALUD",null,null,null,null,null,"07","06","LLUSCO","0706","0706 - LLUSCO"]
[null,null,null,null,null,null,null,null,null,null,null,null,null,0,"000012926","SANTA LUCIA","01","13","02","05","0113","000012926 - SANTA LUCIA",null,null,null,null,null,"07","07","QUIÑOTA","0707","0707 - QUIÑOTA"]
[null,null,null,null,null,null,null,null,null,null,null,null,null,1,"000000000","(All)","01","15",null,null,"0115","000000000 - (All)",null,null,null,null,null,"07","08","VELILLE","0708","0708 - VELILLE"]
[null,null,null,null,null,null,null,null,null,null,null,null,null,2,"000002524","PAMPACAMARA","01","15","12","05","0115","000002524 - PAMPACAMARA",null,null,null,null,null,"08","00","(All)","0800","0800 - (All)"]
[null,null,null,null,null,null,null,null,null,null,null,null,null,3,"000002526","QUINCE MIL","01","15","12","03","0115","000002526 - QUINCE MIL",null,null,null,null,null,"08","01","ESPINAR","0801","0801 - ESPINAR"]
[null,null,null,null,null,null,null,null,null,null,null,null,null,4,"000002527","CCARHUAYO","01","15","12","04","0115","000002527 - CCARHUAYO",null,null,null,null,null,"08","02","CONDOROMA",{"$f":"CONCATENATE(AB75,AC75)","v":"0802"},{"$f":"CONCATENATE(AB75,AC75,\" - \",AD75)","v":"0802 - CONDOROMA"}]
[null,null,null,null,null,null,null,null,null,null,null,null,null,5,"000002528","CCATCCA","01","15","12","05","0115","000002528 - CCATCCA",null,null,null,null,null,"08","03","COPORAQUE","0803","0803 - COPORAQUE"]
[null,null,null,null,null,null,null,null,null,null,null,null,null,6,"000002529","KCAURY","01","15","12","05","0115","000002529 - KCAURY",null,null,null,null,null,"08","04","OCORURO","0804","0804 - OCORURO"]
[null,null,null,null,null,null,null,null,null,null,null,null,null,7,"000002535","MARCAPATA","01","15","12","09","0115","000002535 - MARCAPATA",null,null,null,null,null,"08","05","PALLPATA","0805","0805 - PALLPATA"]
[null,null,null,null,null,null,null,null,null,null,null,null,null,9,"000002536","OCONGATE","01","15","12","10","0115","000002536 - OCONGATE",null,null,null,null,null,"08","06","PICHIGUA","0806","0806 - PICHIGUA"]
[null,null,null,null,null,null,null,null,null,null,null,null,null,10,"000006977","TINKI","01","15","12","10",{"$f":"CONCATENATE(Q80,R80)","v":"0115"},{"$f":"CONCATENATE(O80,\" - \",P80)","v":"000006977 - TINKI"},null,null,null,null,null,"08","07","SUYCKUTAMBO","0807","0807 - SUYCKUTAMBO"]
[null,null,null,null,null,null,null,null,null,null,null,null,null,11,"000007110","INCACANCHA","01","15","12","09","0115","000007110 - INCACANCHA",null,null,null,null,null,"08","08","ALTO PICHIGUA","0808","0808 - ALTO PICHIGUA"]
[null,null,null,null,null,null,null,null,null,null,null,null,null,12,"000012931","CHICHINA","01","15","12","05","0115","000012931 - CHICHINA",null,null,null,null,null,"09","00","(All)","0900","0900 - (All)"]
[null,null,null,null,null,null,null,null,null,null,null,null,null,13,"000016335","CCAPANA","01","15","12","05","0115","000016335 - CCAPANA",null,null,null,null,null,"09","01","SANTA ANA","0901","0901 - SANTA ANA"]
[null,null,null,null,null,null,null,null,null,null,null,null,null,0,"000000000","(All)","01","16",null,null,"0116","000000000 - (All)",null,null,null,null,null,"09","02","ECHARATE","0902","0902 - ECHARATE"]
[null,null,null,null,null,null,null,null,null,null,null,null,null,1,"000002300","SAN JERONIMO","01","16","01","04","0116","000002300 - SAN JERONIMO",null,null,null,null,null,"09","03","HUAYOPATA","0903","0903 - HUAYOPATA"]
[null,null,null,null,null,null,null,null,null,null,null,null,null,2,"000002301","SAN SEBASTIAN","01","16","01","05","0116","000002301 - SAN SEBASTIAN",null,null,null,null,null,"09","04","MARANURA","0904","0904 - MARANURA"]
[null,null,null,null,null,null,null,null,null,null,null,null,null,3,"000002303","SANTA ROSA","01","16","01","05","0116","000002303 - SANTA ROSA",null,null,null,null,null,"09","05","OCOBAMBA","0905","0905 - OCOBAMBA"]
[null,null,null,null,null,null,null,null,null,null,null,null,null,4,"000002314","SAYLLA","01","16","01","07","0116","000002314 - SAYLLA",null,null,null,null,null,"09","06","QUELLOUNO","0906","0906 - QUELLOUNO"]
[null,null,null,null,null,null,null,null,null,null,null,null,null,5,"000002323","RONDOCAN","01","16","02","06","0116","000002323 - RONDOCAN",null,null,null,null,null,"09","07","KIMBIRI","0907","0907 - KIMBIRI"]
[null,null,null,null,null,null,null,null,null,null,null,null,null,6,"000007699","CONCHACALLE","01","16","01","04","0116","000007699 - CONCHACALLE",null,null,null,null,null,"09","08","SANTA TERESA","0908","0908 - SANTA TERESA"]
[null,null,null,null,null,null,null,null,null,null,null,null,null,7,"000010065","SAN SEBASTIAN ESSALUD","01","16","01","05","0116","000010065 - SAN SEBASTIAN ESSALUD",null,null,null,null,null,"09","09","VILCABAMBA","0909","0909 - VILCABAMBA"]
[null,null,null,null,null,null,null,null,null,null,null,null,null,8,"000011743","POLICIAL \"SANTA ROSA\"  CUSCO","01","16","01","05","0116","000011743 - POLICIAL \"SANTA ROSA\"  CUSCO",null,null,null,null,null,"09","10","PICHARI","0910","0910 - PICHARI"]
[null,null,null,null,null,null,null,null,null,null,null,null,null,9,"000018926","ESTABLECIMIENTO PENITENCIARIO CUSCO VARONES","01","16","01","04","0116","000018926 - ESTABLECIMIENTO PENITENCIARIO CUSCO VARONES",null,null,null,null,null,"09","11","INKAWASI                                ","0911","0911 - INKAWASI                                "]
[null,null,null,null,null,null,null,null,null,null,null,null,null,10,"000021187","ESTABLECIMIENTO PENITENCIARIO CUSCO MUJERES","01","16","01","04","0116","000021187 - ESTABLECIMIENTO PENITENCIARIO CUSCO MUJERES",null,null,null,null,null,"09","12","VILLA VIRGEN","0912","0912 - VILLA VIRGEN"]
[null,null,null,null,null,null,null,null,null,null,null,null,null,0,"000026181","MENTAL SAN SEBASTIAN","01","16","01","05","0116","000026181 - MENTAL SAN SEBASTIAN",null,null,null,null,null,"09","13","VILLA KINTIARINA","0913","0913 - VILLA KINTIARINA"]
[null,null,null,null,null,null,null,null,null,null,null,null,null,1,"000030727","PATRÓN SAN SEBASTIAN","01","16","01","04","0116","000030727 - PATRÓN SAN SEBASTIAN",null,null,null,null,null,"09","14","MEGANTONI","0914","0914 - MEGANTONI"]
[null,null,null,null,null,null,null,null,null,null,null,null,null,2,"999999999","(All)","01","99",null,null,"0199","999999999 - (All)",null,null,null,null,null,"09","15","KUMPIRUSHIATO","0915","0915 - KUMPIRUSHIATO"]
[null,null,null,null,null,null,null,null,null,null,null,null,null,3,"000000000","(All)","02","01",null,null,"0201","000000000 - (All)",null,null,null,null,null,"09","16","CIELO PUNCO","0916","0916 - CIELO PUNCO"]
[null,null,null,null,null,null,null,null,null,null,null,null,null,null,"000002292","INDEPENDENCIA","02","01","01","01","0201","000002292 - INDEPENDENCIA",null,null,null,null,null,"09","17","MANITEA","0917","0917 - MANITEA"]
[null,null,null,null,null,null,null,null,null,null,null,null,null,4,"000002297","CCORCCA","02","01","01","02","0201","000002297 - CCORCCA",null,null,null,null,null,"09","18","UNION ASHANINKA","0918","0918 - UNION ASHANINKA"]
[null,null,null,null,null,null,null,null,null,null,null,null,null,5,"000002306","BELEMPAMPA","02","01","01","06","0201","000002306 - BELEMPAMPA",null,null,null,null,null,"09","00","(All)","0900","0900 - (All)"]
[null,null,null,null,null,null,null,null,null,null,null,null,null,6,"000002308","ZARZUELA ALTA","02","01","01","06","0201","000002308 - ZARZUELA ALTA",null,null,null,null,null,"10","01","PARURO","1001","1001 - PARURO"]
[null,null,null,null,null,null,null,null,null,null,null,null,null,null,"000002309","DIGNIDAD NACIONAL","02","01","01","06","0201","000002309 - DIGNIDAD NACIONAL",null,null,null,null,null,"10","02","ACCHA","1002","1002 - ACCHA"]
[null,null,null,null,null,null,null,null,null,null,null,null,null,7,"000002313","OCCOPATA","02","01","01","06","0201","000002313 - OCCOPATA",null,null,null,null,null,"10","03","CCAPI","1003","1003 - CCAPI"]
[null,null,null,null,null,null,null,null,null,null,null,null,null,8,"000010067","C.M. SANTIAGO  ESSALUD","02","01","01","06","0201","000010067 - C.M. SANTIAGO  ESSALUD",null,null,null,null,null,"10","04","COLCHA","1004","1004 - COLCHA"]
[null,null,null,null,null,null,null,null,null,null,null,null,null,9,"000010920","QUINTA BRIGADA DE MONTAÑA","02","01","01","06","0201","000010920 - QUINTA BRIGADA DE MONTAÑA",null,null,null,null,null,"10","05","HUANOQUITE","1005","1005 - HUANOQUITE"]
[null,null,null,null,null,null,null,null,null,null,null,null,null,10,"000026182","MENTAL SANTIAGO","02","01","01","06","0201","000026182 - MENTAL SANTIAGO",null,null,null,null,null,"10","06","OMACHA","1006","1006 - OMACHA"]
[null,null,null,null,null,null,null,null,null,null,null,null,null,11,"000000000","(All)","02","02",null,null,"0202","000000000 - (All)",null,null,null,null,null,"10","07","PACCARITAMBO","1007","1007 - PACCARITAMBO"]
[null,null,null,null,null,null,null,null,null,null,null,null,null,0,"000002302","CCORAO","02","02","01","05","0202","000002302 - CCORAO",null,null,null,null,null,"10","08","PILLPINTO","1008","1008 - PILLPINTO"]
[null,null,null,null,null,null,null,null,null,null,null,null,null,1,"000002307","MANCO CAPAC","02","02","01","06","0202","000002307 - MANCO CAPAC",null,null,null,null,null,"10","09","YAURISQUE","1009","1009 - YAURISQUE"]
[null,null,null,null,null,null,null,null,null,null,null,null,null,null,"000002310","CHOCCO","02","02","01","06","0202","000002310 - CHOCCO",null,null,null,null,null,"11","00","(All)","1100","1100 - (All)"]
[null,null,null,null,null,null,null,null,null,null,null,null,null,null,"000002315","WANCHAQ","02","02","01","08","0202","000002315 - WANCHAQ",null,null,null,null,null,"11","01","PAUCARTAMBO","1101","1101 - PAUCARTAMBO"]
[null,null,null,null,null,null,null,null,null,null,null,null,null,2,"000002316","TTIO","02","02","01","08","0202","000002316 - TTIO",null,null,null,null,null,"11","02","CAICAY","1102","1102 - CAICAY"]
[null,null,null,null,null,null,null,null,null,null,null,null,null,3,"000010041","ADOLFO GUEVARA VELASCO","02","02","01","08","0202","000010041 - ADOLFO GUEVARA VELASCO",null,null,null,null,null,"11","03","CHALLABAMBA","1103","1103 - CHALLABAMBA"]
[null,null,null,null,null,null,null,null,null,null,null,null,null,4,"000026183","METROPOLITANO","02","02","01","08","0202","000026183 - METROPOLITANO",null,null,null,null,null,"11","04","COLQUEPATA","1104","1104 - COLQUEPATA"]
[null,null,null,null,null,null,null,null,null,null,null,null,null,5,"000030730","PATRON SANTIAGO","02","02","01","08","0202","000030730 - PATRON SANTIAGO",null,null,null,null,null,"11","05","HUANCARANI","1105","1105 - HUANCARANI"]
[null,null,null,null,null,null,null,null,null,null,null,null,null,6,"000000000","(All)","02","03",null,null,"0203","000000000 - (All)",null,null,null,null,null,"11","06","KOSÑIPATA","1106","1106 - KOSÑIPATA"]
[null,null,null,null,null,null,null,null,null,null,null,null,null,7,"000002326","ANTA","02","03","03","01","0203","000002326 - ANTA",null,null,null,null,null,"12","00","(All)","1200","1200 - (All)"]
[null,null,null,null,null,null,null,null,null,null,null,null,null,0,"000002327","CHACAN","02","03","03","01","0203","000002327 - CHACAN",null,null,null,null,null,"12","01","URCOS","1201","1201 - URCOS"]
[null,null,null,null,null,null,null,null,null,null,null,null,null,1,"000002328","COMPONE","02","03","03","01","0203","000002328 - COMPONE",null,null,null,null,null,"12","02","ANDAHUAYLILLAS","1202","1202 - ANDAHUAYLILLAS"]
[null,null,null,null,null,null,null,null,null,null,null,null,null,2,"000002329","CONCHACALLA","02","03","03","01","0203","000002329 - CONCHACALLA",null,null,null,null,null,"12","03","CAMANTI","1203","1203 - CAMANTI"]
[null,null,null,null,null,null,null,null,null,null,null,null,null,3,"000002330","ANCAHUASI","02","03","03","02","0203","000002330 - ANCAHUASI",null,null,null,null,null,"12","04","CCARHUAYO","1204","1204 - CCARHUAYO"]
[null,null,null,null,null,null,null,null,null,null,null,null,null,4,"000002331","CACHIMAYO","02","03","03","03","0203","000002331 - CACHIMAYO",null,null,null,null,null,"12","05","CCATCA","1205","1205 - CCATCA"]
[null,null,null,null,null,null,null,null,null,null,null,null,null,5,"000002332","CHINCHAYPUJIO","02","03","03","04","0203","000002332 - CHINCHAYPUJIO",null,null,null,null,null,"12","06","CUSIPATA","1206","1206 - CUSIPATA"]
[null,null,null,null,null,null,null,null,null,null,null,null,null,6,"000002333","HUAROCONDO","02","03","03","05","0203","000002333 - HUAROCONDO",null,null,null,null,null,"12","07","HUARO","1207","1207 - HUARO"]
[null,null,null,null,null,null,null,null,null,null,null,null,null,7,"000002334","HUAYLLACOCHA","02","03","03","05","0203","000002334 - HUAYLLACOCHA",null,null,null,null,null,"12","08","LUCRE","1208","1208 - LUCRE"]
[null,null,null,null,null,null,null,null,null,null,null,null,null,null,"000002339","PUCYURA ANTA","02","03","03","08","0203","000002339 - PUCYURA ANTA",null,null,null,null,null,"12","09","MARCAPATA","1209","1209 - MARCAPATA"]
[null,null,null,null,null,null,null,null,null,null,null,null,null,8,"000002340","ZURITE","02","03","03","09","0203","000002340 - ZURITE",null,null,null,null,null,"12","10","OCONGATE","1210","1210 - OCONGATE"]
[null,null,null,null,null,null,null,null,null,null,null,null,null,9,"000006972","PANTIPATA","02","03","03","04","0203","000006972 - PANTIPATA",null,null,null,null,null,"12","11","OROPESA","1211","1211 - OROPESA"]
[null,null,null,null,null,null,null,null,null,null,null,null,null,10,"000027790","MENTAL COMUNITARIO ANTA","02","03","03","01","0203","000027790 - MENTAL COMUNITARIO ANTA",null,null,null,null,null,"12","12","QUIQUIJANA","1212","1212 - QUIQUIJANA"]
[null,null,null,null,null,null,null,null,null,null,null,null,null,null,"000029514","ESSALUD ANTA","02","03","03","01","0203","000029514 - ESSALUD ANTA",null,null,null,null,null,"13","00","(All)","1300","1300 - (All)"]
[null,null,null,null,null,null,null,null,null,null,null,null,null,null,"000000000","(All)","02","04",null,null,"0204","000000000 - (All)",null,null,null,null,null,"13","01","URUBAMBA","1301","1301 - URUBAMBA"]
[null,null,null,null,null,null,null,null,null,null,null,null,null,null,"000002336","LIMATAMBO","02","04","03","06","0204","000002336 - LIMATAMBO",null,null,null,null,null,"13","02","CHINCHERO","1302","1302 - CHINCHERO"]
[null,null,null,null,null,null,null,null,null,null,null,null,null,null,"000002337","PAMPACONGA","02","04","03","06","0204","000002337 - PAMPACONGA",null,null,null,null,null,"13","03","HUAYLLABAMBA","1303","1303 - HUAYLLABAMBA"]
[null,null,null,null,null,null,null,null,null,null,null,null,null,null,"000002338","MOLLEPATA","02","04","03","07","0204","000002338 - MOLLEPATA",null,null,null,null,null,"13","04","MACHUPICCHU","1304","1304 - MACHUPICCHU"]
[null,null,null,null,null,null,null,null,null,null,null,null,null,null,"000010761","URATARI","02","04","03","06","0204","000010761 - URATARI",null,null,null,null,null,"13","05","MARAS","1305","1305 - MARAS"]
[null,null,null,null,null,null,null,null,null,null,null,null,null,null,"000021061","HUAMANPATA","02","04","03","07","0204","000021061 - HUAMANPATA",null,null,null,null,null,"13","06","OLLANTAYTAMBO","1306","1306 - OLLANTAYTAMBO"]
[null,null,null,null,null,null,null,null,null,null,null,null,null,null,"000000000","(All)","02","05",null,null,"0205","000000000 - (All)",null,null,null,null,null,"13","07","YUCAY",{"$f":"CONCATENATE(AB138,AC138)","v":"1307"},"1307 - YUCAY"]
[null,null,null,null,null,null,null,null,null,null,null,null,null,null,"000002343","COYA","02","05","04","02","0205","000002343 - COYA",null,null,null,null,null,"00","00","(All)",{"$f":"CONCATENATE(AB139,AC139)","v":"0000"},"0000 - (All)"]
[null,null,null,null,null,null,null,null,null,null,null,null,null,null,"000002344","LAMAY","02","05","04","03","0205","000002344 - LAMAY"]
[null,null,null,null,null,null,null,null,null,null,null,null,null,null,"000002348","PISAC","02","05","04","05","0205","000002348 - PISAC"]
[null,null,null,null,null,null,null,null,null,null,null,null,null,null,"000002349","CUYO CHICO","02","05","04","05","0205","000002349 - CUYO CHICO"]
[null,null,null,null,null,null,null,null,null,null,null,null,null,null,"000002350","CUYO GRANDE","02","05","04","05","0205","000002350 - CUYO GRANDE"]
[null,null,null,null,null,null,null,null,null,null,null,null,null,null,"000002351","QUELLO QUELLO","02","05","04","05","0205","000002351 - QUELLO QUELLO"]
[null,null,null,null,null,null,null,null,null,null,null,null,null,null,"000002352","SAN SALVADOR","02","05","04","06","0205","000002352 - SAN SALVADOR"]
[null,null,null,null,null,null,null,null,null,null,null,null,null,null,"000002353","TARAY","02","05","04","07","0205","000002353 - TARAY"]
[null,null,null,null,null,null,null,null,null,null,null,null,null,null,"000002354","HUANCALLE","02","05","04","07","0205","000002354 - HUANCALLE"]
[null,null,null,null,null,null,null,null,null,null,null,null,null,null,"000006970","TIRACANCHA","02","05","04","06","0205","000006970 - TIRACANCHA"]
[null,null,null,null,null,null,null,null,null,null,null,null,null,null,"000006975","SAYLLAFAYA","02","05","04","03","0205","000006975 - SAYLLAFAYA"]
[null,null,null,null,null,null,null,null,null,null,null,null,null,null,"000007145","HUAMA","02","05","04","03",{"$f":"CONCATENATE(Q150,R150)","v":"0205"},{"$f":"CONCATENATE(O150,\" - \",P150)","v":"000007145 - HUAMA"}]
[null,null,null,null,null,null,null,null,null,null,null,null,null,null,"000007146","POQUES","02","05","04","03","0205","000007146 - POQUES"]
[null,null,null,null,null,null,null,null,null,null,null,null,null,null,"000025368","HUARQUI","02","05","04","03","0205","000025368 - HUARQUI"]
[null,null,null,null,null,null,null,null,null,null,null,null,null,null,"000000000","(All)","02","06",null,null,"0206","000000000 - (All)"]
[null,null,null,null,null,null,null,null,null,null,null,null,null,null,"000002341","CALCA","02","06","04","01","0206","000002341 - CALCA"]
[null,null,null,null,null,null,null,null,null,null,null,null,null,null,"000002342","AMPARAES","02","06","04","04","0206","000002342 - AMPARAES"]
[null,null,null,null,null,null,null,null,null,null,null,null,null,null,"000002345","CCACHIN","02","06","04","04","0206","000002345 - CCACHIN"]
[null,null,null,null,null,null,null,null,null,null,null,null,null,null,"000002346","CHOQUECANCHA","02","06","04","04","0206","000002346 - CHOQUECANCHA"]
[null,null,null,null,null,null,null,null,null,null,null,null,null,null,"000002347","LARES","02","06","04","04","0206","000002347 - LARES"]
[null,null,null,null,null,null,null,null,null,null,null,null,null,null,"000002361","SUYO","02","06","04","04","0206","000002361 - SUYO"]
[null,null,null,null,null,null,null,null,null,null,null,null,null,null,"000002515","PAROBAMBA","02","06","11","03","0206","000002515 - PAROBAMBA"]
[null,null,null,null,null,null,null,null,null,null,null,null,null,null,"000007143","OTOCANI","02","06","11","03","0206","000007143 - OTOCANI"]
[null,null,null,null,null,null,null,null,null,null,null,null,null,null,"000007144","PATABAMBA","02","06","04","07","0206","000007144 - PATABAMBA"]
[null,null,null,null,null,null,null,null,null,null,null,null,null,null,"000010069","ESSALUD CALCA","02","06","04","01","0206","000010069 - ESSALUD CALCA"]
[null,null,null,null,null,null,null,null,null,null,null,null,null,null,"000010759","HUARAN","02","06","04","01","0206","000010759 - HUARAN"]
[null,null,null,null,null,null,null,null,null,null,null,null,null,null,"000010762","ACCHA ALTA - PAMPALLACTA","02","06","04","01","0206","000010762 - ACCHA ALTA - PAMPALLACTA"]
[null,null,null,null,null,null,null,null,null,null,null,null,null,null,"000026273","MENTAL COMUNITARIO VIRGEN ASUNTA DE CALCA","02","06","04","01","0206","000026273 - MENTAL COMUNITARIO VIRGEN ASUNTA DE CALCA"]
[null,null,null,null,null,null,null,null,null,null,null,null,null,null,"000000000","(All)","02","07",null,null,"0207","000000000 - (All)"]
[null,null,null,null,null,null,null,null,null,null,null,null,null,null,"000002540","URUBAMBA","02","07","13","01","0207","000002540 - URUBAMBA"]
[null,null,null,null,null,null,null,null,null,null,null,null,null,null,"000002541","YANAHUARA","02","07","13","01","0207","000002541 - YANAHUARA"]
[null,null,null,null,null,null,null,null,null,null,null,null,null,null,"000002543","CHINCHERO","02","07","13","02","0207","000002543 - CHINCHERO"]
[null,null,null,null,null,null,null,null,null,null,null,null,null,null,"000002544","OCCOTUAN","02","07","13","02","0207","000002544 - OCCOTUAN"]
[null,null,null,null,null,null,null,null,null,null,null,null,null,null,"000002545","HUAYLLABAMBA","02","07","13","03","0207","000002545 - HUAYLLABAMBA"]
[null,null,null,null,null,null,null,null,null,null,null,null,null,null,"000002546","MACHUPICCHU","02","07","13","04","0207","000002546 - MACHUPICCHU"]
[null,null,null,null,null,null,null,null,null,null,null,null,null,null,"000002547","COLLPANI","02","07","13","04","0207","000002547 - COLLPANI"]
[null,null,null,null,null,null,null,null,null,null,null,null,null,null,"000002548","MARAS","02","07","13","05","0207","000002548 - MARAS"]
[null,null,null,null,null,null,null,null,null,null,null,null,null,null,"000002549","OLLANTAYTAMBO","02","07","13","06","0207","000002549 - OLLANTAYTAMBO"]
[null,null,null,null,null,null,null,null,null,null,null,null,null,null,"000002550","CHILLCA","02","07","13","06","0207","000002550 - CHILLCA"]
[null,null,null,null,null,null,null,null,null,null,null,null,null,null,"000002551","YUCAY","02","07","13","07","0207","000002551 - YUCAY"]
[null,null,null,null,null,null,null,null,null,null,null,null,null,null,"000006974","CAMINO INCA HUAYLLABAMBA","02","07","13","04","0207","000006974 - CAMINO INCA HUAYLLABAMBA"]
[null,null,null,null,null,null,null,null,null,null,null,null,null,null,"000010060","CAS URUBAMBA -ESSALUD","02","07","13","01","0207","000010060 - CAS URUBAMBA -ESSALUD"]
[null,null,null,null,null,null,null,null,null,null,null,null,null,null,"000010073","MACHU PICCHU - ESSALUD","02","07","13","04","0207","000010073 - MACHU PICCHU - ESSALUD"]
[null,null,null,null,null,null,null,null,null,null,null,null,null,null,"000010758","CRUZPATA","02","07","13","05","0207","000010758 - CRUZPATA"]
[null,null,null,null,null,null,null,null,null,null,null,null,null,null,"000010760","PATACANCHA","02","07","13","06","0207","000010760 - PATACANCHA"]
[null,null,null,null,null,null,null,null,null,null,null,null,null,null,"000030666","MENTAL COMUNITARIO URUBAMBA","02","07","13","01","0207","000030666 - MENTAL COMUNITARIO URUBAMBA"]
[null,null,null,null,null,null,null,null,null,null,null,null,null,null,"000000000","(All)","02","08",null,null,"0208","000000000 - (All)"]
[null,null,null,null,null,null,null,null,null,null,null,null,null,null,"000002355","LA QUEBRADA","02","08","04","08","0208","000002355 - LA QUEBRADA"]
[null,null,null,null,null,null,null,null,null,null,null,null,null,null,"000002356","CCORIMAYO","02","08","04","08","0208","000002356 - CCORIMAYO"]
[null,null,null,null,null,null,null,null,null,null,null,null,null,null,"000002357","COLCCA YANATILE","02","08","04","08","0208","000002357 - COLCCA YANATILE"]
[null,null,null,null,null,null,null,null,null,null,null,null,null,null,"000002358","MUYUPAY","02","08","04","08","0208","000002358 - MUYUPAY"]
[null,null,null,null,null,null,null,null,null,null,null,null,null,null,"000002359","PUTUCUSI","02","08","04","08","0208","000002359 - PUTUCUSI"]
[null,null,null,null,null,null,null,null,null,null,null,null,null,null,"000002360","QUESQUENTO","02","08","04","08","0208","000002360 - QUESQUENTO"]
[null,null,null,null,null,null,null,null,null,null,null,null,null,null,"000002362","HUACHIBAMBA","02","08","04","08","0208","000002362 - HUACHIBAMBA"]
[null,null,null,null,null,null,null,null,null,null,null,null,null,null,"000002464","VERSALLES","02","08","09","05","0208","000002464 - VERSALLES"]
[null,null,null,null,null,null,null,null,null,null,null,null,null,null,"000002467","PUENTE SANTIAGO","02","08","09","06","0208","000002467 - PUENTE SANTIAGO"]
[null,null,null,null,null,null,null,null,null,null,null,null,null,null,"000006971","COMBAPATA YANATILE","02","08","04","08","0208","000006971 - COMBAPATA YANATILE"]
[null,null,null,null,null,null,null,null,null,null,null,null,null,null,"000006973","BELLAVISTA","02","08","04","08","0208","000006973 - BELLAVISTA"]
[null,null,null,null,null,null,null,null,null,null,null,null,null,null,"000007142","CHANCAMAYO","02","08","04","08","0208","000007142 - CHANCAMAYO"]
[null,null,null,null,null,null,null,null,null,null,null,null,null,null,"000000000","(All)","02","09",null,null,"0209","000000000 - (All)"]
[null,null,null,null,null,null,null,null,null,null,null,null,null,null,"000002290","SAN PEDRO CUSCO","02","09","01","01","0209","000002290 - SAN PEDRO CUSCO"]
[null,null,null,null,null,null,null,null,null,null,null,null,null,null,"000002291","SIETE CUARTONES","02","09","01","01","0209","000002291 - SIETE CUARTONES"]
[null,null,null,null,null,null,null,null,null,null,null,null,null,null,"000002293","MIRAFLORES","02","09","01","01","0209","000002293 - MIRAFLORES"]
[null,null,null,null,null,null,null,null,null,null,null,null,null,null,"000002294","PICCHU LA RINCONADA","02","09","01","01","0209","000002294 - PICCHU LA RINCONADA"]
[null,null,null,null,null,null,null,null,null,null,null,null,null,null,"000002295","BUENA VISTA","02","09","01","01","0209","000002295 - BUENA VISTA"]
[null,null,null,null,null,null,null,null,null,null,null,null,null,null,"000002299","POROY","02","09","01","03","0209","000002299 - POROY"]
[null,null,null,null,null,null,null,null,null,null,null,null,null,null,"999999999","(All)","02","99",null,null,"0299","999999999 - (All)"]
[null,null,null,null,null,null,null,null,null,null,null,null,null,null,"000002421","QUILLABAMBA","03","00","09","01","0300","000002421 - QUILLABAMBA"]
[null,null,null,null,null,null,null,null,null,null,null,null,null,null,"000000000","(All)","03","01",null,null,"0301","000000000 - (All)"]
[null,null,null,null,null,null,null,null,null,null,null,null,null,null,"000002422","HUAYANAY","03","01","09","01","0301","000002422 - HUAYANAY"]
[null,null,null,null,null,null,null,null,null,null,null,null,null,null,"000002423","IDMA","03","01","09","01","0301","000002423 - IDMA"]
[null,null,null,null,null,null,null,null,null,null,null,null,null,null,"000002424","POTRERO","03","01","09","01","0301","000002424 - POTRERO"]
[null,null,null,null,null,null,null,null,null,null,null,null,null,null,"000002425","ECHARATE","03","01","09","02","0301","000002425 - ECHARATE"]
[null,null,null,null,null,null,null,null,null,null,null,null,null,null,"000002430","PAMPA CONCEPCION","03","01","09","02","0301","000002430 - PAMPA CONCEPCION"]
[null,null,null,null,null,null,null,null,null,null,null,null,null,null,"000002446","CHACCO","03","01","09","02","0301","000002446 - CHACCO"]
[null,null,null,null,null,null,null,null,null,null,null,null,null,null,"000002451","CHAHUARES","03","01","09","02","0301","000002451 - CHAHUARES"]
[null,null,null,null,null,null,null,null,null,null,null,null,null,null,"000008910","SANTA ANA","03","01","09","01","0301","000008910 - SANTA ANA"]
[null,null,null,null,null,null,null,null,null,null,null,null,null,null,"000010062","QUILLABAMBA - ESSALUD","03","01","09","01","0301","000010062 - QUILLABAMBA - ESSALUD"]
[null,null,null,null,null,null,null,null,null,null,null,null,null,null,"000011744","POSTA MEDICO POLICIAL LA CONVENCION - QUILLABAMBA","03","01","09","01","0301","000011744 - POSTA MEDICO POLICIAL LA CONVENCION - QUILLABAMBA"]
[null,null,null,null,null,null,null,null,null,null,null,null,null,null,"000015842","PAVAYOC","03","01","09","01",{"$f":"CONCATENATE(Q218,R218)","v":"0301"},{"$f":"CONCATENATE(O218,\" - \",P218)","v":"000015842 - PAVAYOC"}]
[null,null,null,null,null,null,null,null,null,null,null,null,null,null,"000024653","INPE QUILLABAMBA","03","01","09","01","0301","000024653 - INPE QUILLABAMBA"]
[null,null,null,null,null,null,null,null,null,null,null,null,null,null,"000026386","MENTAL QUILLABAMBA","03","01","09","01","0301","000026386 - MENTAL QUILLABAMBA"]
[null,null,null,null,null,null,null,null,null,null,null,null,null,null,"000033273","SAN ISIDRO LABRADOR - ECHARATI","03","01","09","02","0301","000033273 - SAN ISIDRO LABRADOR - ECHARATI"]
[null,null,null,null,null,null,null,null,null,null,null,null,null,null,"000000000","(All)","03","02",null,null,"0302","000000000 - (All)"]
[null,null,null,null,null,null,null,null,null,null,null,null,null,null,"000002453","HUYRO","03","02","09","03","0302","000002453 - HUYRO"]
[null,null,null,null,null,null,null,null,null,null,null,null,null,null,"000002454","ALFAMAYO","03","02","09","03","0302","000002454 - ALFAMAYO"]
[null,null,null,null,null,null,null,null,null,null,null,null,null,null,"000002455","HUAYOPATA","03","02","09","03","0302","000002455 - HUAYOPATA"]
[null,null,null,null,null,null,null,null,null,null,null,null,null,null,"000002456","AMAYBAMBA","03","02","09","03","0302","000002456 - AMAYBAMBA"]
[null,null,null,null,null,null,null,null,null,null,null,null,null,null,"000002457","SAN PABLO HUAYOPATA","03","02","09","03","0302","000002457 - SAN PABLO HUAYOPATA"]
[null,null,null,null,null,null,null,null,null,null,null,null,null,null,"000002458","MARANURA","03","02","09","04","0302","000002458 - MARANURA"]
[null,null,null,null,null,null,null,null,null,null,null,null,null,null,"000002460","SANTA MARIA","03","02","09","04","0302","000002460 - SANTA MARIA"]
[null,null,null,null,null,null,null,null,null,null,null,null,null,null,"000002461","UCHUMAYO","03","02","09","04","0302","000002461 - UCHUMAYO"]
[null,null,null,null,null,null,null,null,null,null,null,null,null,null,"000002476","SANTA TERESA","03","02","09","08","0302","000002476 - SANTA TERESA"]
[null,null,null,null,null,null,null,null,null,null,null,null,null,null,"000002477","SULLUCUYOC","03","02","09","08","0302","000002477 - SULLUCUYOC"]
[null,null,null,null,null,null,null,null,null,null,null,null,null,null,"000002478","TOTORA","03","02","09","08","0302","000002478 - TOTORA"]
[null,null,null,null,null,null,null,null,null,null,null,null,null,null,"000010075","CAP HUYRO - ESSALUD","03","02","09","03","0302","000010075 - CAP HUYRO - ESSALUD"]
[null,null,null,null,null,null,null,null,null,null,null,null,null,null,"000000000","(All)","03","03",null,null,"0303","000000000 - (All)"]
[null,null,null,null,null,null,null,null,null,null,null,null,null,null,"000002363","TUPAC AMARU QUELLOUNO","03","03","04","08","0303","000002363 - TUPAC AMARU QUELLOUNO"]
[null,null,null,null,null,null,null,null,null,null,null,null,null,null,"000002462","OCCOBAMBA LACONVENCION","03","03","09","05","0303","000002462 - OCCOBAMBA LACONVENCION"]
[null,null,null,null,null,null,null,null,null,null,null,null,null,null,"000002463","CHINGANILLA","03","03","09","05","0303","000002463 - CHINGANILLA"]
[null,null,null,null,null,null,null,null,null,null,null,null,null,null,"000002465","QUELLOUNO","03","03","09","06","0303","000002465 - QUELLOUNO"]
[null,null,null,null,null,null,null,null,null,null,null,null,null,null,"000002466","HUILLCAPAMPA","03","03","09","06","0303","000002466 - HUILLCAPAMPA"]
[null,null,null,null,null,null,null,null,null,null,null,null,null,null,"000002468","SAN MARTIN","03","03","09","06","0303","000002468 - SAN MARTIN"]
[null,null,null,null,null,null,null,null,null,null,null,null,null,null,"000008906","ESTRELLA","03","03","09","06","0303","000008906 - ESTRELLA"]
[null,null,null,null,null,null,null,null,null,null,null,null,null,null,"000008907","MATORIATO","03","03","09","06","0303","000008907 - MATORIATO"]
[null,null,null,null,null,null,null,null,null,null,null,null,null,null,"000008908","CHIRUMBIA","03","03","09","06","0303","000008908 - CHIRUMBIA"]
[null,null,null,null,null,null,null,null,null,null,null,null,null,null,"000008909","CHAPO BOYERO","03","03","09","06","0303","000008909 - CHAPO BOYERO"]
[null,null,null,null,null,null,null,null,null,null,null,null,null,null,"000000000","(All)","03","04",null,null,"0304","000000000 - (All)"]
[null,null,null,null,null,null,null,null,null,null,null,null,null,null,"000002427","KITENI","03","04","09","02","0304","000002427 - KITENI"]
[null,null,null,null,null,null,null,null,null,null,null,null,null,null,"000002431","IVOCHOTE","03","04","09","02","0304","000002431 - IVOCHOTE"]
[null,null,null,null,null,null,null,null,null,null,null,null,null,null,"000002432","KEPASHIATO","03","04","09","02","0304","000002432 - KEPASHIATO"]
[null,null,null,null,null,null,null,null,null,null,null,null,null,null,"000002434","MATERIATO","03","04","09","02","0304","000002434 - MATERIATO"]
[null,null,null,null,null,null,null,null,null,null,null,null,null,null,"000002438","PACHIRI","03","04","09","02","0304","000002438 - PACHIRI"]
[null,null,null,null,null,null,null,null,null,null,null,null,null,null,"000002440","PANGOA","03","04","09","02","0304","000002440 - PANGOA"]
[null,null,null,null,null,null,null,null,null,null,null,null,null,null,"000002443","SANIRIATO","03","04","09","02","0304","000002443 - SANIRIATO"]
[null,null,null,null,null,null,null,null,null,null,null,null,null,null,"000002447","KAMANQUIRIATO","03","04","09","02","0304","000002447 - KAMANQUIRIATO"]
[null,null,null,null,null,null,null,null,null,null,null,null,null,null,"000002489","YUVENI","03","04","09","09","0304","000002489 - YUVENI"]
[null,null,null,null,null,null,null,null,null,null,null,null,null,null,"000002493","SELVA ALEGRE","03","04","09","09","0304","000002493 - SELVA ALEGRE"]
[null,null,null,null,null,null,null,null,null,null,null,null,null,null,"000006976","CHONTABAMBA","03","04","09","09","0304","000006976 - CHONTABAMBA"]
[null,null,null,null,null,null,null,null,null,null,null,null,null,null,"000013068","TRIO RIO","03","04","09","02","0304","000013068 - TRIO RIO"]
[null,null,null,null,null,null,null,null,null,null,null,null,null,null,"000013069","PUGUIENTIMARI","03","04","09","02","0304","000013069 - PUGUIENTIMARI"]
[null,null,null,null,null,null,null,null,null,null,null,null,null,null,"000014531","CENTRO DE ATENCIÓN PRIMARIA I ECHARATE - KITENI","03","04","09","02","0304","000014531 - CENTRO DE ATENCIÓN PRIMARIA I ECHARATE - KITENI"]
[null,null,null,null,null,null,null,null,null,null,null,null,null,null,"000024583","BCT N° 314 - KEPASHIATO","03","04","09","02","0304","000024583 - BCT N° 314 - KEPASHIATO"]
[null,null,null,null,null,null,null,null,null,null,null,null,null,null,"000000000","(All)","03","05",null,null,"0305","000000000 - (All)"]
[null,null,null,null,null,null,null,null,null,null,null,null,null,null,"000002426","KIRIGUETI","03","05","09","14","0305","000002426 - KIRIGUETI"]
[null,null,null,null,null,null,null,null,null,null,null,null,null,null,"000002428","CHOCORIARI","03","05","09","14","0305","000002428 - CHOCORIARI"]
[null,null,null,null,null,null,null,null,null,null,null,null,null,null,"000002435","MIARIA","03","05","09","14","0305","000002435 - MIARIA"]
[null,null,null,null,null,null,null,null,null,null,null,null,null,null,"000002436","NUEVA LUZ","03","05","09","14","0305","000002436 - NUEVA LUZ"]
[null,null,null,null,null,null,null,null,null,null,null,null,null,null,"000002437","NUEVO MUNDO","03","05","09","14","0305","000002437 - NUEVO MUNDO"]
[null,null,null,null,null,null,null,null,null,null,null,null,null,null,"000002441","PUERTO HUALLANA","03","05","09","14","0305","000002441 - PUERTO HUALLANA"]
[null,null,null,null,null,null,null,null,null,null,null,null,null,null,"000002442","PUERTO RICO","03","05","09","14","0305","000002442 - PUERTO RICO"]
[null,null,null,null,null,null,null,null,null,null,null,null,null,null,"000002444","SENSA","03","05","09","14","0305","000002444 - SENSA"]
[null,null,null,null,null,null,null,null,null,null,null,null,null,null,"000002445","TIMPIA","03","05","09","14","0305","000002445 - TIMPIA"]
[null,null,null,null,null,null,null,null,null,null,null,null,null,null,"000002448","KAMISEA","03","05","09","14","0305","000002448 - KAMISEA"]
[null,null,null,null,null,null,null,null,null,null,null,null,null,null,"000002452","SHIVANKORENI","03","05","09","14","0305","000002452 - SHIVANKORENI"]
[null,null,null,null,null,null,null,null,null,null,null,null,null,null,"000013066","MONTETONI","03","05","09","14","0305","000013066 - MONTETONI"]
[null,null,null,null,null,null,null,null,null,null,null,null,null,null,"000013067","TANGOSHIARI","03","05","09","14","0305","000013067 - TANGOSHIARI"]
[null,null,null,null,null,null,null,null,null,null,null,null,null,null,"000015235","NUEVA VIDA","03","05","09","14","0305","000015235 - NUEVA VIDA"]
[null,null,null,null,null,null,null,null,null,null,null,null,null,null,"000015843","CASHIRIARI","03","05","09","14","0305","000015843 - CASHIRIARI"]
[null,null,null,null,null,null,null,null,null,null,null,null,null,null,"000015844","CAMANA","03","05","09","14","0305","000015844 - CAMANA"]
[null,null,null,null,null,null,null,null,null,null,null,null,null,null,"000033274","BCT  NUEVO MUNDO","03","05","09","14","0305","000033274 - BCT  NUEVO MUNDO"]
[null,null,null,null,null,null,null,null,null,null,null,null,null,null,"000000000","(All)","03","06",null,null,"0306","000000000 - (All)"]
[null,null,null,null,null,null,null,null,null,null,null,null,null,null,"000002480","PUCYURA","03","06","09","09","0306","000002480 - PUCYURA"]
[null,null,null,null,null,null,null,null,null,null,null,null,null,null,"000002481","CCARCCO","03","06","09","11",{"$f":"CONCATENATE(Q282,R282)","v":"0306"},{"$f":"CONCATENATE(O282,\" - \",P282)","v":"000002481 - CCARCCO"}]
[null,null,null,null,null,null,null,null,null,null,null,null,null,null,"000002482","INCAHUASI","03","06","09","11","0306","000002482 - INCAHUASI"]
[null,null,null,null,null,null,null,null,null,null,null,null,null,null,"000002484","OYARA","03","06","09","09","0306","000002484 - OYARA"]
[null,null,null,null,null,null,null,null,null,null,null,null,null,null,"000002485","PACCAYBAMBA","03","06","09","11","0306","000002485 - PACCAYBAMBA"]
[null,null,null,null,null,null,null,null,null,null,null,null,null,null,"000002486","PAMPACONAS","03","06","09","09","0306","000002486 - PAMPACONAS"]
[null,null,null,null,null,null,null,null,null,null,null,null,null,null,"000002487","CHOQUETIRA","03","06","09","11","0306","000002487 - CHOQUETIRA"]
[null,null,null,null,null,null,null,null,null,null,null,null,null,null,"000002490","ARMA","03","06","09","09","0306","000002490 - ARMA"]
[null,null,null,null,null,null,null,null,null,null,null,null,null,null,"000002491","LUCMAHUAYCO","03","06","09","11","0306","000002491 - LUCMAHUAYCO"]
[null,null,null,null,null,null,null,null,null,null,null,null,null,null,"000002492","PALTAYBAMBA","03","06","09","09","0306","000002492 - PALTAYBAMBA"]
[null,null,null,null,null,null,null,null,null,null,null,null,null,null,"000013070","CHANCAVINE","03","06","09","12","0306","000013070 - CHANCAVINE"]
[null,null,null,null,null,null,null,null,null,null,null,null,null,null,"000000000","(All)","03","07",null,null,"0307","000000000 - (All)"]
[null,null,null,null,null,null,null,null,null,null,null,null,null,null,"000002429","CIRIALO                                                                                             ","03","07","09","02","0307","000002429 - CIRIALO                                                                                             "]
[null,null,null,null,null,null,null,null,null,null,null,null,null,null,"000002433","KORIBENI                                                                                            ","03","07","09","02","0307","000002433 - KORIBENI                                                                                            "]
[null,null,null,null,null,null,null,null,null,null,null,null,null,null,"000002439","PALMA REAL                                                                                          ","03","07","09","02","0307","000002439 - PALMA REAL                                                                                          "]
[null,null,null,null,null,null,null,null,null,null,null,null,null,null,"000002449","ICHIQUIATO                                                                                          ","03","07","09","02","0307","000002449 - ICHIQUIATO                                                                                          "]
[null,null,null,null,null,null,null,null,null,null,null,null,null,null,"000002450","SAN ANTONIO                                                                                         ","03","07","09","02","0307","000002450 - SAN ANTONIO                                                                                         "]
[null,null,null,null,null,null,null,null,null,null,null,null,null,null,"999999999","(All)","03","99",null,null,"0399","999999999 - (All)"]
[null,null,null,null,null,null,null,null,null,null,null,null,null,null,"000000000","(All)","04","00",null,null,"0400","000000000 - (All)"]
[null,null,null,null,null,null,null,null,null,null,null,null,null,null,"000002378","SICUANI","04","00","06","01","0400","000002378 - SICUANI"]
[null,null,null,null,null,null,null,null,null,null,null,null,null,null,"000007135","ESPINAR","04","00","08","01","0400","000007135 - ESPINAR"]
[null,null,null,null,null,null,null,null,null,null,null,null,null,null,"000000000","(All)","04","01",null,null,"0401","000000000 - (All)"]
[null,null,null,null,null,null,null,null,null,null,null,null,null,null,"000002364","YANAOCA","04","01","05","01","0401","000002364 - YANAOCA"]
[null,null,null,null,null,null,null,null,null,null,null,null,null,null,"000002365","PONGOÑA","04","01","05","01","0401","000002365 - PONGOÑA"]
[null,null,null,null,null,null,null,null,null,null,null,null,null,null,"000002372","PAMPAMARCA","04","01","05","06","0401","000002372 - PAMPAMARCA"]
[null,null,null,null,null,null,null,null,null,null,null,null,null,null,"000002373","QUEHUE","04","01","05","07","0401","000002373 - QUEHUE"]
[null,null,null,null,null,null,null,null,null,null,null,null,null,null,"000002374","HUINCHIRI","04","01","05","07","0401","000002374 - HUINCHIRI"]
[null,null,null,null,null,null,null,null,null,null,null,null,null,null,"000002375","SURIMANA","04","01","05","08","0401","000002375 - SURIMANA"]
[null,null,null,null,null,null,null,null,null,null,null,null,null,null,"000002376","TUNGASUCA","04","01","05","08","0401","000002376 - TUNGASUCA"]
[null,null,null,null,null,null,null,null,null,null,null,null,null,null,"000002377","TOCCOCCORI","04","01","05","08","0401","000002377 - TOCCOCCORI"]
[null,null,null,null,null,null,null,null,null,null,null,null,null,null,"000018241","HAMPATURA","04","01","05","01","0401","000018241 - HAMPATURA"]
[null,null,null,null,null,null,null,null,null,null,null,null,null,null,"000032339","CCOCHAPATA","04","01","05","08","0401","000032339 - CCOCHAPATA"]
[null,null,null,null,null,null,null,null,null,null,null,null,null,null,"000000000","(All)","04","02",null,null,"0402","000000000 - (All)"]
[null,null,null,null,null,null,null,null,null,null,null,null,null,null,"000002366","CHECCA","04","02","05","02","0402","000002366 - CHECCA"]
[null,null,null,null,null,null,null,null,null,null,null,null,null,null,"000002367","CHITIBAMBA","04","01","05","02","0401","000002367 - CHITIBAMBA"]
[null,null,null,null,null,null,null,null,null,null,null,null,null,null,"000007700","EL DESCANSO","04","02","05","03","0402","000007700 - EL DESCANSO"]
[null,null,null,null,null,null,null,null,null,null,null,null,null,null,"000000000","(All)","04","03",null,null,"0403","000000000 - (All)"]
[null,null,null,null,null,null,null,null,null,null,null,null,null,null,"000002320","MOSOCLLACTA","04","03","02","04","0403","000002320 - MOSOCLLACTA"]
[null,null,null,null,null,null,null,null,null,null,null,null,null,null,"000002385","CHECACUPE","04","03","06","02","0403","000002385 - CHECACUPE"]
[null,null,null,null,null,null,null,null,null,null,null,null,null,null,"000002386","COMBAPATA CANCHIS","04","03","06","03","0403","000002386 - COMBAPATA CANCHIS"]
[null,null,null,null,null,null,null,null,null,null,null,null,null,null,"000002387","CHIARA","04","03","06","03","0403","000002387 - CHIARA"]
[null,null,null,null,null,null,null,null,null,null,null,null,null,null,"000002392","PITUMARCA","04","03","06","05","0403","000002392 - PITUMARCA"]
[null,null,null,null,null,null,null,null,null,null,null,null,null,null,"000002397","TINTA","04","03","06","08","0403","000002397 - TINTA"]
[null,null,null,null,null,null,null,null,null,null,null,null,null,null,"000000000","(All)","04","04",null,null,"0404","000000000 - (All)"]
[null,null,null,null,null,null,null,null,null,null,null,null,null,null,"000002369","LANGUI","04","04","05","04","0404","000002369 - LANGUI"]
[null,null,null,null,null,null,null,null,null,null,null,null,null,null,"000002370","CONDEVILUYO","04","04","05","04","0404","000002370 - CONDEVILUYO"]
[null,null,null,null,null,null,null,null,null,null,null,null,null,null,"000002371","LAYO","04","04","05","05","0404","000002371 - LAYO"]
[null,null,null,null,null,null,null,null,null,null,null,null,null,null,"000002379","HERCCA","04","04","06","01","0404","000002379 - HERCCA"]
[null,null,null,null,null,null,null,null,null,null,null,null,null,null,"000002380","TECHO OBRERO","04","04","06","01","0404","000002380 - TECHO OBRERO"]
[null,null,null,null,null,null,null,null,null,null,null,null,null,null,"000002388","MARANGANI","04","04","06","04","0404","000002388 - MARANGANI"]
[null,null,null,null,null,null,null,null,null,null,null,null,null,null,"000002389","CHECTUYOC","04","04","06","04","0404","000002389 - CHECTUYOC"]
[null,null,null,null,null,null,null,null,null,null,null,null,null,null,"000002390","CCUYO","04","04","06","04","0404","000002390 - CCUYO"]
[null,null,null,null,null,null,null,null,null,null,null,null,null,null,"000002391","OCCOBAMBA MARANGANI","04","04","06","04","0404","000002391 - OCCOBAMBA MARANGANI"]
[null,null,null,null,null,null,null,null,null,null,null,null,null,null,"000010063","ESSALUD SICUANI","04","04","06","01","0404","000010063 - ESSALUD SICUANI"]
[null,null,null,null,null,null,null,null,null,null,null,null,null,null,"000024639","INPE SICUANI","04","04","06","01","0404","000024639 - INPE SICUANI"]
[null,null,null,null,null,null,null,null,null,null,null,null,null,null,"000024663","SANIDAD PNP  SICUANI","04","04","06","01","0404","000024663 - SANIDAD PNP  SICUANI"]
[null,null,null,null,null,null,null,null,null,null,null,null,null,null,"000000000","(All)","04","05",null,null,"0405","000000000 - (All)"]
[null,null,null,null,null,null,null,null,null,null,null,null,null,null,"000002381","QUEHUAR","04","05","06","01","0405","000002381 - QUEHUAR"]
[null,null,null,null,null,null,null,null,null,null,null,null,null,null,"000002382","UZCUPATA","04","05","06","01","0405","000002382 - UZCUPATA"]
[null,null,null,null,null,null,null,null,null,null,null,null,null,null,"000002383","LA FLORIDA","04","05","06","01","0405","000002383 - LA FLORIDA"]
[null,null,null,null,null,null,null,null,null,null,null,null,null,null,"000002384","PAMPAPHALLA","04","05","06","01","0405","000002384 - PAMPAPHALLA"]
[null,null,null,null,null,null,null,null,null,null,null,null,null,null,"000002393","PHINAYA","04","05","06","05","0405","000002393 - PHINAYA"]
[null,null,null,null,null,null,null,null,null,null,null,null,null,null,"000002394","SAN PABLO CANCHIS","04","05","06","06","0405","000002394 - SAN PABLO CANCHIS"]
[null,null,null,null,null,null,null,null,null,null,null,null,null,null,"000002395","SANTA BARBARA","04","05","06","06","0405","000002395 - SANTA BARBARA"]
[null,null,null,null,null,null,null,null,null,null,null,null,null,null,"000002396","SAN PEDRO CANCHIS","04","05","06","07","0405","000002396 - SAN PEDRO CANCHIS"]
[null,null,null,null,null,null,null,null,null,null,null,null,null,null,"000026387","MENTAL COMUNITARIO SICUANI","04","05","06","01","0405","000026387 - MENTAL COMUNITARIO SICUANI"]
[null,null,null,null,null,null,null,null,null,null,null,null,null,null,"000032923","SR DE PAMPACUCHO-SICUANI","04","05","06","01","0405","000032923 - SR DE PAMPACUCHO-SICUANI"]
[null,null,null,null,null,null,null,null,null,null,null,null,null,null,"000000000","(All)","04","06",null,null,"0406","000000000 - (All)"]
[null,null,null,null,null,null,null,null,null,null,null,null,null,null,"000002410","YAURI","04","06","08","01",{"$f":"CONCATENATE(Q349,R349)","v":"0406"},{"$f":"CONCATENATE(O349,\" - \",P349)","v":"000002410 - YAURI"}]
[null,null,null,null,null,null,null,null,null,null,null,null,null,null,"000002411","CONDOROMA","04","06","08","02","0406","000002411 - CONDOROMA"]
[null,null,null,null,null,null,null,null,null,null,null,null,null,null,"000002412","COPORAQUE","04","06","08","03","0406","000002412 - COPORAQUE"]
[null,null,null,null,null,null,null,null,null,null,null,null,null,null,"000002413","URINSAYA","04","06","08","03","0406","000002413 - URINSAYA"]
[null,null,null,null,null,null,null,null,null,null,null,null,null,null,"000002414","HUAYHUAHUASI","04","06","08","03","0406","000002414 - HUAYHUAHUASI"]
[null,null,null,null,null,null,null,null,null,null,null,null,null,null,"000002415","OCCORURO","04","06","08","04","0406","000002415 - OCCORURO"]
[null,null,null,null,null,null,null,null,null,null,null,null,null,null,"000002416","PALLPATA","04","06","08","05","0406","000002416 - PALLPATA"]
[null,null,null,null,null,null,null,null,null,null,null,null,null,null,"000002417","PICHIGUA ESPINAR","04","06","08","06","0406","000002417 - PICHIGUA ESPINAR"]
[null,null,null,null,null,null,null,null,null,null,null,null,null,null,"000002418","SAN MIGUEL","04","06","08","06","0406","000002418 - SAN MIGUEL"]
[null,null,null,null,null,null,null,null,null,null,null,null,null,null,"000002419","SUYKUTAMBO","04","06","08","07","0406","000002419 - SUYKUTAMBO"]
[null,null,null,null,null,null,null,null,null,null,null,null,null,null,"000002420","ACCOCUNCA","04","06","08","08","0406","000002420 - ACCOCUNCA"]
[null,null,null,null,null,null,null,null,null,null,null,null,null,null,"000006745","TINTAYA MARQUIRI","04","06","08","01","0406","000006745 - TINTAYA MARQUIRI"]
[null,null,null,null,null,null,null,null,null,null,null,null,null,null,"000010061","ESPINAR - ESSALUD","04","06","08","01","0406","000010061 - ESPINAR - ESSALUD"]
[null,null,null,null,null,null,null,null,null,null,null,null,null,null,"000030366","MENTAL COMUNITARIO ESPINAR \"MUSUQ KAWSAY\"","04","06","08","01","0406","000030366 - MENTAL COMUNITARIO ESPINAR \"MUSUQ KAWSAY\""]
[null,null,null,null,null,null,null,null,null,null,null,null,null,null,"999999999","(All)","04","99",null,null,"0499","999999999 - (All)"]
[null,null,null,null,null,null,null,null,null,null,null,null,null,null,"000002469","SAN JUAN DE KIMBIRI-VRAEM","05","00","09","07","0500","000002469 - SAN JUAN DE KIMBIRI-VRAEM"]
[null,null,null,null,null,null,null,null,null,null,null,null,null,null,"000000000","(All)","05","01",null,null,"0501","000000000 - (All)"]
[null,null,null,null,null,null,null,null,null,null,null,null,null,null,"000002470","CHIRUMPIARI","05","01","09","07","0501","000002470 - CHIRUMPIARI"]
[null,null,null,null,null,null,null,null,null,null,null,null,null,null,"000002471","LOBO TAHUANTINSUYO","05","01","09","07","0501","000002471 - LOBO TAHUANTINSUYO"]
[null,null,null,null,null,null,null,null,null,null,null,null,null,null,"000002472","MAPITUNARI","05","01","09","07","0501","000002472 - MAPITUNARI"]
[null,null,null,null,null,null,null,null,null,null,null,null,null,null,"000002473","UNION ROSALES","05","01","09","07","0501","000002473 - UNION ROSALES"]
[null,null,null,null,null,null,null,null,null,null,null,null,null,null,"000002474","SAMANIATO","05","01","09","07","0501","000002474 - SAMANIATO"]
[null,null,null,null,null,null,null,null,null,null,null,null,null,null,"000002475","KIMBIRI ALTO","05","01","09","07","0501","000002475 - KIMBIRI ALTO"]
[null,null,null,null,null,null,null,null,null,null,null,null,null,null,"000002479","VILLA VIRGEN","05","01","09","12","0501","000002479 - VILLA VIRGEN"]
[null,null,null,null,null,null,null,null,null,null,null,null,null,null,"000002488","VILLA KINTIARINA","05","01","09","13","0501","000002488 - VILLA KINTIARINA"]
[null,null,null,null,null,null,null,null,null,null,null,null,null,null,"000008283","PUEBLO LIBRE","05","01","09","13","0501","000008283 - PUEBLO LIBRE"]
[null,null,null,null,null,null,null,null,null,null,null,null,null,null,"000008284","MANITEA ALTA","05","01","09","07","0501","000008284 - MANITEA ALTA"]
[null,null,null,null,null,null,null,null,null,null,null,null,null,null,"000008285","ANGELES","05","01","09","07","0501","000008285 - ANGELES"]
[null,null,null,null,null,null,null,null,null,null,null,null,null,null,"000024957","BTC LA OROYA  N°34 VILLA VIRGEN","05","01","09","12","0501","000024957 - BTC LA OROYA  N°34 VILLA VIRGEN"]
[null,null,null,null,null,null,null,null,null,null,null,null,null,null,"000000000","(All)","05","02",null,null,"0502","000000000 - (All)"]
[null,null,null,null,null,null,null,null,null,null,null,null,null,null,"000002494","PICHARI","05","02","09","10","0502","000002494 - PICHARI"]
[null,null,null,null,null,null,null,null,null,null,null,null,null,null,"000002495","MANTARO","05","02","09","10","0502","000002495 - MANTARO"]
[null,null,null,null,null,null,null,null,null,null,null,null,null,null,"000002496","OMAYA","05","02","09","10","0502","000002496 - OMAYA"]
[null,null,null,null,null,null,null,null,null,null,null,null,null,null,"000002497","OTARI","05","02","09","10","0502","000002497 - OTARI"]
[null,null,null,null,null,null,null,null,null,null,null,null,null,null,"000002498","PUERTO MAYO","05","02","09","10","0502","000002498 - PUERTO MAYO"]
[null,null,null,null,null,null,null,null,null,null,null,null,null,null,"000007113","NATIVIDAD","05","02","09","10","0502","000007113 - NATIVIDAD"]
[null,null,null,null,null,null,null,null,null,null,null,null,null,null,"000007114","QUISTO CENTRAL","05","02","09","10","0502","000007114 - QUISTO CENTRAL"]
[null,null,null,null,null,null,null,null,null,null,null,null,null,null,"000015104","TAMBO DEL ENE","05","02","09","10","0502","000015104 - TAMBO DEL ENE"]
[null,null,null,null,null,null,null,null,null,null,null,null,null,null,"000015169","PITIRINQUINI","05","02","09","10","0502","000015169 - PITIRINQUINI"]
[null,null,null,null,null,null,null,null,null,null,null,null,null,null,"000015170","PICHARI BAJA","05","02","09","10","0502","000015170 - PICHARI BAJA"]
[null,null,null,null,null,null,null,null,null,null,null,null,null,null,"000024638","MILITAR PICHARI","05","02","09","10","0502","000024638 - MILITAR PICHARI"]
[null,null,null,null,null,null,null,null,null,null,null,null,null,null,"000027230","MEDICA POLICIAL PICHARI","05","02","09","10","0502","000027230 - MEDICA POLICIAL PICHARI"]
[null,null,null,null,null,null,null,null,null,null,null,null,null,null,"000027948","ESSALUD PICHARI","05","02","09","10","0502","000027948 - ESSALUD PICHARI"]
[null,null,null,null,null,null,null,null,null,null,null,null,null,null,"000032211","NUEVO PROGRESO","05","02","09","10","0502","000032211 - NUEVO PROGRESO"]
[null,null,null,null,null,null,null,null,null,null,null,null,null,null,"000033988","MENTAL COMUNITARIO PICHARI","05","02","09","10","0502","000033988 - MENTAL COMUNITARIO PICHARI"]
[null,null,null,null,null,null,null,null,null,null,null,null,null,null,"999999999","(All)","05","99",null,null,"0599","999999999 - (All)"]
[null,null,null,null,null,null,null,null,null,null,null,null,null,null,"000002398","SANTO TOMAS","06","00","07","01","0600","000002398 - SANTO TOMAS"]
[null,null,null,null,null,null,null,null,null,null,null,null,null,null,"000033097","SAMUE CHUMBIVILCAS","06","00","07","01","0600","000033097 - SAMUE CHUMBIVILCAS"]
[null,null,null,null,null,null,null,null,null,null,null,null,null,null,"000000000","(All)","06","01",null,null,"0601","000000000 - (All)"]
[null,null,null,null,null,null,null,null,null,null,null,null,null,null,"000002402","CHAMACA","06","01","07","03","0601","000002402 - CHAMACA"]
[null,null,null,null,null,null,null,null,null,null,null,null,null,null,"000002403","AÑAHUICHI","06","01","07","03","0601","000002403 - AÑAHUICHI"]
[null,null,null,null,null,null,null,null,null,null,null,null,null,null,"000002406","LIVITACA","06","01","07","05","0601","000002406 - LIVITACA"]
[null,null,null,null,null,null,null,null,null,null,null,null,null,null,"000016325","CHILLOROYA - LIVITACA","06","01","07","05","0601","000016325 - CHILLOROYA - LIVITACA"]
[null,null,null,null,null,null,null,null,null,null,null,null,null,null,"000016327","AUSANTA","06","01","07","05","0601","000016327 - AUSANTA"]
[null,null,null,null,null,null,null,null,null,null,null,null,null,null,"000016328","UCCHUCCARCCO","06","01","07","03","0601","000016328 - UCCHUCCARCCO"]
[null,null,null,null,null,null,null,null,null,null,null,null,null,null,"000016329","INGATA","06","01","07","03","0601","000016329 - INGATA"]
[null,null,null,null,null,null,null,null,null,null,null,null,null,null,"000016330","CCONCHACCOLLO","06","01","07","03","0601","000016330 - CCONCHACCOLLO"]
[null,null,null,null,null,null,null,null,null,null,null,null,null,null,"000016332","PATAQUEÑA - LIVITACA","06","01","07","05","0601","000016332 - PATAQUEÑA - LIVITACA"]
[null,null,null,null,null,null,null,null,null,null,null,null,null,null,"000016334","KISIO","06","01","07","05","0601","000016334 - KISIO"]
[null,null,null,null,null,null,null,null,null,null,null,null,null,null,"000025739","PISQUICOCHA","06","01","07","05","0601","000025739 - PISQUICOCHA"]
[null,null,null,null,null,null,null,null,null,null,null,null,null,null,"000025740","TOTORA - REYNA DE LOS ANGELES","06","01","07","05","0601","000025740 - TOTORA - REYNA DE LOS ANGELES"]
[null,null,null,null,null,null,null,null,null,null,null,null,null,null,"000000000","(All)","06","09",null,null,"0609","000000000 - (All)"]
[null,null,null,null,null,null,null,null,null,null,null,null,null,null,"000002399","PULPERA","06","09","07","01","0609","000002399 - PULPERA"]
[null,null,null,null,null,null,null,null,null,null,null,null,null,null,"000002400","ALHUACCHULLO","06","09","07","01","0609","000002400 - ALHUACCHULLO"]
[null,null,null,null,null,null,null,null,null,null,null,null,null,null,"000002401","CCAPACMARCA","06","09","07","02","0609","000002401 - CCAPACMARCA"]
[null,null,null,null,null,null,null,null,null,null,null,null,null,null,"000002404","COLQUEMARCA","06","09","07","04","0609","000002404 - COLQUEMARCA"]
[null,null,null,null,null,null,null,null,null,null,null,null,null,null,"000002405","CHARAMURAY","06","09","07","04","0609","000002405 - CHARAMURAY"]
[null,null,null,null,null,null,null,null,null,null,null,null,null,null,"000002407","LLUSCO","06","09","07","06","0609","000002407 - LLUSCO"]
[null,null,null,null,null,null,null,null,null,null,null,null,null,null,"000002408","QUIÑOTA","06","09","07","07","0609","000002408 - QUIÑOTA"]
[null,null,null,null,null,null,null,null,null,null,null,null,null,null,"000002409","VELILLE","06","09","07","08","0609","000002409 - VELILLE"]
[null,null,null,null,null,null,null,null,null,null,null,null,null,null,"000006746","LLIQUE","06","09","07","01","0609","000006746 - LLIQUE"]
[null,null,null,null,null,null,null,null,null,null,null,null,null,null,"000006747","LUTTO","06","09","07","06","0609","000006747 - LUTTO"]
[null,null,null,null,null,null,null,null,null,null,null,null,null,null,"000006748","COLLPA","06","09","07","06","0609","000006748 - COLLPA"]
[null,null,null,null,null,null,null,null,null,null,null,null,null,null,"000006981","CCOYO","06","09","07","01",{"$f":"CONCATENATE(Q422,R422)","v":"0609"},{"$f":"CONCATENATE(O422,\" - \",P422)","v":"000006981 - CCOYO"}]
[null,null,null,null,null,null,null,null,null,null,null,null,null,null,"000006982","MELLOTOTORA","06","09","07","01","0609","000006982 - MELLOTOTORA"]
[null,null,null,null,null,null,null,null,null,null,null,null,null,null,"000006983","ORCCOMA","06","09","07","01","0609","000006983 - ORCCOMA"]
[null,null,null,null,null,null,null,null,null,null,null,null,null,null,"000006984","CCOLLANA","06","09","07","07","0609","000006984 - CCOLLANA"]
[null,null,null,null,null,null,null,null,null,null,null,null,null,null,"000006985","TOTORAPALLCA","06","09","07","06","0609","000006985 - TOTORAPALLCA"]
[null,null,null,null,null,null,null,null,null,null,null,null,null,null,"000007111","YAVINA","06","09","07","01","0609","000007111 - YAVINA"]
[null,null,null,null,null,null,null,null,null,null,null,null,null,null,"000007112","YORENCCA","06","09","07","07","0609","000007112 - YORENCCA"]
[null,null,null,null,null,null,null,null,null,null,null,null,null,null,"000008912","ALCCA VICTORIA","06","09","07","08","0609","000008912 - ALCCA VICTORIA"]
[null,null,null,null,null,null,null,null,null,null,null,null,null,null,"000008913","HUARACO","06","09","07","04","0609","000008913 - HUARACO"]
[null,null,null,null,null,null,null,null,null,null,null,null,null,null,"000008914","HUAYLLANI","06","09","07","04","0609","000008914 - HUAYLLANI"]
[null,null,null,null,null,null,null,null,null,null,null,null,null,null,"000008915","PFULLPURI CONDEPAMPA","06","09","07","01","0609","000008915 - PFULLPURI CONDEPAMPA"]
[null,null,null,null,null,null,null,null,null,null,null,null,null,null,"000009963","CANCAHUANI","06","09","07","02","0609","000009963 - CANCAHUANI"]
[null,null,null,null,null,null,null,null,null,null,null,null,null,null,"000012932","YANQUE","06","09","07","04","0609","000012932 - YANQUE"]
[null,null,null,null,null,null,null,null,null,null,null,null,null,null,"000013185","CAP I SANTO TOMÁS  ESSALUD","06","09","07","01","0609","000013185 - CAP I SANTO TOMÁS  ESSALUD"]
[null,null,null,null,null,null,null,null,null,null,null,null,null,null,"000025369","PUMALLACTA","06","09","07","07","0609","000025369 - PUMALLACTA"]
[null,null,null,null,null,null,null,null,null,null,null,null,null,null,"000025371","TUNTUMA","06","09","07","08","0609","000025371 - TUNTUMA"]
[null,null,null,null,null,null,null,null,null,null,null,null,null,null,"000027008","ANTUYO","06","09","07","06","0609","000027008 - ANTUYO"]
[null,null,null,null,null,null,null,null,null,null,null,null,null,null,"000027009","TAHUAY","06","09","07","02","0609","000027009 - TAHUAY"]
[null,null,null,null,null,null,null,null,null,null,null,null,null,null,"000027011","AYACCASI","06","09","07","08","0609","000027011 - AYACCASI"]
[null,null,null,null,null,null,null,null,null,null,null,null,null,null,"000027016","HUAYCUÑUTA - URCURUTA","06","09","07","08","0609","000027016 - HUAYCUÑUTA - URCURUTA"]
[null,null,null,null,null,null,null,null,null,null,null,null,null,null,"000030940","ARCANGEL SAN MIGUEL DE ESQUINA CONGUNYA","06","09","07","01","0609","000030940 - ARCANGEL SAN MIGUEL DE ESQUINA CONGUNYA"]
[null,null,null,null,null,null,null,null,null,null,null,null,null,null,"999999999","(All)","06","99",null,null,"0699","999999999 - (All)"]
[null,null,null,null,null,null,null,null,null,null,null,null,null,null,"999999999","(All)","99","99",null,null,"9999","999999999 - (All)"]

{"sheet":"PROV_DIST","index":5,"n_rows":134,"n_cols":7,"rows_kept":134,"cut":false,"hidden":false,"merged":[]}
[]
[]
[]
[]
[]
[]
[]
["anno","(Todas)"]
["mes","(Todas)"]
["codmic","(Todas)"]
["cod_prov","(Todas)"]
["coddist","(Todas)"]
["cod_estab","(Todas)"]
[]
[null,null,"Valores"]
["DESC_PROV","DESC_DIST"," TBC_NUEVOS"," RECAIDAS"," ABANDONOS"," FRACASOS"," MORBILIDAD"]
["ANTA","ANCAHUASI",0,0,0,0,0]
[null,"ANTA",0,0,0,0,0]
[null,"CACHIMAYO",0,0,0,0,0]
[null,"CHINCHAYPUJIO",0,0,0,0,0]
[null,"HUAROCONDO",0,0,0,0,0]
[null,"LIMATAMBO",0,0,0,0,0]
[null,"MOLLEPATA",0,0,0,0,0]
[null,"PUCYURA",0,0,0,0,0]
[null,"ZURITE",0,0,0,0,0]
["CALCA","CALCA",0,0,0,0,0]
[null,"COYA",0,0,0,0,0]
[null,"LAMAY",0,0,0,0,0]
[null,"LARES",0,0,0,0,0]
[null,"PISAC",0,0,0,0,0]
[null,"SAN SALVADOR",0,0,0,0,0]
[null,"TARAY",0,0,0,0,0]
[null,"YANATILE",0,0,0,0,0]
["CUSCO","CCORCA",0,0,0,0,0]
[null,"CUSCO",0,0,0,0,0]
[null,"POROY",0,0,0,0,0]
[null,"SAN SEBASTIAN",0,0,0,0,0]
[null,"SANTIAGO",0,0,0,0,0]
[null,"WANCHAQ",0,0,0,0,0]
[null,"SAN JERONIMO",0,0,0,0,0]
[null,"SAYLLA",0,0,0,0,0]
["PAUCARTAMBO","CHALLABAMBA",0,0,0,0,0]
[null,"PAUCARTAMBO",0,0,0,0,0]
[null,"CAICAY",0,0,0,0,0]
[null,"COLQUEPATA",0,0,0,0,0]
[null,"HUANCARANI",0,0,0,0,0]
[null,"KOSÑIPATA",0,0,0,0,0]
["URUBAMBA","CHINCHERO",0,0,0,0,0]
[null,"HUAYLLABAMBA",0,0,0,0,0]
[null,"MACHUPICCHU",0,0,0,0,0]
[null,"MARAS",0,0,0,0,0]
[null,"OLLANTAYTAMBO",0,0,0,0,0]
[null,"URUBAMBA",0,0,0,0,0]
[null,"YUCAY",0,0,0,0,0]
["LA CONVENCION","OCOBAMBA",0,0,0,0,0]
[null,"QUELLOUNO",1,0,0,0,1]
[null,"SANTA ANA",28,1,1,0,30]
[null,"ECHARATE",18,0,0,0,18]
[null,"MEGANTONI",4,0,0,0,4]
[null,"HUAYOPATA",1,0,0,0,1]
[null,"MARANURA",1,0,0,0,1]
[null,"KIMBIRI",0,0,0,0,0]
[null,"SANTA TERESA",4,0,0,0,4]
[null,"VILLA VIRGEN",0,0,0,0,0]
[null,"VILCABAMBA",0,0,0,0,0]
[null,"INKAWASI",0,0,0,0,0]
[null,"VILLA KINTIARINA",0,0,0,0,0]
[null,"PICHARI",0,0,0,0,0]
[null,"CIELO PUNCO",0,0,0,0,0]
[null,"MANITEA",0,0,0,0,0]
[null,"UNION ASHÁNINKA",0,0,0,0,0]
[null,"KUMPIRUSHIATO",1,0,0,0,1]
["ACOMAYO","ACOMAYO",0,0,0,0,0]
[null,"ACOPIA",0,0,0,0,0]
[null,"ACOS",0,0,0,0,0]
[null,"MOSOC LLACTA",0,0,0,0,0]
[null,"POMACANCHI",0,0,0,0,0]
[null,"RONDOCAN",0,0,0,0,0]
[null,"SANGARARA",0,0,0,0,0]
["CANAS","YANAOCA",0,0,0,0,0]
[null,"CHECCA",0,0,0,0,0]
[null,"LANGUI",0,0,0,0,0]
[null,"LAYO",0,0,0,0,0]
[null,"PAMPAMARCA",0,0,0,0,0]
[null,"QUEHUE",0,0,0,0,0]
[null,"TUPAC AMARU",0,0,0,0,0]
[null,"KUNTURKANKI",0,0,0,0,0]
["CANCHIS","SICUANI",0,0,0,0,0]
[null,"CHECACUPE",0,0,0,0,0]
[null,"COMBAPATA",0,0,0,0,0]
[null,"MARANGANI",0,0,0,0,0]
[null,"PITUMARCA",0,0,0,0,0]
[null,"SAN PABLO",0,0,0,0,0]
[null,"SAN PEDRO",0,0,0,0,0]
[null,"TINTA",0,0,0,0,0]
["CHUMBIVILCAS","SANTO TOMAS",0,0,0,0,0]
[null,"CAPACMARCA",0,0,0,0,0]
[null,"CHAMACA",0,0,0,0,0]
[null,"COLQUEMARCA",0,0,0,0,0]
[null,"LIVITACA",0,0,0,0,0]
[null,"LLUSCO",0,0,0,0,0]
[null,"QUIÑOTA",0,0,0,0,0]
[null,"VELILLE",0,0,0,0,0]
["ESPINAR","ESPINAR",0,0,0,0,0]
[null,"CONDOROMA",0,0,0,0,0]
[null,"COPORAQUE",0,0,0,0,0]
[null,"OCORURO",0,0,0,0,0]
[null,"PALLPATA",0,0,0,0,0]
[null,"PICHIGUA",0,0,0,0,0]
[null,"SUYCKUTAMBO",0,0,0,0,0]
[null,"ALTO PICHIGUA",0,0,0,0,0]
["PARURO","PARURO",0,0,0,0,0]
[null,"ACCHA",0,0,0,0,0]
[null,"CCAPI",0,0,0,0,0]
[null,"COLCHA",0,0,0,0,0]
[null,"HUANOQUITE",0,0,0,0,0]
[null,"OMACHA",0,0,0,0,0]
[null,"PACCARITAMBO",0,0,0,0,0]
[null,"PILLPINTO",0,0,0,0,0]
[null,"YAURISQUE",0,0,0,0,0]
["QUISPICANCHI","URCOS",0,0,0,0,0]
[null,"CCATCA",0,0,0,0,0]
[null,"ANDAHUAYLILLAS",0,0,0,0,0]
[null,"CAMANTI",0,0,0,0,0]
[null,"CCARHUAYO",0,0,0,0,0]
[null,"CUSIPATA",0,0,0,0,0]
[null,"HUARO",0,0,0,0,0]
[null,"LUCRE",0,0,0,0,0]
[null,"MARCAPATA",0,0,0,0,0]
[null,"OCONGATE",0,0,0,0,0]
[null,"OROPESA",0,0,0,0,0]
[null,"QUIQUIJANA",0,0,0,0,0]
["(en blanco)","(en blanco)",0,0,0,0,0]
["Total general",null,58,1,1,0,60]

{"sheet":"TBC_NEW","index":6,"n_rows":93,"n_cols":49,"rows_kept":93,"cut":false,"hidden":false,"merged":[[11,2,11,3],[12,2,12,3],[4,2,4,3],[4,6,4,7],[5,2,5,3],[6,2,6,3],[6,6,6,9],[67,2,67,4],[68,2,68,4],[80,1,81,1],[80,2,80,11],[80,12,81,12],[61,1,64,1],[61,2,62,2],[61,5,64,5],[63,2,64,2],[65,1,66,1],[65,3,66,3],[65,5,66,5],[60,1,60,2],[45,1,46,2],[45,4,46,5],[52,4,52,5],[52,9,52,10],[53,7,54,7],[53,9,53,10],[54,9,54,10],[55,7,56,7],[55,9,55,10],[56,9,56,10],[57,1,57,2],[57,4,57,6],[41,1,41,2],[41,8,41,9],[42,1,43,2],[42,8,42,9],[44,1,44,2],[44,8,44,9],[34,1,34,2],[34,6,34,7],[39,1,39,2],[39,8,39,9],[40,1,40,2],[40,8,40,9],[33,1,33,2],[33,6,33,7],[24,6,24,7],[25,1,25,3],[25,6,25,8],[26,1,26,2],[26,6,26,8],[27,1,27,2],[28,1,28,2],[29,1,29,2],[31,1,31,2],[32,1,32,2],[32,6,32,7],[1,1,1,11],[20,1,20,4],[20,6,20,7],[21,1,21,3],[21,4,22,4],[21,6,21,7],[22,6,23,6],[7,2,7,3],[8,2,8,3],[13,2,13,3],[14,2,14,3],[2,1,2,12],[8,6,8,9],[9,2,9,3],[10,2,10,3],[10,6,10,7]]}
[]
[]
[null,"REPORTE MENSUAL DE ACTIVIDADES DE PREVENCION Y CONTROL DE TUBERCULOSIS"]
[]
[null,"DIRESA","CUSCO",null,null,"REGION","CUSCO"]
[]
[null,"RED DE SALUD ",{"$f":"+TABLAS!O9","v":"03 - LA CONVENCION"},null,null,"EJECUTORA",{"$f":"+TABLAS!O14","v":""}]
[]
[null,"MICRO RED",{"$f":"+TABLAS!O10","v":""},null,null,"RESPONSABLE"]
[]
[null,"EE.SS.",{"$f":"+TABLAS!O11","v":""},null,null,"COD. RENAES",{"$f":"+TABLAS!Q11","v":""}]
[]
[null,"PROVINCIA",{"$f":"+TABLAS!O12","v":""},null,null,"AÑO",{"$f":"+TABLAS!J16","v":"2024"}]
[]
[null,"DISTRITO",{"$f":"+TABLAS!O13","v":""},null,null,"MES",{"$f":"+TABLAS!N26","v":"FEB - NOV"}]
[]
[null,"INSTITUCION :  MINSA (  X  )   ESSALUD (     )   FFAA  (     )   PNP  (     )   INPE  (     )   OTROS  (     )"]
[]
[null,"I. ACTIVIDADES DE DETECCION Y DIAGNOSTICO PARA TUBERCULOSIS"]
[]
[null,"DETECCIÓN DE CASOS",null,null,null,null,"RECOLECCIÓN DE MUESTRAS PARA EXAMEN BACTERIOLÓGICO",null,"N°",null,null,null,null,null,null,null,null,null,null,null,null,null,null,null,null,null,null,null,null,null,null,null,null,null,null,"\";TABLAS!$A$281)"]
[null,"Sintomático respiratorio (SR)",null,null,"Caso probable de TB",null,"RECOLECCIÓN DE MUESTRAS PARA TB*",null,{"$f":"+GETPIVOTDATA(\" BAS001\",TABLAS!$A$281)","v":5835},null,null,null,null,null,null,null,1,null,null,null,null,null,null,null,null,null,null,null,{"$f":"IF(LEN(Q22)=1,CONCATENATE(\"00\",Q22),IF(LEN(Q22)=2,CONCATENATE(\"0\",Q22),Q22))","v":"001"},null,null,null,null,null,"=+IMPORTARDATOSDINAMICOS(\" BAS",null,null,null,null,{"$f":"$AI$22&AC22&$AJ$21","v":"=+IMPORTARDATOSDINAMICOS(\" BAS001\";TABLAS!$A$281)"}]
[null,"SR Identificado","SR Examinado","SR examinados con bacteriología confirmada",null,null,"PROCEDIMIENTOS ESPECIALES PARA OBTENCION DE MUESTRAS","Lavado gástrico",{"$f":"+GETPIVOTDATA(\" BAS002\",TABLAS!$A$281)","v":1},null,null,null,null,null,null,null,{"$f":"+Q22+1","v":2},null,null,null,null,null,null,null,null,null,null,null,"002",null,null,null,null,null,null,null,null,null,null,{"$f":"$AI$22&AC23&$AJ$21","v":"=+IMPORTARDATOSDINAMICOS(\" BAS002\";TABLAS!$A$281)"}]
[null,{"$f":"M91","v":1391},{"$f":"M92","v":1315},{"$f":"M93","v":5},{"$f":"M90","v":5},null,null,"Inducción del esputo",{"$f":"+GETPIVOTDATA(\" BAS003\",TABLAS!$A$281)","v":0},null,null,null,null,null,null,null,{"$f":"+Q23+1","v":3},null,null,null,null,null,null,null,null,null,null,null,"003",null,null,null,null,null,null,null,null,null,null,"=+IMPORTARDATOSDINAMICOS(\" BAS003\";TABLAS!$A$281)"]
[null,null,null,null,null,null,"TOTAL",null,{"$f":"SUM(I22+I23+I24)","v":5836}]
[null,"SR examinados con bacteriología confirmada",null,null,null,null,"*Muestra recolectada por expectoración espontánea"]
[null,"Por baciloscopia",null,{"$f":"+GETPIVOTDATA(\" BAS004\",TABLAS!$A$281)","v":5},null,null,"REFERENCIAS",null,null,null,null,null,null,null,null,null,{"$f":"+Q24+1","v":4},null,null,null,null,null,null,null,null,null,null,null,{"$f":"IF(LEN(Q27)=1,CONCATENATE(\"00\",Q27),IF(LEN(Q27)=2,CONCATENATE(\"0\",Q27),Q27))","v":"004"},null,null,null,null,null,null,null,null,null,null,{"$f":"$AI$22&AC27&$AJ$21","v":"=+IMPORTARDATOSDINAMICOS(\" BAS004\";TABLAS!$A$281)"}]
[null,"Por prueba molecular",null,{"$f":"+GETPIVOTDATA(\" BAS005\",TABLAS!$A$281)","v":0},null,null,"Condición","Derivaciones","Transferencias",null,null,null,null,null,null,null,{"$f":"+Q27+1","v":5},null,null,{"$f":"+Q29+1","v":7},{"$f":"+T28+1","v":8},null,null,null,null,null,null,null,"005",null,null,{"$f":"IF(LEN(T28)=1,CONCATENATE(\"00\",T28),IF(LEN(T28)=2,CONCATENATE(\"0\",T28),T28))","v":"007"},{"$f":"IF(LEN(U28)=1,CONCATENATE(\"00\",U28),IF(LEN(U28)=2,CONCATENATE(\"0\",U28),U28))","v":"008"},null,null,null,null,null,null,"=+IMPORTARDATOSDINAMICOS(\" BAS005\";TABLAS!$A$281)",null,null,{"$f":"$AI$22&AF28&$AJ$21","v":"=+IMPORTARDATOSDINAMICOS(\" BAS007\";TABLAS!$A$281)"},{"$f":"$AI$22&AG28&$AJ$21","v":"=+IMPORTARDATOSDINAMICOS(\" BAS008\";TABLAS!$A$281)"}]
[null,"Por cultivo",null,{"$f":"+GETPIVOTDATA(\" BAS006\",TABLAS!$A$281)","v":0},null,null,"Realizadas",{"$f":"+GETPIVOTDATA(\" BAS007\",TABLAS!$A$281)","v":0},{"$f":"+GETPIVOTDATA(\" BAS008\",TABLAS!$A$281)","v":2},null,null,null,null,null,null,null,{"$f":"+Q28+1","v":6},null,null,{"$f":"+U28+1","v":9},{"$f":"+T29+1","v":10},null,null,null,null,null,null,null,"006",null,null,"009","010",null,null,null,null,null,null,"=+IMPORTARDATOSDINAMICOS(\" BAS006\";TABLAS!$A$281)",null,null,"=+IMPORTARDATOSDINAMICOS(\" BAS009\";TABLAS!$A$281)","=+IMPORTARDATOSDINAMICOS(\" BAS010\";TABLAS!$A$281)"]
[null,"TOTAL",null,{"$f":"SUM(D27+D28+D29)","v":5},null,null,"Aceptadas",{"$f":"+GETPIVOTDATA(\" BAS009\",TABLAS!$A$281)","v":13},{"$f":"+GETPIVOTDATA(\" BAS010\",TABLAS!$A$281)","v":6}]
[null,null,null,null,null,null,"TOTAL",{"$f":"SUM(H29+H30)","v":13},{"$f":"SUM(I29+I30)","v":8}]
[null,"COMORBILIDADES Y CONDICIONES ASOCIADAS",null,"N°"]
[null,"TB-VIH/SIDA",null,{"$f":"+GETPIVOTDATA(\" BAS011\",TABLAS!$A$281)","v":0},null,null,"TAMIZAJE DE COMORBILIDADES",null,"N°",null,null,null,null,null,null,null,{"$f":"+U29+1","v":11},null,null,null,null,null,null,null,null,null,null,null,{"$f":"IF(LEN(Q33)=1,CONCATENATE(\"00\",Q33),IF(LEN(Q33)=2,CONCATENATE(\"0\",Q33),Q33))","v":"011"},null,null,null,null,null,null,null,null,null,null,{"$f":"$AI$22&AC33&$AJ$21","v":"=+IMPORTARDATOSDINAMICOS(\" BAS011\";TABLAS!$A$281)"}]
[null,"TB-DM",null,{"$f":"+GETPIVOTDATA(\" BAS012\",TABLAS!$A$281)","v":1},null,null,"Tamizaje TB-VIH",null,{"$f":"+GETPIVOTDATA(\" BAS014\",TABLAS!$A$281)","v":40},null,null,null,null,null,null,null,{"$f":"+Q33+1","v":12},null,{"$f":"+Q35+1","v":14},null,null,null,null,null,null,null,null,null,"012",null,{"$f":"IF(LEN(S34)=1,CONCATENATE(\"00\",S34),IF(LEN(S34)=2,CONCATENATE(\"0\",S34),S34))","v":"014"},null,null,null,null,null,null,null,null,"=+IMPORTARDATOSDINAMICOS(\" BAS012\";TABLAS!$A$281)",null,{"$f":"$AI$22&AE34&$AJ$21","v":"=+IMPORTARDATOSDINAMICOS(\" BAS014\";TABLAS!$A$281)"}]
[null,"Reacción adversa a medicamentos para TB",null,{"$f":"+GETPIVOTDATA(\" BAS013\",TABLAS!$A$281)","v":0},null,null,"Tamizaje TB-DM",null,{"$f":"+GETPIVOTDATA(\" BAS015\",TABLAS!$A$281)","v":13},null,null,null,null,null,null,null,13,null,{"$f":"+S34+1","v":15},null,null,null,null,null,null,null,null,null,"013",null,"015",null,null,null,null,null,null,null,null,"=+IMPORTARDATOSDINAMICOS(\" BAS013\";TABLAS!$A$281)",null,"=+IMPORTARDATOSDINAMICOS(\" BAS015\";TABLAS!$A$281)"]
[]
[]
[null,"II. ACTIVIDADES PARA LA RECUPERACION DE LA PERSONA AFECTADA POR TUBERCULOSIS"]
[]
[null,"ATENCIÓN MULTIDISCIPLINARIA",null,"MODALIDAD","EN PAT CON TB SENSIBLE","EN PAT CON TB RESISTENTE","TOTAL",null,2,null,"N°"]
[null,"Evaluación médica",null,null,{"$f":"+GETPIVOTDATA(\" BAS016\",TABLAS!$A$281)","v":30},{"$f":"+GETPIVOTDATA(\" BAS017\",TABLAS!$A$281)","v":0},{"$f":"SUM(E41+F41)","v":30},null,"Administración de tratamiento para TB sensible",null,{"$f":"+GETPIVOTDATA(\" BAS028\",TABLAS!$A$281)","v":2797},null,null,null,null,null,{"$f":"+S35+1","v":16},{"$f":"+Q41+1","v":17},null,null,null,{"$f":"+Q47+1","v":28},null,null,null,null,null,null,{"$f":"IF(LEN(Q41)=1,CONCATENATE(\"00\",Q41),IF(LEN(Q41)=2,CONCATENATE(\"0\",Q41),Q41))","v":"016"},"017",null,null,null,{"$f":"IF(LEN(V41)=1,CONCATENATE(\"00\",V41),IF(LEN(V41)=2,CONCATENATE(\"0\",V41),V41))","v":"028"},null,null,null,null,null,{"$f":"$AI$22&AC41&$AJ$21","v":"=+IMPORTARDATOSDINAMICOS(\" BAS016\";TABLAS!$A$281)"},{"$f":"$AI$22&AD41&$AJ$21","v":"=+IMPORTARDATOSDINAMICOS(\" BAS017\";TABLAS!$A$281)"},null,null,null,{"$f":"$AI$22&AH41&$AJ$21","v":"=+IMPORTARDATOSDINAMICOS(\" BAS028\";TABLAS!$A$281)"}]
[null,"Atención en consultorio de enfermería",null,null,{"$f":"+GETPIVOTDATA(\" BAS018\",TABLAS!$A$281)","v":0},{"$f":"+GETPIVOTDATA(\" BAS019\",TABLAS!$A$281)","v":0},{"$f":"SUM(E42+F42)","v":0},null,"Administración de tratamiento para TB resistente",null,{"$f":"+GETPIVOTDATA(\" BAS029\",TABLAS!$A$281)","v":403},null,null,null,null,null,{"$f":"+R41+1","v":18},{"$f":"+Q42+1","v":19},null,null,null,{"$f":"+V41+1","v":29},null,null,null,null,null,null,"018","019",null,null,null,"029",null,null,null,null,null,"=+IMPORTARDATOSDINAMICOS(\" BAS018\";TABLAS!$A$281)","=+IMPORTARDATOSDINAMICOS(\" BAS019\";TABLAS!$A$281)",null,null,null,"=+IMPORTARDATOSDINAMICOS(\" BAS029\";TABLAS!$A$281)"]
[null,"Atención de servicio social",null,"En el establecimiento de salud",{"$f":"+GETPIVOTDATA(\" BAS020\",TABLAS!$A$281)","v":0},{"$f":"+GETPIVOTDATA(\" BAS021\",TABLAS!$A$281)","v":0},{"$f":"SUM(E43+F43)","v":0},null,"Control de tratamiento",null,{"$f":"+GETPIVOTDATA(\" BAS030\",TABLAS!$A$281)","v":113},null,null,null,null,null,{"$f":"+R42+1","v":20},21,null,null,null,{"$f":"+V42+1","v":30},null,null,null,null,null,null,"020","021",null,null,null,"030",null,null,null,null,null,"=+IMPORTARDATOSDINAMICOS(\" BAS020\";TABLAS!$A$281)","=+IMPORTARDATOSDINAMICOS(\" BAS021\";TABLAS!$A$281)",null,null,null,"=+IMPORTARDATOSDINAMICOS(\" BAS030\";TABLAS!$A$281)"]
[null,null,null,"Mediante teleconsulta en línea",{"$f":"+GETPIVOTDATA(\" BAS022\",TABLAS!$A$281)","v":0},{"$f":"+GETPIVOTDATA(\" BAS023\",TABLAS!$A$281)","v":0},{"$f":"SUM(E44+F44)","v":0},null,null,null,null,null,null,null,null,null,22,23,null,null,null,null,null,null,null,null,null,null,"022","023",null,null,null,null,null,null,null,null,null,"=+IMPORTARDATOSDINAMICOS(\" BAS022\";TABLAS!$A$281)","=+IMPORTARDATOSDINAMICOS(\" BAS023\";TABLAS!$A$281)"]
[null,"Atención en nutrición",null,null,{"$f":"+GETPIVOTDATA(\" BAS024\",TABLAS!$A$281)","v":24},{"$f":"+GETPIVOTDATA(\" BAS025\",TABLAS!$A$281)","v":2},{"$f":"SUM(E45+F45)","v":26},null,"RETO ANTE REACCIONES ADVERSAS",null,null,null,null,null,null,null,24,25,null,null,null,null,null,null,null,null,null,null,"024","025",null,null,null,null,null,null,null,null,null,"=+IMPORTARDATOSDINAMICOS(\" BAS024\";TABLAS!$A$281)","=+IMPORTARDATOSDINAMICOS(\" BAS025\";TABLAS!$A$281)"]
[null,"Atención en salud mental",null,"En el establecimiento de salud",null,null,{"$f":"+GETPIVOTDATA(\" BAS026\",TABLAS!$A$281)","v":0},null,"Condición","N°",null,null,null,null,null,null,26,null,null,null,null,null,null,null,null,null,null,null,"026",null,null,null,null,null,null,null,null,null,null,"=+IMPORTARDATOSDINAMICOS(\" BAS026\";TABLAS!$A$281)"]
[null,null,null,"Mediante teleorientación síncrona",null,null,{"$f":"+GETPIVOTDATA(\" BAS027\",TABLAS!$A$281)","v":0},null,"Inicio",{"$f":"+GETPIVOTDATA(\" BAS031\",TABLAS!$A$281)","v":0},null,"REGISTRO EN EL PADRON DE BENEFICIARIOS PANTBC",null,null,null,null,{"$f":"+Q46+1","v":27},null,null,null,null,{"$f":"+V43+1","v":31},null,null,null,null,null,null,"027",null,null,null,null,{"$f":"IF(LEN(V47)=1,CONCATENATE(\"00\",V47),IF(LEN(V47)=2,CONCATENATE(\"0\",V47),V47))","v":"031"},null,null,null,null,null,"=+IMPORTARDATOSDINAMICOS(\" BAS027\";TABLAS!$A$281)",null,null,null,null,{"$f":"$AI$22&AH47&$AJ$21","v":"=+IMPORTARDATOSDINAMICOS(\" BAS031\";TABLAS!$A$281)"}]
[null,null,null,null,null,null,null,null,"Término",{"$f":"+GETPIVOTDATA(\" BAS032\",TABLAS!$A$281)","v":0},null,{"$f":"+GETPIVOTDATA(\" BAS033\",TABLAS!$A$281)","v":30},null,null,null,null,null,null,null,null,null,{"$f":"+V47+1","v":32},null,{"$f":"+V48+1","v":33},null,null,null,null,null,null,null,null,null,"032",null,{"$f":"IF(LEN(X48)=1,CONCATENATE(\"00\",X48),IF(LEN(X48)=2,CONCATENATE(\"0\",X48),X48))","v":"033"},null,null,null,null,null,null,null,null,"=+IMPORTARDATOSDINAMICOS(\" BAS032\";TABLAS!$A$281)",null,{"$f":"$AI$22&AJ48&$AJ$21","v":"=+IMPORTARDATOSDINAMICOS(\" BAS033\";TABLAS!$A$281)"}]
[]
[]
[null,"III. ACTIVIDADES DE PREVENCIÓN EN TUBERCULOSIS"]
[]
[null,"CENSO DE CONTACTOS","N°",null,"PRUEBA PARA DIAGNOSTICO DE TB LATENTE",null,"N°","POSITIVOS",null,"TERAPIA PREVENTIVA PARA TUBERCULOSIS LATENTE",null,"N°"]
[null,"En el establecimiento de salud",{"$f":"+GETPIVOTDATA(\" BAS034\",TABLAS!$A$281)","v":45},null,"PPD","Aplicación",{"$f":"M83","v":159},{"$f":"+GETPIVOTDATA(\" BAS037\",TABLAS!$A$281)","v":7},null,"Administración de terapia preventiva para contactos de TB sensible",null,{"$f":"+GETPIVOTDATA(\" BAS039\",TABLAS!$A$281)","v":505},null,null,null,null,{"$f":"+X48+1","v":34},null,{"$f":"+Q56+1","v":37},null,{"$f":"+S56+1","v":39},null,null,null,null,null,null,null,{"$f":"IF(LEN(Q54)=1,CONCATENATE(\"00\",Q54),IF(LEN(Q54)=2,CONCATENATE(\"0\",Q54),Q54))","v":"034"},null,{"$f":"IF(LEN(S54)=1,CONCATENATE(\"00\",S54),IF(LEN(S54)=2,CONCATENATE(\"0\",S54),S54))","v":"037"},null,{"$f":"IF(LEN(U54)=1,CONCATENATE(\"00\",U54),IF(LEN(U54)=2,CONCATENATE(\"0\",U54),U54))","v":"039"},null,null,null,null,null,null,{"$f":"$AI$22&AC54&$AJ$21","v":"=+IMPORTARDATOSDINAMICOS(\" BAS034\";TABLAS!$A$281)"},null,{"$f":"$AI$22&AE54&$AJ$21","v":"=+IMPORTARDATOSDINAMICOS(\" BAS037\";TABLAS!$A$281)"},null,{"$f":"$AI$22&AG54&$AJ$21","v":"=+IMPORTARDATOSDINAMICOS(\" BAS039\";TABLAS!$A$281)"}]
[null,"En el domicilio*",{"$f":"+GETPIVOTDATA(\" BAS035\",TABLAS!$A$281)","v":49},null,null,"Lectura",{"$f":"M84","v":146},null,null,"Administración de terapia preventiva para contactos de TB resistente",null,{"$f":"+GETPIVOTDATA(\" BAS040\",TABLAS!$A$281)","v":0},null,null,null,null,{"$f":"+Q54+1","v":35},null,null,null,{"$f":"+U54+1","v":40},null,null,null,null,null,null,null,"035",null,null,null,{"$f":"IF(LEN(U55)=1,CONCATENATE(\"00\",U55),IF(LEN(U55)=2,CONCATENATE(\"0\",U55),U55))","v":"040"},null,null,null,null,null,null,"=+IMPORTARDATOSDINAMICOS(\" BAS035\";TABLAS!$A$281)",null,null,null,"=+IMPORTARDATOSDINAMICOS(\" BAS040\";TABLAS!$A$281)"]
[null,"Mediante teleorientación síncrona",{"$f":"+GETPIVOTDATA(\" BAS036\",TABLAS!$A$281)","v":0},null,"IGRA","Aplicación",{"$f":"M85","v":0},{"$f":"+GETPIVOTDATA(\" BAS038\",TABLAS!$A$281)","v":0},null,"Administración de terapia preventiva para población vulnerable para TB",null,{"$f":"M89","v":46},null,null,null,null,{"$f":"+Q55+1","v":36},null,{"$f":"+S54+1","v":38},null,null,null,null,null,null,null,null,null,"036",null,{"$f":"IF(LEN(S56)=1,CONCATENATE(\"00\",S56),IF(LEN(S56)=2,CONCATENATE(\"0\",S56),S56))","v":"038"},null,null,null,null,null,null,null,null,"=+IMPORTARDATOSDINAMICOS(\" BAS036\";TABLAS!$A$281)",null,{"$f":"$AI$22&AE56&$AJ$21","v":"=+IMPORTARDATOSDINAMICOS(\" BAS038\";TABLAS!$A$281)"}]
[null,"Total",{"$f":"SUM(C54+C55+C56)","v":94},null,null,"Lectura",{"$f":"M86","v":0},null,null,"TOTAL",null,{"$f":"SUM(L54+L55+L56)","v":551}]
[null,"*Mediante visita familiar",null,null,"TOTAL",null,null,{"$f":"SUM(H54+H56)","v":7}]
[]
[null,"IV. ACTIVIDADES DE PROMOCIÓN DE LA SALUD EN TUBERCULOSIS"]
[null,"ACTIVIDADES",null,"MODALIDAD","N°","TOTAL"]
[null,"Consejeria para TB","Primera","Mediante visita familiar",{"$f":"+GETPIVOTDATA(\" BAS041\",TABLAS!$A$281)","v":312},{"$f":"SUM(E62+E63+E64+E65)","v":639},null,null,null,null,null,null,null,null,null,null,{"$f":"+U55+1","v":41},null,null,null,null,null,null,null,null,null,null,null,{"$f":"IF(LEN(Q62)=1,CONCATENATE(\"00\",Q62),IF(LEN(Q62)=2,CONCATENATE(\"0\",Q62),Q62))","v":"041"},null,null,null,null,null,null,null,null,null,null,{"$f":"$AI$22&AC62&$AJ$21","v":"=+IMPORTARDATOSDINAMICOS(\" BAS041\";TABLAS!$A$281)"}]
[null,null,null,"Mediante teleorientación síncrona",{"$f":"+GETPIVOTDATA(\" BAS042\",TABLAS!$A$281)","v":0},null,null,null,null,null,null,null,null,null,null,null,{"$f":"+Q62+1","v":42},null,null,null,null,null,null,null,null,null,null,null,"042",null,null,null,null,null,null,null,null,null,null,"=+IMPORTARDATOSDINAMICOS(\" BAS042\";TABLAS!$A$281)"]
[null,null,"Segunda","Mediante visita familiar",{"$f":"+GETPIVOTDATA(\" BAS043\",TABLAS!$A$281)","v":327},null,null,null,null,null,null,null,null,null,null,null,{"$f":"+Q63+1","v":43},null,null,null,null,null,null,null,null,null,null,null,"043",null,null,null,null,null,null,null,null,null,null,"=+IMPORTARDATOSDINAMICOS(\" BAS043\";TABLAS!$A$281)"]
[null,null,null,"Mediante teleorientación síncrona",{"$f":"+GETPIVOTDATA(\" BAS044\",TABLAS!$A$281)","v":0},null,null,null,null,null,null,null,null,null,null,null,44,null,null,null,null,null,null,null,null,null,null,null,"044",null,null,null,null,null,null,null,null,null,null,"=+IMPORTARDATOSDINAMICOS(\" BAS044\";TABLAS!$A$281)"]
[null,"Sesión educativa y demostrativa para TB","Primera",null,{"$f":"+GETPIVOTDATA(\" BAS045\",TABLAS!$A$281)","v":0},{"$f":"SUM(E66+E67)","v":0},null,null,null,null,null,null,null,null,null,null,45,null,null,null,null,null,null,null,null,null,null,null,"045",null,null,null,null,null,null,null,null,null,null,"=+IMPORTARDATOSDINAMICOS(\" BAS045\";TABLAS!$A$281)"]
[null,null,"Segunda",null,{"$f":"+GETPIVOTDATA(\" BAS046\",TABLAS!$A$281)","v":0},null,null,null,null,null,null,null,null,null,null,null,46,null,null,null,null,null,null,null,null,null,null,null,"046",null,null,null,null,null,null,null,null,null,null,"=+IMPORTARDATOSDINAMICOS(\" BAS046\";TABLAS!$A$281)"]
[null,"Visitas familiar",null,null,null,{"$f":"SUM(C55+E62+E64)","v":688}]
[null,"Otras consejerias",null,null,null,{"$f":"+GETPIVOTDATA(\" BAS047\",TABLAS!$A$281)","v":13},null,null,null,null,null,null,null,null,null,null,{"$f":"+Q67+1","v":47},null,null,null,null,null,null,null,null,null,null,null,{"$f":"IF(LEN(Q69)=1,CONCATENATE(\"00\",Q69),IF(LEN(Q69)=2,CONCATENATE(\"0\",Q69),Q69))","v":"047"},null,null,null,null,null,null,null,null,null,null,{"$f":"$AI$22&AC69&$AJ$21","v":"=+IMPORTARDATOSDINAMICOS(\" BAS047\";TABLAS!$A$281)"}]
[]
[]
[null,"V. ACTIVIDADES EN TELESALUD"]
[]
[null,"ACTIVIDADES","N°"]
[null,"Teleconsulta en línea",{"$f":"G44","v":0}]
[null,"Teleorientación síncrona",{"$f":"SUM(G47+C56)","v":0}]
[null,"Total",{"$f":"SUM(C75+C76+#REF!)","v":{"$error":"#REF!"}}]
[]
[null,"REPORTE DE ACTIVIDADES SEGMENTADO POR POBLACION AFECTADA Y VULNERABLE"]
[]
[null,"ACTIVIDADES","POBLACION AFECTADA Y VULNERABLE",null,null,null,null,null,null,null,null,null,"TOTAL"]
[null,null,"POBLACIÓN EN GENERAL","CONTACTOS","PERSONA VIVIENDO CON VIH/SIDA","TRABAJADOR DE SALUD","PERSONA CON DIABETES MELLITUS","PPL","PERSONA CON TERAPIA PROLONGADA CON CORTICOIDES","PERSONA CON HEMODIALISIS Y/O ENFERMEDAD RENAL CRÓNICA","PERSONAL PENITENCIARIO","OTRAS CONDICIONES DE SALUD SEGÚN NORMATIVIDAD VIGENTE"]
[null,"Aplicación de PPD",null,{"$f":"+GETPIVOTDATA(\" BAS048\",TABLAS!$A$281)","v":63},{"$f":"+GETPIVOTDATA(\" BAS049\",TABLAS!$A$281)","v":1},{"$f":"+GETPIVOTDATA(\" BAS050\",TABLAS!$A$281)","v":48},{"$f":"+GETPIVOTDATA(\" BAS051\",TABLAS!$A$281)","v":0},{"$f":"+GETPIVOTDATA(\" BAS052\",TABLAS!$A$281)","v":34},{"$f":"+GETPIVOTDATA(\" BAS053\",TABLAS!$A$281)","v":0},{"$f":"+GETPIVOTDATA(\" BAS054\",TABLAS!$A$281)","v":0},{"$f":"+GETPIVOTDATA(\" BAS055\",TABLAS!$A$281)","v":12},{"$f":"+GETPIVOTDATA(\" BAS056\",TABLAS!$A$281)","v":1},{"$f":"SUM(C83+D83+E83+F83+G83+H83+I83+J83+K83+L83)","v":159},null,null,null,{"$f":"+Q69+1","v":48},{"$f":"+Q83+1","v":49},{"$f":"+R83+1","v":50},51,52,53,54,55,56,null,null,null,{"$f":"IF(LEN(Q83)=1,CONCATENATE(\"00\",Q83),IF(LEN(Q83)=2,CONCATENATE(\"0\",Q83),Q83))","v":"048"},{"$f":"IF(LEN(R83)=1,CONCATENATE(\"00\",R83),IF(LEN(R83)=2,CONCATENATE(\"0\",R83),R83))","v":"049"},{"$f":"IF(LEN(S83)=1,CONCATENATE(\"00\",S83),IF(LEN(S83)=2,CONCATENATE(\"0\",S83),S83))","v":"050"},{"$f":"IF(LEN(T83)=1,CONCATENATE(\"00\",T83),IF(LEN(T83)=2,CONCATENATE(\"0\",T83),T83))","v":"051"},{"$f":"IF(LEN(U83)=1,CONCATENATE(\"00\",U83),IF(LEN(U83)=2,CONCATENATE(\"0\",U83),U83))","v":"052"},{"$f":"IF(LEN(V83)=1,CONCATENATE(\"00\",V83),IF(LEN(V83)=2,CONCATENATE(\"0\",V83),V83))","v":"053"},{"$f":"IF(LEN(W83)=1,CONCATENATE(\"00\",W83),IF(LEN(W83)=2,CONCATENATE(\"0\",W83),W83))","v":"054"},{"$f":"IF(LEN(X83)=1,CONCATENATE(\"00\",X83),IF(LEN(X83)=2,CONCATENATE(\"0\",X83),X83))","v":"055"},{"$f":"IF(LEN(Y83)=1,CONCATENATE(\"00\",Y83),IF(LEN(Y83)=2,CONCATENATE(\"0\",Y83),Y83))","v":"056"},null,null,{"$f":"$AI$22&AC83&$AJ$21","v":"=+IMPORTARDATOSDINAMICOS(\" BAS048\";TABLAS!$A$281)"},{"$f":"$AI$22&AD83&$AJ$21","v":"=+IMPORTARDATOSDINAMICOS(\" BAS049\";TABLAS!$A$281)"},"=+IMPORTARDATOSDINAMICOS(\" BAS050\";TABLAS!$A$281)","=+IMPORTARDATOSDINAMICOS(\" BAS051\";TABLAS!$A$281)","=+IMPORTARDATOSDINAMICOS(\" BAS052\";TABLAS!$A$281)","=+IMPORTARDATOSDINAMICOS(\" BAS053\";TABLAS!$A$281)","=+IMPORTARDATOSDINAMICOS(\" BAS054\";TABLAS!$A$281)","=+IMPORTARDATOSDINAMICOS(\" BAS055\";TABLAS!$A$281)","=+IMPORTARDATOSDINAMICOS(\" BAS056\";TABLAS!$A$281)"]
[null,"Lectura de PPD",null,{"$f":"+GETPIVOTDATA(\" BAS057\",TABLAS!$A$281)","v":52},{"$f":"+GETPIVOTDATA(\" BAS058\",TABLAS!$A$281)","v":0},{"$f":"+GETPIVOTDATA(\" BAS059\",TABLAS!$A$281)","v":48},{"$f":"+GETPIVOTDATA(\" BAS060\",TABLAS!$A$281)","v":0},{"$f":"+GETPIVOTDATA(\" BAS061\",TABLAS!$A$281)","v":29},{"$f":"+GETPIVOTDATA(\" BAS062\",TABLAS!$A$281)","v":0},{"$f":"+GETPIVOTDATA(\" BAS063\",TABLAS!$A$281)","v":0},{"$f":"+GETPIVOTDATA(\" BAS064\",TABLAS!$A$281)","v":17},{"$f":"+GETPIVOTDATA(\" BAS065\",TABLAS!$A$281)","v":0},146,null,null,null,{"$f":"+Y83+1","v":57},{"$f":"+Q84+1","v":58},59,60,61,62,63,64,65,null,null,null,"057","058","059","060","061","062","063","064","065",null,null,{"$f":"$AI$22&AC84&$AJ$21","v":"=+IMPORTARDATOSDINAMICOS(\" BAS057\";TABLAS!$A$281)"},"=+IMPORTARDATOSDINAMICOS(\" BAS058\";TABLAS!$A$281)","=+IMPORTARDATOSDINAMICOS(\" BAS059\";TABLAS!$A$281)","=+IMPORTARDATOSDINAMICOS(\" BAS060\";TABLAS!$A$281)","=+IMPORTARDATOSDINAMICOS(\" BAS061\";TABLAS!$A$281)","=+IMPORTARDATOSDINAMICOS(\" BAS062\";TABLAS!$A$281)","=+IMPORTARDATOSDINAMICOS(\" BAS063\";TABLAS!$A$281)","=+IMPORTARDATOSDINAMICOS(\" BAS064\";TABLAS!$A$281)","=+IMPORTARDATOSDINAMICOS(\" BAS065\";TABLAS!$A$281)"]
[null,"Aplicación de IGRA",null,{"$f":"+GETPIVOTDATA(\" BAS066\",TABLAS!$A$281)","v":0},{"$f":"+GETPIVOTDATA(\" BAS067\",TABLAS!$A$281)","v":0},{"$f":"+GETPIVOTDATA(\" BAS068\",TABLAS!$A$281)","v":0},{"$f":"+GETPIVOTDATA(\" BAS069\",TABLAS!$A$281)","v":0},{"$f":"+GETPIVOTDATA(\" BAS070\",TABLAS!$A$281)","v":0},{"$f":"+GETPIVOTDATA(\" BAS071\",TABLAS!$A$281)","v":0},{"$f":"+GETPIVOTDATA(\" BAS072\",TABLAS!$A$281)","v":0},{"$f":"+GETPIVOTDATA(\" BAS073\",TABLAS!$A$281)","v":0},{"$f":"+GETPIVOTDATA(\" BAS074\",TABLAS!$A$281)","v":0},0,null,null,null,{"$f":"+Y84+1","v":66},{"$f":"+Q85+1","v":67},68,69,70,71,72,73,74,null,null,null,"066","067","068","069","070","071","072","073","074",null,null,"=+IMPORTARDATOSDINAMICOS(\" BAS066\";TABLAS!$A$281)","=+IMPORTARDATOSDINAMICOS(\" BAS067\";TABLAS!$A$281)","=+IMPORTARDATOSDINAMICOS(\" BAS068\";TABLAS!$A$281)","=+IMPORTARDATOSDINAMICOS(\" BAS069\";TABLAS!$A$281)","=+IMPORTARDATOSDINAMICOS(\" BAS070\";TABLAS!$A$281)","=+IMPORTARDATOSDINAMICOS(\" BAS071\";TABLAS!$A$281)","=+IMPORTARDATOSDINAMICOS(\" BAS072\";TABLAS!$A$281)","=+IMPORTARDATOSDINAMICOS(\" BAS073\";TABLAS!$A$281)","=+IMPORTARDATOSDINAMICOS(\" BAS074\";TABLAS!$A$281)"]
[null,"Lectura de IGRA",null,{"$f":"+GETPIVOTDATA(\" BAS075\",TABLAS!$A$281)","v":0},{"$f":"+GETPIVOTDATA(\" BAS076\",TABLAS!$A$281)","v":0},{"$f":"+GETPIVOTDATA(\" BAS077\",TABLAS!$A$281)","v":0},{"$f":"+GETPIVOTDATA(\" BAS078\",TABLAS!$A$281)","v":0},{"$f":"+GETPIVOTDATA(\" BAS079\",TABLAS!$A$281)","v":0},{"$f":"+GETPIVOTDATA(\" BAS080\",TABLAS!$A$281)","v":0},{"$f":"+GETPIVOTDATA(\" BAS081\",TABLAS!$A$281)","v":0},{"$f":"+GETPIVOTDATA(\" BAS082\",TABLAS!$A$281)","v":0},{"$f":"+GETPIVOTDATA(\" BAS083\",TABLAS!$A$281)","v":0},0,null,null,null,75,{"$f":"+Q86+1","v":76},77,78,79,80,81,82,83,null,null,null,"075","076","077","078","079","080","081","082","083",null,null,"=+IMPORTARDATOSDINAMICOS(\" BAS075\";TABLAS!$A$281)","=+IMPORTARDATOSDINAMICOS(\" BAS076\";TABLAS!$A$281)","=+IMPORTARDATOSDINAMICOS(\" BAS077\";TABLAS!$A$281)","=+IMPORTARDATOSDINAMICOS(\" BAS078\";TABLAS!$A$281)","=+IMPORTARDATOSDINAMICOS(\" BAS079\";TABLAS!$A$281)","=+IMPORTARDATOSDINAMICOS(\" BAS080\";TABLAS!$A$281)","=+IMPORTARDATOSDINAMICOS(\" BAS081\";TABLAS!$A$281)","=+IMPORTARDATOSDINAMICOS(\" BAS082\";TABLAS!$A$281)","=+IMPORTARDATOSDINAMICOS(\" BAS083\";TABLAS!$A$281)"]
[null,"Administración de terapia preventiva para contactos de TB sensible",null,{"$f":"+GETPIVOTDATA(\" BAS084\",TABLAS!$A$281)","v":522},null,null,null,null,null,null,null,null,522,null,null,null,84,null,null,null,null,null,null,null,null,null,null,null,"084",null,null,null,null,null,null,null,null,null,null,"=+IMPORTARDATOSDINAMICOS(\" BAS084\";TABLAS!$A$281)"]
[null,"Administración de terapia preventiva para contactos de TB resistente",null,{"$f":"+GETPIVOTDATA(\" BAS085\",TABLAS!$A$281)","v":0},null,null,null,null,null,null,null,null,0,null,null,null,{"$f":"+Q87+1","v":85},null,null,null,null,null,null,null,null,null,null,null,"085",null,null,null,null,null,null,null,null,null,null,"=+IMPORTARDATOSDINAMICOS(\" BAS085\";TABLAS!$A$281)"]
[null,"Administración de terapia preventiva para población vulnerable para TB",null,null,{"$f":"+GETPIVOTDATA(\" BAS086\",TABLAS!$A$281)","v":46},{"$f":"+GETPIVOTDATA(\" BAS087\",TABLAS!$A$281)","v":0},{"$f":"+GETPIVOTDATA(\" BAS088\",TABLAS!$A$281)","v":0},{"$f":"+GETPIVOTDATA(\" BAS089\",TABLAS!$A$281)","v":0},{"$f":"+GETPIVOTDATA(\" BAS090\",TABLAS!$A$281)","v":0},{"$f":"+GETPIVOTDATA(\" BAS091\",TABLAS!$A$281)","v":0},{"$f":"+GETPIVOTDATA(\" BAS092\",TABLAS!$A$281)","v":0},{"$f":"+GETPIVOTDATA(\" BAS093\",TABLAS!$A$281)","v":0},46,null,null,null,null,{"$f":"+Q88+1","v":86},{"$f":"+R89+1","v":87},88,89,90,91,92,93,null,null,null,null,{"$f":"IF(LEN(R89)=1,CONCATENATE(\"00\",R89),IF(LEN(R89)=2,CONCATENATE(\"0\",R89),R89))","v":"086"},"087","088","089","090","091","092","093",null,null,null,{"$f":"$AI$22&AD89&$AJ$21","v":"=+IMPORTARDATOSDINAMICOS(\" BAS086\";TABLAS!$A$281)"},"=+IMPORTARDATOSDINAMICOS(\" BAS087\";TABLAS!$A$281)","=+IMPORTARDATOSDINAMICOS(\" BAS088\";TABLAS!$A$281)","=+IMPORTARDATOSDINAMICOS(\" BAS089\";TABLAS!$A$281)","=+IMPORTARDATOSDINAMICOS(\" BAS090\";TABLAS!$A$281)","=+IMPORTARDATOSDINAMICOS(\" BAS091\";TABLAS!$A$281)","=+IMPORTARDATOSDINAMICOS(\" BAS092\";TABLAS!$A$281)","=+IMPORTARDATOSDINAMICOS(\" BAS093\";TABLAS!$A$281)"]
[null,"Caso probable",{"$f":"+GETPIVOTDATA(\" BAS094\",TABLAS!$A$281)","v":5},{"$f":"+GETPIVOTDATA(\" BAS095\",TABLAS!$A$281)","v":0},{"$f":"+GETPIVOTDATA(\" BAS096\",TABLAS!$A$281)","v":0},{"$f":"+GETPIVOTDATA(\" BAS097\",TABLAS!$A$281)","v":0},{"$f":"+GETPIVOTDATA(\" BAS098\",TABLAS!$A$281)","v":0},{"$f":"+GETPIVOTDATA(\" BAS099\",TABLAS!$A$281)","v":0},{"$f":"+GETPIVOTDATA(\" BAS100\",TABLAS!$A$281)","v":0},{"$f":"+GETPIVOTDATA(\" BAS101\",TABLAS!$A$281)","v":0},{"$f":"+GETPIVOTDATA(\" BAS102\",TABLAS!$A$281)","v":0},{"$f":"+GETPIVOTDATA(\" BAS103\",TABLAS!$A$281)","v":0},5,null,null,null,94,{"$f":"+Q90+1","v":95},96,97,98,99,100,101,102,103,null,null,{"$f":"IF(LEN(Q90)=1,CONCATENATE(\"00\",Q90),IF(LEN(Q90)=2,CONCATENATE(\"0\",Q90),Q90))","v":"094"},"095","096","097","098","099",100,101,102,{"$f":"IF(LEN(Z90)=1,CONCATENATE(\"00\",Z90),IF(LEN(Z90)=2,CONCATENATE(\"0\",Z90),Z90))","v":103},null,{"$f":"$AI$22&AC90&$AJ$21","v":"=+IMPORTARDATOSDINAMICOS(\" BAS094\";TABLAS!$A$281)"},"=+IMPORTARDATOSDINAMICOS(\" BAS095\";TABLAS!$A$281)","=+IMPORTARDATOSDINAMICOS(\" BAS096\";TABLAS!$A$281)","=+IMPORTARDATOSDINAMICOS(\" BAS097\";TABLAS!$A$281)","=+IMPORTARDATOSDINAMICOS(\" BAS098\";TABLAS!$A$281)","=+IMPORTARDATOSDINAMICOS(\" BAS099\";TABLAS!$A$281)","=+IMPORTARDATOSDINAMICOS(\" BAS100\";TABLAS!$A$281)","=+IMPORTARDATOSDINAMICOS(\" BAS101\";TABLAS!$A$281)","=+IMPORTARDATOSDINAMICOS(\" BAS102\";TABLAS!$A$281)",{"$f":"$AI$22&AL90&$AJ$21","v":"=+IMPORTARDATOSDINAMICOS(\" BAS103\";TABLAS!$A$281)"}]
[null,"Sintomático respiratorio identificado",{"$f":"+GETPIVOTDATA(\" BAS104\",TABLAS!$A$281)","v":1312},{"$f":"+GETPIVOTDATA(\" BAS105\",TABLAS!$A$281)","v":23},{"$f":"+GETPIVOTDATA(\" BAS106\",TABLAS!$A$281)","v":7},{"$f":"+GETPIVOTDATA(\" BAS107\",TABLAS!$A$281)","v":9},{"$f":"+GETPIVOTDATA(\" BAS108\",TABLAS!$A$281)","v":1},{"$f":"+GETPIVOTDATA(\" BAS109\",TABLAS!$A$281)","v":39},{"$f":"+GETPIVOTDATA(\" BAS110\",TABLAS!$A$281)","v":0},{"$f":"+GETPIVOTDATA(\" BAS111\",TABLAS!$A$281)","v":0},{"$f":"+GETPIVOTDATA(\" BAS112\",TABLAS!$A$281)","v":0},{"$f":"+GETPIVOTDATA(\" BAS113\",TABLAS!$A$281)","v":0},1391,null,null,null,{"$f":"+Z90+1","v":104},{"$f":"+Q91+1","v":105},106,107,108,109,110,111,112,113,null,null,104,105,106,107,108,109,110,111,112,113,null,"=+IMPORTARDATOSDINAMICOS(\" BAS104\";TABLAS!$A$281)","=+IMPORTARDATOSDINAMICOS(\" BAS105\";TABLAS!$A$281)","=+IMPORTARDATOSDINAMICOS(\" BAS106\";TABLAS!$A$281)","=+IMPORTARDATOSDINAMICOS(\" BAS107\";TABLAS!$A$281)","=+IMPORTARDATOSDINAMICOS(\" BAS108\";TABLAS!$A$281)","=+IMPORTARDATOSDINAMICOS(\" BAS109\";TABLAS!$A$281)","=+IMPORTARDATOSDINAMICOS(\" BAS110\";TABLAS!$A$281)","=+IMPORTARDATOSDINAMICOS(\" BAS111\";TABLAS!$A$281)","=+IMPORTARDATOSDINAMICOS(\" BAS112\";TABLAS!$A$281)","=+IMPORTARDATOSDINAMICOS(\" BAS113\";TABLAS!$A$281)"]
[null,"Sintomático respiratorio examinado",{"$f":"+GETPIVOTDATA(\" BAS114\",TABLAS!$A$281)","v":1054},{"$f":"+GETPIVOTDATA(\" BAS115\",TABLAS!$A$281)","v":17},{"$f":"+GETPIVOTDATA(\" BAS116\",TABLAS!$A$281)","v":3},{"$f":"+GETPIVOTDATA(\" BAS117\",TABLAS!$A$281)","v":10},{"$f":"+GETPIVOTDATA(\" BAS118\",TABLAS!$A$281)","v":1},{"$f":"+GETPIVOTDATA(\" BAS119\",TABLAS!$A$281)","v":230},{"$f":"+GETPIVOTDATA(\" BAS120\",TABLAS!$A$281)","v":0},{"$f":"+GETPIVOTDATA(\" BAS121\",TABLAS!$A$281)","v":0},{"$f":"+GETPIVOTDATA(\" BAS122\",TABLAS!$A$281)","v":0},{"$f":"+GETPIVOTDATA(\" BAS123\",TABLAS!$A$281)","v":0},1315,null,null,null,{"$f":"+Z91+1","v":114},{"$f":"+Q92+1","v":115},116,117,118,119,120,121,122,123,null,null,114,115,116,117,118,119,120,121,122,123,null,"=+IMPORTARDATOSDINAMICOS(\" BAS114\";TABLAS!$A$281)","=+IMPORTARDATOSDINAMICOS(\" BAS115\";TABLAS!$A$281)","=+IMPORTARDATOSDINAMICOS(\" BAS116\";TABLAS!$A$281)","=+IMPORTARDATOSDINAMICOS(\" BAS117\";TABLAS!$A$281)","=+IMPORTARDATOSDINAMICOS(\" BAS118\";TABLAS!$A$281)","=+IMPORTARDATOSDINAMICOS(\" BAS119\";TABLAS!$A$281)","=+IMPORTARDATOSDINAMICOS(\" BAS120\";TABLAS!$A$281)","=+IMPORTARDATOSDINAMICOS(\" BAS121\";TABLAS!$A$281)","=+IMPORTARDATOSDINAMICOS(\" BAS122\";TABLAS!$A$281)","=+IMPORTARDATOSDINAMICOS(\" BAS123\";TABLAS!$A$281)"]
[null,"SR examinados con bacteriología confirmada",{"$f":"+GETPIVOTDATA(\" BAS124\",TABLAS!$A$281)","v":5},{"$f":"+GETPIVOTDATA(\" BAS125\",TABLAS!$A$281)","v":0},{"$f":"+GETPIVOTDATA(\" BAS126\",TABLAS!$A$281)","v":0},{"$f":"+GETPIVOTDATA(\" BAS127\",TABLAS!$A$281)","v":0},{"$f":"+GETPIVOTDATA(\" BAS128\",TABLAS!$A$281)","v":0},{"$f":"+GETPIVOTDATA(\" BAS129\",TABLAS!$A$281)","v":0},{"$f":"+GETPIVOTDATA(\" BAS130\",TABLAS!$A$281)","v":0},{"$f":"+GETPIVOTDATA(\" BAS131\",TABLAS!$A$281)","v":0},{"$f":"+GETPIVOTDATA(\" BAS132\",TABLAS!$A$281)","v":0},{"$f":"+GETPIVOTDATA(\" BAS133\",TABLAS!$A$281)","v":0},5,null,null,null,124,{"$f":"+Q93+1","v":125},126,127,128,129,130,131,132,133,null,null,124,125,126,127,128,129,130,131,132,133,null,"=+IMPORTARDATOSDINAMICOS(\" BAS124\";TABLAS!$A$281)","=+IMPORTARDATOSDINAMICOS(\" BAS125\";TABLAS!$A$281)","=+IMPORTARDATOSDINAMICOS(\" BAS126\";TABLAS!$A$281)","=+IMPORTARDATOSDINAMICOS(\" BAS127\";TABLAS!$A$281)","=+IMPORTARDATOSDINAMICOS(\" BAS128\";TABLAS!$A$281)","=+IMPORTARDATOSDINAMICOS(\" BAS129\";TABLAS!$A$281)","=+IMPORTARDATOSDINAMICOS(\" BAS130\";TABLAS!$A$281)","=+IMPORTARDATOSDINAMICOS(\" BAS131\";TABLAS!$A$281)","=+IMPORTARDATOSDINAMICOS(\" BAS132\";TABLAS!$A$281)","=+IMPORTARDATOSDINAMICOS(\" BAS133\";TABLAS!$A$281)"]