{"text_format":"1","workbook":"xlsx","n_sheets":4,"sheets":["MENU","TABLAS","INFORME","Datos"],"not_rendered":{"charts":0,"images":30,"macros":1,"external_links":0,"defined_names":5,"comments":1,"pivot_tables":2},"unopened":[],"bounds":{"document_bytes":16777216,"sheet_cells":100000,"rows_first":2000,"rows_last":500,"rows_between":2000,"halvings":0,"cell_chars":16384,"cell_head_chars":4096},"cells_cut":0,"cells_raw":0,"read":"whole","date_system":"1900"}

{"sheet":"MENU","index":0,"n_rows":29,"n_cols":12,"rows_kept":29,"cut":false,"hidden":false,"merged":[[28,7,29,10],[26,7,27,10]]}
[]
[]
[]
[null,null,null,null,null,null,null,null,null,null,null,{"$f":"+TABLAS!A81","v":"1-2-3-4-5-6-8-7-11-9-10-Total general"}]
[null,null,null,null,null,null,null,null,null,null,null,{"$f":"+TABLAS!A118","v":"1-2-3-4-5-6-8-7-11-9-10-Total general"}]
[]
[]
[]
[]
[]
[]
[]
[]
[]
[]
[]
[]
[]
[]
[]
[]
[]
[]
[]
[]
[]
[null,null,null,null,null,null,null,"CONTROL DE MESES"]
[]
[null,null,null,null,null,null,null,{"$f":"+TABLAS!A81","v":"1-2-3-4-5-6-8-7-11-9-10-Total general"}]

{"sheet":"TABLAS","index":1,"n_rows":120,"n_cols":232,"rows_kept":120,"cut":false,"hidden":true,"merged":[[12,3,12,6],[13,3,13,6],[80,0,80,1],[117,0,117,1],[7,2,7,6],[8,3,8,6],[9,3,9,6],[10,3,10,6],[11,3,11,6]]}
[]
[]
[]
[]
[]
[]
[]
[null,null,"Valores",null,null,null,null,null,"Tabla",{"$f":"IF(I9=\"(Todas)\",\"CUSCO \",\"\")","v":""}]
[null,null,"RED","03 - LA CONVENCION",null,null,null,null,{"$f":"IF(MID(D9,1,2)=\"99\",\"(All)\",MID(D9,1,2))","v":"03"},{"$f":"IF(I9=\"(All)\",\" \",I9)","v":"03"},null,null,{"$f":"LEN(MID(D9,5,90))","v":14},null,{"$f":"IF(MID(D9,6,5)=\"(All)\",\"\",D9)","v":"03 - LA CONVENCION"}]
[null,null,"Micro RED","0399 - (All)",null,null,null,null,{"$f":"IF(MID(D10,3,2)=\"99\",\"(All)\",MID(D10,1,4))","v":"(All)"}," ",null,null,{"$f":"LEN(MID(D10,7,90))","v":6},null,{"$f":"IF(MID(D10,8,5)=\"(All)\",\"\",D10)","v":""}]
[null,null,"Establecimiento","999999999 - (All)",null,null,null,null,{"$f":"IF(OR(MID(D11,1,9)=\"999999999\",MID(D11,1,9)=\"000000000\"),\"(All)\",MID(D11,1,9))","v":"(All)"}," ",null,null,{"$f":"LEN(MID(D11,12,90))","v":6},null,{"$f":"IF(MID(D11,13,5)=\"(All)\",\"\",D11)","v":""}]
[null,null,"Provincia","00 - (All)",null,null,null,null,{"$f":"IF(MID(D12,1,2)=\"00\",\"(All)\",MID(D12,1,2))","v":"(All)"}," ",null,null,{"$f":"LEN(MID(D12,6,90))","v":5},null,{"$f":"IF(MID(D12,6,5)=\"(All)\",\"\",D12)","v":""}]
[null,null,"Distrito","0000 - (All)",null,null,null,null,{"$f":"IF(OR(MID(D13,1,4)=\"0000\",MID(D13,3,2)=\"00\"),\"(All)\",MID(D13,1,4))","v":"(All)"}," ",null,null,{"$f":"LEN(MID(D13,8,90))","v":5},null,{"$f":"IF(MID(D13,8,5)=\"(All)\",\"\",D13)","v":""}]
[null,null,"Ejecutira","99 - (ALL)",null,null,null,null,{"$f":"IF(MID(D14,1,2)=\"99\",\"(All)\",MID(D14,1,2))","v":"(All)"}," ",null,null,{"$f":"LEN(MID(D14,5,90))","v":6},null,{"$f":"IF(MID(D14,6,5)=\"(All)\",\"\",D14)","v":""}]
[]
[null,null,"Año","2024",null,null,null,null,{"$f":"+D16","v":"2024"},{"$f":"IF(I16=\"(Todas)\",\" \",I16)","v":"2024"}]
[]
[]
[]
[null,1,1,1,1,1,1,1,1,1,1,1,0,{"$f":"SUM(B20:M20)","v":11}]
[null,{"$f":"IF(B20=1,\"ENERO\",\"\")","v":"ENERO"},{"$f":"IF(C20=1,\"FEBRERO\",\"\")","v":"FEBRERO"},{"$f":"IF(D20=1,\"MARZO\",\"\")","v":"MARZO"},{"$f":"IF(E20=1,\"ABRIL\",\"\")","v":"ABRIL"},{"$f":"IF(F20=1,\"MAYO\",\"\")","v":"MAYO"},{"$f":"IF(G20=1,\"JUNIO\",\"\")","v":"JUNIO"},{"$f":"IF(H20=1,\"JULIO\",\"\")","v":"JULIO"},{"$f":"IF(I20=1,\"AGOSTO\",\"\")","v":"AGOSTO"},{"$f":"IF(J20=1,\"SETIEMBRE\",\"\")","v":"SETIEMBRE"},{"$f":"IF(K20=1,\"OCTUBRE\",\"\")","v":"OCTUBRE"},{"$f":"IF(L20=1,\"NOVIEMBRE\",\"\")","v":"NOVIEMBRE"},{"$f":"IF(M20=1,\"DICIEMBRE\",\"\")","v":""},{"$f":"IF(B20=1,B21,IF(C20=1,C21,IF(D20=1,D21,IF(E20=1,E21,IF(F20=1,F21,IF(G20=1,G21,IF(H20=1,H21,IF(I20=1,I21,IF(J20=1,J21,IF(K20=1,K21,IF(L20=1,L21,IF(M20=1,M21,\"\"))))))))))))","v":"ENERO"}]
[null,null,null,null,null,null,null,null,null,null,null,null,null,{"$f":"IF(N20=1,N21,\"\")","v":""}]
[null,2,4,6,8,10,12,14,16,18,20,22,null,{"$f":"MIN(B23:M23)","v":2},{"$f":"MAX(B23:M23)","v":22},{"$f":"MAX(C23:N23)","v":22}]
[null,{"$f":"IF(B23=2,\"ENE\",\"\")","v":"ENE"},{"$f":"IF(C23=4,\"FEB\",\"\")","v":"FEB"},{"$f":"IF(D23=6,\"MAR\",\"\")","v":"MAR"},{"$f":"IF(E23=8,\"ABR\",\"\")","v":"ABR"},{"$f":"IF(F23=10,\"MAY\",\"\")","v":"MAY"},{"$f":"IF(G23=12,\"JUN\",\"\")","v":"JUN"},{"$f":"IF(H23=14,\"JUL\",\"\")","v":"JUL"},{"$f":"IF(I23=16,\"AGO\",\"\")","v":"AGO"},{"$f":"IF(J23=18,\"SET\",\"\")","v":"SET"},{"$f":"IF(K23=20,\"OCT\",\"\")","v":"OCT"},{"$f":"IF(L23=22,\"NOV\",\"\")","v":"NOV"},{"$f":"IF(M23=24,\"DIC\",\"\")","v":""},{"$f":"IF(N23=B23,B24,IF(N23=C23,C24,IF(N23=D23,D24,IF(N23=E23,E24,IF(N23=F23,F24,IF(N23=G23,G24,IF(N23=H23,#REF!,IF(N23=I23,I24,IF(N23=J23,J24,IF(N23=K23,K24,IF(N23=L23,L24,IF(N23=M23,M24,\"\"))))))))))))","v":"ENE"},{"$f":"IF(O23=C23,C24,IF(O23=D23,D24,IF(O23=E23,E24,IF(O23=F23,F24,IF(O23=G23,G24,IF(O23=H23,H24,IF(O23=I23,I24,IF(O23=J23,J24,IF(O23=K23,K24,IF(O23=L23,L24,IF(O23=M23,M24,\"\")))))))))))","v":"NOV"},{"$f":"IF(P23=D23,D24,IF(P23=E23,E24,IF(P23=F23,F24,IF(P23=G23,G24,IF(P23=H23,H24,IF(P23=I23,I24,IF(P23=J23,J24,IF(P23=K23,K24,IF(P23=L23,L24,IF(P23=M23,M24,IF(P23=N23,N24,\"\")))))))))))","v":"NOV"}]
[null,null,null,null,null,null,null,null,null,null,null,null,null,{"$f":"CONCATENATE(N24,\" - \",O24)","v":"ENE - NOV"}]
[null,null,null,null,null,null,null,null,null,null,null,null,null,{"$f":"IF(N23=O23,N22,N25)","v":"ENE - NOV"}]
[]
[]
[]
[]
[]
[]
[]
[]
[]
[]
[]
[]
[]
[]
[]
[]
[]
[]
[]
[]
[]
[]
[]
["ADULTO_MAYOR_01"]
["anno",2024]
["cod_red","03"]
["codmic","(Todas)"]
["cod_prov","(Todas)"]
["coddist","(Todas)"]
["cod_estab","(Todas)"]
["cod_eje","(Todas)"]
[]
[null,"Valores"]
["Etiquetas de fila"," BAS001"," BAS002"," BAS003"," BAS004"," BAS005"," BAS006"," BAS007"," BAS008"," BAS009"," BAS010"," BAS011"," BAS012"," BAS013"," BAS014"," BAS015"," BAS016"," BAS017"," BAS018"," BAS019"," BAS020"," BAS021"," BAS022"," BAS023"," BAS024"," BAS025"," BAS026"," BAS027"," BAS028"," BAS029"," BAS030"," BAS031"," BAS032"," BAS033"," BAS034"," BAS035"," BAS036"," BAS037"," BAS038"," BAS039"," BAS040"," BAS041"," BAS042"," BAS043"," BAS044"," BAS045"," BAS046"," BAS047"," BAS048"," BAS049"," BAS050"," BAS051"," BAS052"," BAS053"," BAS054"," BAS055"," BAS056"," BAS057"," BAS058"," BAS059"," BAS060"," BAS061"," BAS062"," BAS063"," BAS064"," BAS065"," BAS066"," BAS067"," BAS068"," BAS069"," BAS070"," BAS071"," BAS072"," BAS073"," BAS074"," BAS075"," BAS076"," BAS077"," BAS078"," BAS079"," BAS080"," BAS081"," BAS082"," BAS083"," BAS084"," BAS085"," BAS086"," BAS087"," BAS088"," BAS089"," BAS090"," BAS091"," BAS092"," BAS093"," BAS094"," BAS095"," BAS096"," BAS097"," BAS098"," BAS099"," BAS100"," BAS101"," BAS102"," BAS103"," BAS104"," BAS105"," BAS106"," BAS107"," BAS108"," BAS109"," BAS110"," BAS111"," BAS112"," BAS113"," BAS114"," BAS115"," BAS116"," BAS117"," BAS118"," BAS119"," BAS120"," BAS121"," BAS122"," BAS123"," BAS124"," BAS125"," BAS126"," BAS127"," BAS128"," BAS129"," BAS130"," BAS131"," BAS132"," BAS133"," BAS134"," BAS135"," BAS136"," BAS137"," BAS138"," BAS139"," BAS140"," BAS141"," BAS142"," BAS143"," BAS144"," BAS145"," BAS146"," BAS147"," BAS148"," BAS149"," BAS150"," BAS151"," BAS152"," BAS153"," BAS154"," BAS155"," BAS156"," BAS157"," BAS158"," BAS159"," BAS160"," BAS161"," BAS162"," BAS163"," BAS164"," BAS165"," BAS166"," BAS167"," BAS168"," BAS169"," BAS170"," BAS171"," BAS172"," BAS173"," BAS174"," BAS175"," BAS176"," BAS177"," BAS178"," BAS179"," BAS180"," BAS181"," BAS182"," BAS183"," BAS184"," BAS185"," BAS186"," BAS187"," BAS188"," BAS189"," BAS190"," BAS191"," BAS192"," BAS193"," BAS194"," BAS195"," BAS196"," BAS197"," BAS198"," BAS199"," BAS200"," BAS201"," BAS202"," BAS203"," BAS204"," BAS205"," BAS206"," BAS207"," BAS208"," BAS209"," BAS210"," BAS211"," BAS212"," BAS213"," BAS214"," BAS215"," BAS216"," BAS217"," BAS218"," BAS219"," BAS220"," BAS221"," BAS222"," BAS223"," BAS224"," BAS225"," BAS226"," BAS227"," BAS228"," BAS229"," BAS230"]
[1,1,3,1,0,0,1,0,0,0,0,0,0,0,0,0,0,0,0,0,0,0,0,0,0,3,6,2,1,0,1,0,0,0,0,0,0,0,0,0,0,0,0,0,0,0,0,0,0,0,0,0,0,0,0,5,11,3,6,0,1,0,0,0,0,0,0,0,0,0,0,0,0,0,0,0,0,0,0,0,0,0,0,0,0,0,0,0,0,0,0,0,0,0,0,0,0,0,0,0,0,0,0,0,0,0,0,0,0,2,1,2,2,1,1,15,13,3,8,2,2,1,4,5,4,0,0,2,8,2,4,0,0,7,4,9,9,4,2,6,3,1,6,0,0,5,11,3,6,0,1,0,0,0,0,0,0,0,0,0,0,0,0,0,0,0,0,0,0,14,20,11,20,3,2,1,2,2,6,0,0,1,1,0,1,1,0,0,1,0,0,0,0,2,2,0,0,0,0,1,0,0,0,0,0,0,0,0,0,0,0,6,12,8,15,1,1,0,0,0,0,0,0,0,0,0,0,0,0,0,0]
[2,1,1,1,1,0,0,0,0,0,0,0,0,1,0,0,1,0,1,0,0,0,0,0,0,5,1,2,2,1,1,1,1,0,0,0,0,0,0,0,0,0,0,0,1,0,0,1,0,0,0,0,0,0,0,1,12,1,4,1,1,0,0,0,0,0,0,0,0,0,0,0,0,0,0,0,0,0,0,0,0,0,0,0,0,0,0,0,0,0,0,0,0,0,0,0,0,0,0,0,0,0,0,0,0,0,0,0,0,2,3,2,6,0,2,7,8,3,3,0,3,3,5,1,2,3,0,1,8,0,2,1,0,7,9,4,4,4,1,5,4,0,0,2,0,1,12,1,4,1,1,1,0,0,1,0,0,0,0,0,0,0,0,0,0,0,0,0,0,9,16,3,5,4,3,0,3,1,0,1,0,0,1,0,1,0,0,0,1,0,0,0,0,1,1,1,0,0,0,2,1,0,1,0,1,0,0,1,0,0,0,1,15,3,5,4,1,0,0,0,0,0,0,0,0,0,0,0,0,0,0]
[3,1,4,1,0,0,0,0,0,0,0,0,0,1,1,0,1,0,1,0,0,0,0,0,0,4,15,10,4,1,2,1,0,0,1,0,0,0,0,0,0,0,0,1,0,0,0,0,0,0,0,0,0,0,0,3,13,1,3,0,3,0,0,0,0,0,0,0,0,0,0,0,0,0,0,0,0,0,0,0,0,0,0,0,0,0,0,0,0,0,0,0,0,0,0,0,0,0,0,0,0,0,0,0,0,0,0,0,0,3,4,4,1,4,0,8,7,6,4,3,5,1,9,1,3,0,2,0,5,0,1,0,2,5,8,6,4,7,2,3,3,2,2,3,2,3,13,1,3,0,3,0,0,0,0,0,0,0,0,0,0,0,0,0,0,0,0,0,0,9,16,9,10,7,7,1,6,1,1,2,1,0,0,0,0,0,0,0,0,0,0,0,0,0,0,0,0,0,0,1,0,3,2,1,0,0,0,0,0,0,0,3,12,1,5,3,3,0,0,0,0,0,0,0,0,0,0,0,0,0,0]
[4,3,2,1,0,0,0,0,0,0,0,0,0,1,0,0,0,0,1,0,0,0,0,0,0,7,6,12,11,4,12,0,0,0,0,0,1,0,0,0,0,0,0,0,0,0,0,0,0,0,0,0,0,0,0,2,14,4,5,1,6,0,0,0,0,0,0,0,0,0,0,0,0,0,0,0,0,0,0,0,0,0,0,0,0,0,0,0,0,0,0,0,0,0,0,0,0,0,0,0,0,0,0,0,0,0,0,0,0,7,0,5,8,6,9,10,14,6,6,5,3,0,7,4,2,0,1,3,8,1,5,1,3,4,6,9,6,4,4,3,4,3,3,3,5,2,14,4,5,1,6,0,0,0,0,0,0,0,0,0,0,0,0,0,0,0,0,0,0,12,26,6,10,7,5,2,1,1,2,1,1,0,2,0,0,0,0,0,0,0,0,0,1,0,0,1,1,0,0,0,0,0,0,1,2,0,0,0,0,0,0,6,11,2,5,2,2,0,0,0,0,0,0,0,0,0,0,0,0,0,0]
[5,1,2,0,0,0,0,0,0,0,0,0,1,1,2,0,0,0,0,0,0,0,0,0,0,2,10,2,6,2,3,0,1,0,1,0,0,0,0,0,0,0,0,0,0,0,0,0,0,0,0,0,0,0,0,5,7,2,8,0,3,0,0,0,0,0,0,0,0,0,0,0,0,0,0,0,0,0,0,0,0,0,0,0,0,0,0,0,0,0,0,0,0,0,0,0,0,0,0,0,0,0,0,0,0,0,0,0,0,3,1,7,4,5,1,9,11,6,4,2,0,3,5,1,1,0,1,3,3,0,2,0,1,4,2,6,4,2,2,5,5,2,3,1,0,5,7,2,8,0,3,0,0,0,0,0,0,0,0,0,0,0,0,0,0,0,0,0,0,13,20,12,12,6,4,2,0,1,4,1,1,1,0,0,1,1,0,0,0,0,0,0,0,0,0,0,0,0,1,0,0,1,1,0,0,0,0,0,0,0,0,4,11,4,8,3,1,0,0,0,0,0,0,0,0,0,0,0,0,0,0]
[6,2,2,1,0,0,0,0,1,0,0,0,0,0,1,1,0,0,0,0,0,0,0,0,0,9,8,9,4,4,2,1,0,0,0,0,0,0,0,0,0,0,0,0,0,0,0,0,0,0,0,0,0,0,0,3,8,2,4,1,0,0,0,0,0,0,0,0,0,0,0,0,0,0,0,0,0,0,0,0,0,0,0,0,0,0,0,0,0,0,0,0,0,0,0,0,0,0,0,0,0,0,0,0,0,0,0,0,0,5,7,5,5,0,5,10,5,5,4,1,3,1,1,0,1,1,1,0,3,1,2,0,0,6,1,0,4,1,4,5,1,4,5,1,1,3,8,2,4,1,0,0,0,0,0,0,0,0,0,0,0,0,0,0,0,0,0,0,0,13,16,8,11,2,5,2,2,2,2,0,0,0,0,0,0,1,0,1,0,0,0,0,0,1,1,1,1,0,1,0,0,0,0,0,1,0,0,0,0,0,0,10,10,8,9,2,3,0,0,0,0,0,0,0,0,0,0,0,0,0,0]
[8,3,3,2,1,1,1,0,0,0,0,0,0,0,2,1,2,1,0,0,0,0,0,0,0,12,11,8,11,13,5,0,1,0,0,0,0,0,0,0,0,0,0,0,0,0,0,0,0,0,0,0,0,0,0,0,7,3,6,1,1,0,0,0,0,0,0,0,0,0,0,0,0,0,0,0,0,0,0,0,0,0,0,0,0,0,0,0,0,0,0,0,0,0,0,0,0,0,0,0,0,0,0,0,0,0,0,0,0,3,2,7,1,0,4,19,5,11,8,8,5,3,6,3,4,2,1,1,3,1,5,3,2,3,3,4,0,3,3,4,2,1,0,2,0,0,7,3,6,1,1,0,0,0,0,0,0,0,0,0,0,0,0,0,0,0,0,0,0,16,13,13,13,7,11,0,4,0,1,2,3,0,0,0,0,2,0,0,2,1,0,1,0,0,1,0,0,1,1,0,1,0,0,2,2,0,0,0,0,0,0,7,13,6,12,3,6,0,0,0,0,0,0,0,0,0,0,0,0,0,0]
[7,1,1,0,0,0,0,0,0,0,0,0,0,0,1,0,1,0,0,0,0,0,0,0,0,18,19,13,15,12,8,9,7,9,3,3,2,0,0,0,0,0,0,0,0,0,0,0,0,0,0,0,0,0,0,1,6,2,10,1,3,0,0,0,0,0,0,0,0,0,0,0,0,0,0,0,0,0,0,0,0,0,0,0,0,0,0,0,0,0,0,0,0,0,0,0,0,0,0,0,0,0,0,0,0,0,0,0,0,3,2,1,4,1,3,10,8,3,8,5,3,2,7,3,5,0,0,0,2,0,7,1,3,7,4,2,4,4,2,4,0,0,3,0,0,1,6,2,10,1,3,0,0,0,0,0,0,0,0,0,0,0,0,0,0,0,0,0,0,13,15,4,17,6,7,1,1,2,2,1,2,0,0,1,0,0,0,1,2,0,0,0,0,1,0,1,2,0,2,1,1,0,1,0,2,0,0,0,0,0,0,8,6,3,7,2,3,0,0,0,0,0,0,0,0,0,0,0,0,0,0]
[11,1,1,1,0,0,1,0,0,0,0,0,0,0,0,0,0,0,0,0,0,0,0,0,0,8,9,5,5,1,5,0,0,1,0,0,0,0,0,0,0,0,0,0,0,0,0,0,0,0,0,0,0,0,0,4,6,0,6,0,0,0,0,0,0,0,0,0,0,0,0,0,0,0,0,0,0,0,0,0,0,0,0,0,0,0,0,0,0,0,0,0,0,0,0,0,0,0,0,0,0,0,0,0,0,0,0,0,0,2,0,1,1,1,0,9,7,6,5,4,3,3,1,0,4,0,0,2,3,0,2,0,0,2,0,3,1,1,0,2,0,2,0,0,0,4,6,0,6,0,0,0,0,0,0,0,0,0,0,0,0,0,0,0,0,0,0,0,0,12,6,4,9,3,0,0,1,1,0,0,0,0,1,1,0,0,0,0,0,0,0,0,0,1,0,0,0,0,0,0,0,0,0,0,0,0,0,0,0,0,0,10,5,2,6,1,0,0,0,0,0,0,0,0,0,0,0,0,0,0,0]
[9,0,3,0,0,0,0,0,0,0,0,0,0,2,2,2,3,0,1,0,0,0,0,0,0,5,12,6,6,6,5,2,1,0,0,1,0,0,0,0,0,0,0,0,0,0,0,0,0,0,0,0,0,0,0,4,4,1,2,0,1,0,0,0,0,0,0,0,0,0,0,0,0,0,0,0,0,0,0,0,0,0,0,0,0,0,0,0,0,0,0,0,0,0,0,0,0,0,0,0,0,0,0,0,0,0,0,0,0,1,3,3,1,1,3,9,7,9,7,3,5,4,0,1,2,0,0,4,3,0,1,0,0,6,2,6,0,2,0,0,1,1,1,0,0,4,4,1,2,0,1,0,0,0,0,0,0,0,0,0,0,0,0,0,0,0,0,0,0,16,10,7,8,1,4,2,4,3,0,0,1,0,0,0,1,1,0,0,0,1,0,1,0,0,0,0,0,0,0,0,0,0,0,0,0,0,0,0,0,0,0,10,7,5,5,2,2,0,0,0,0,0,0,0,0,0,0,0,0,0,0]
[10,2,1,0,0,0,0,0,0,0,0,0,0,1,0,0,1,1,0,0,0,0,0,0,0,9,8,8,8,7,5,0,0,1,0,0,0,0,0,0,0,0,0,0,0,0,0,0,0,0,0,0,0,0,0,8,4,2,9,1,4,0,0,0,0,0,0,0,0,0,0,0,0,0,0,0,0,0,0,0,0,0,0,0,0,0,0,0,0,0,0,0,0,0,0,0,0,0,0,0,0,0,0,0,0,0,0,0,0,4,1,2,2,4,5,12,3,7,9,2,2,3,4,2,4,2,1,6,2,1,3,2,3,0,1,4,3,2,2,2,1,2,1,1,1,8,4,2,9,1,4,0,0,0,0,0,0,0,0,0,0,0,0,0,0,0,0,0,0,18,9,8,16,7,10,0,1,1,2,1,1,0,1,1,1,1,0,0,0,0,0,1,0,1,0,0,0,0,0,0,0,2,2,2,3,0,0,0,0,0,0,11,5,2,9,6,5,0,0,0,0,0,0,0,0,0,0,0,0,0,0]
["Total general",16,23,8,2,1,3,0,1,0,0,0,1,7,9,4,9,2,4,0,0,0,0,0,0,82,105,77,73,51,49,14,11,11,5,4,3,0,0,0,0,0,0,1,1,0,0,1,0,0,0,0,0,0,0,36,92,21,63,6,23,0,0,0,0,0,0,0,0,0,0,0,0,0,0,0,0,0,0,0,0,0,0,0,0,0,0,0,0,0,0,0,0,0,0,0,0,0,0,0,0,0,0,0,0,0,0,0,0,35,24,39,35,23,33,118,88,65,66,35,34,24,49,21,32,8,7,22,48,6,34,8,14,51,40,53,39,34,22,39,24,18,24,13,9,36,92,21,63,6,23,1,0,0,1,0,0,0,0,0,0,0,0,0,0,0,0,0,0,145,167,85,131,53,58,11,25,15,20,9,10,2,6,3,5,7,0,2,6,2,0,3,1,7,5,4,4,1,5,5,3,6,7,6,11,0,0,1,0,0,0,76,107,44,86,29,27,0,0,0,0,0,0,0,0,0,0,0,0,0,0]
[]
[]
[]
[]
[]
[]
["TOTAL"]
[{"$f":"COUNT(A61:A77)","v":11},{"$f":"SUM(B61:B77)","v":32},{"$f":"SUM(C61:C77)","v":46},16,4,2,6,0,2,0,0,0,2,14,18,8,18,4,8,0,0,0,0,0,0,164,210,154,146,102,98,28,22,22,10,8,6,0,0,0,0,0,0,2,2,0,0,2,0,0,0,0,0,0,0,72,184,42,126,12,46,0,0,0,0,0,{"$f":"SUM(BO61:BO77)","v":0},0,0,0,0,0,0,0,0,0,0,0,0,0,0,0,0,0,0,0,0,0,0,0,0,0,0,0,0,0,0,0,0,0,0,0,0,0,0,0,0,0,0,70,48,78,70,46,66,236,176,130,132,70,68,48,98,42,64,16,14,44,96,12,{"$f":"SUM(EA61:EA77)","v":68},16,28,102,80,106,78,68,44,78,48,36,48,26,18,72,184,42,126,12,46,2,0,0,2,0,0,0,0,0,0,0,0,0,0,0,0,0,0,290,334,170,262,106,116,22,50,30,40,18,20,4,12,6,10,14,0,4,12,4,0,6,2,14,{"$f":"SUM(GM61:GM77)","v":10},8,8,2,10,10,6,12,14,12,22,0,0,2,0,0,0,152,214,88,172,58,54,0,0,0,0,0,0,0,0,0,0,0,0,0,0,0]
[{"$f":"CONCATENATE(A61,\"-\",A62,\"-\",A63,\"-\",A64,\"-\",A65,\"-\",A66,\"-\",A67,\"-\",A68,\"-\",A69,\"-\",A70,\"-\",A71,\"-\",A72)","v":"1-2-3-4-5-6-8-7-11-9-10-Total general"}]
[null," BAS001"," BAS002"," BAS003"," BAS004"," BAS005"," BAS006"," BAS007"," BAS008"," BAS009"," BAS010"," BAS011"," BAS012"," BAS013"," BAS014"," BAS015"," BAS016"," BAS017"," BAS018"," BAS019"," BAS020"," BAS021"," BAS022"," BAS023"," BAS024"," BAS025"," BAS026"," BAS027"," BAS028"," BAS029"," BAS030"," BAS031"," BAS032"," BAS033"," BAS034"," BAS035"," BAS036"," BAS037"," BAS038"," BAS039"," BAS040"," BAS041"," BAS042"," BAS043"," BAS044"," BAS045"," BAS046"," BAS047"," BAS048"," BAS049"," BAS050"," BAS051"," BAS052"," BAS053"," BAS054"," BAS055"," BAS056"," BAS057"," BAS058"," BAS059"," BAS060"," BAS061"," BAS062"," BAS063"," BAS064"," BAS065"," BAS066"," BAS067"," BAS068"," BAS069"," BAS070"," BAS071"," BAS072"," BAS073"," BAS074"," BAS075"," BAS076"," BAS077"," BAS078"," BAS079"," BAS080"," BAS081"," BAS082"," BAS083"," BAS084"," BAS085"," BAS086"," BAS087"," BAS088"," BAS089"," BAS090"," BAS091"," BAS092"," BAS093"," BAS094"," BAS095"," BAS096"," BAS097"," BAS098"," BAS099"," BAS100"," BAS101"," BAS102"," BAS103"," BAS104"," BAS105"," BAS106"," BAS107"," BAS108"," BAS109"," BAS110"," BAS111"," BAS112"," BAS113"," BAS114"," BAS115"," BAS116"," BAS117"," BAS118"," BAS119"," BAS120"," BAS121"," BAS122"," BAS123"," BAS124"," BAS125"," BAS126"," BAS127"," BAS128"," BAS129"," BAS130"," BAS131"," BAS132"," BAS133"," BAS134"," BAS135"," BAS136"," BAS137"," BAS138"," BAS139"," BAS140"," BAS141"," BAS142"," BAS143"," BAS144"," BAS145"," BAS146"," BAS147"," BAS148"," BAS149"," BAS150"," BAS151"," BAS152"," BAS153"," BAS154"," BAS155"," BAS156"," BAS157"," BAS158"," BAS159"," BAS160"," BAS161"," BAS162"," BAS163"," BAS164"," BAS165"," BAS166"," BAS167"," BAS168"," BAS169"," BAS170"," BAS171"," BAS172"," BAS173"," BAS174"," BAS175"," BAS176"," BAS177"," BAS178"," BAS179"," BAS180"," BAS181"," BAS182"," BAS183"," BAS184"," BAS185"," BAS186"," BAS187"," BAS188"," BAS189"," BAS190"," BAS191"," BAS192"," BAS193"," BAS194"," BAS195"," BAS196"," BAS197"," BAS198"," BAS199"," BAS200"," BAS201"," BAS202"," BAS203"," BAS204"," BAS205"," BAS206"," BAS207"," BAS208"," BAS209"," BAS210"," BAS211"," BAS212"," BAS213"," BAS214"," BAS215"," BAS216"," BAS217"," BAS218"," BAS219"," BAS220"," BAS221"," BAS222"," BAS223"," BAS224"," BAS225"," BAS226"," BAS227"," BAS228"," BAS229"," BAS230"]
[null,{"$f":"IF(B82=B60,\"SI\",\"NO\")","v":"SI"},{"$f":"IF(C82=C60,\"SI\",\"NO\")","v":"SI"},"SI","SI","SI","SI","SI","SI","SI","SI","SI","SI","SI","SI","SI","SI","SI","SI","SI","SI","SI","SI","SI","SI","SI","SI","SI","SI","SI","SI","SI","SI","SI","SI","SI","SI","SI","SI","SI","SI","SI","SI","SI","SI","SI","SI","SI","SI","SI","SI","SI","SI","SI","SI","SI","SI","SI","SI","SI","SI","SI","SI","SI","SI","SI",{"$f":"IF(BO82=BO60,\"SI\",\"NO\")","v":"SI"},"SI","SI","SI","SI","SI","SI","SI","SI","SI","SI","SI","SI","SI","SI","SI","SI","SI","SI","SI","SI","SI","SI","SI","SI","SI","SI","SI","SI","SI","SI","SI","SI","SI","SI","SI","SI","SI","SI","SI","SI","SI","SI","SI","SI","SI","SI","SI","SI","SI","SI","SI","SI","SI","SI","SI","SI","SI","SI","SI","SI","SI","SI","SI",{"$f":"IF(EA82=EA60,\"SI\",\"NO\")","v":"SI"},"SI","SI","SI","SI","SI","SI","SI","SI","SI","SI","SI","SI","SI","SI","SI","SI","SI","SI","SI","SI","SI","SI","SI","SI","SI","SI","SI","SI","SI","SI","SI","SI","SI","SI","SI","SI","SI","SI","SI","SI","SI","SI","SI","SI","SI","SI","SI","SI","SI","SI","SI","SI","SI","SI","SI","SI","SI","SI","SI","SI","SI","SI","SI",{"$f":"IF(GM82=GM60,\"SI\",\"NO\")","v":"SI"},"SI","SI","SI","SI","SI","SI","SI","SI","SI","SI","SI","SI","SI","SI","SI","SI","SI","SI","SI","SI","SI","SI","SI","SI","SI","SI","SI","SI","SI","SI","SI","SI","SI","SI","SI","SI"]
[]
[]
[]
[]
["ADULTO_MAYOR_02"]
["anno",2024]
["cod_red","03"]
["codmic","(Todas)"]
["cod_prov","(Todas)"]
["coddist","(Todas)"]
["cod_estab","(Todas)"]
["cod_eje","(Todas)"]
[]
[null,"Valores"]
["Etiquetas de fila"," BAS001"," BAS002"," BAS003"," BAS004"," BAS005"," BAS006"," BAS007"," BAS008"," BAS009"," BAS010"," BAS011"," BAS012"," BAS013"," BAS014"," BAS015"," BAS016"," BAS017"," BAS018"," BAS019"," BAS020"," BAS021"," BAS022"," BAS023"," BAS024"," BAS025"," BAS026"," BAS027"," BAS028"," BAS029"," BAS030"," BAS031"," BAS032"," BAS033"," BAS034"," BAS035"," BAS036"," BAS037"," BAS038"," BAS039"," BAS040"," BAS041"," BAS042"," BAS043"," BAS044"," BAS045"," BAS046"," BAS047"," BAS048"," BAS049"," BAS050"," BAS051"," BAS052"," BAS053"," BAS054"," BAS055"," BAS056"," BAS057"," BAS058"," BAS059"," BAS060"," BAS061"," BAS062"," BAS063"," BAS064"," BAS065"," BAS066"," BAS067"," BAS068"," BAS069"," BAS070"," BAS071"," BAS072"," BAS073"," BAS074"," BAS075"," BAS076"," BAS077"," BAS078"," BAS079"," BAS080"," BAS081"," BAS082"," BAS083"," BAS084"," BAS085"," BAS086"," BAS087"," BAS088"," BAS089"," BAS090"," BAS091"," BAS092"," BAS093"," BAS094"," BAS095"," BAS096"," BAS097"," BAS098"," BAS099"," BAS100"," BAS101"," BAS102"," BAS103"," BAS104"," BAS105"," BAS106"," BAS107"," BAS108"," BAS109"," BAS110"," BAS111"," BAS112"," BAS113"," BAS114"," BAS115"," BAS116"," BAS117"," BAS118"," BAS119"," BAS120"," BAS121"," BAS122"," BAS123"," BAS124"," BAS125"," BAS126"," BAS127"," BAS128"," BAS129"," BAS130"," BAS131"," BAS132"," BAS133"," BAS134"," BAS135"," BAS136"," BAS137"," BAS138"," BAS139"," BAS140"," BAS141"," BAS142"," BAS143"," BAS144"," BAS145"," BAS146"," BAS147"," BAS148"," BAS149"," BAS150"," BAS151"," BAS152"," BAS153"," BAS154"," BAS155"," BAS156"," BAS157"," BAS158"," BAS159"," BAS160"," BAS161"," BAS162"," BAS163"," BAS164"," BAS165"," BAS166"," BAS167"," BAS168"," BAS169"," BAS170"," BAS171"," BAS172"," BAS173"," BAS174"," BAS175"," BAS176"," BAS177"," BAS178"," BAS179"," BAS180"," BAS181"," BAS182"," BAS183"," BAS184"," BAS185"," BAS186"," BAS187"," BAS188"," BAS189"," BAS190"," BAS191"," BAS192"," BAS193"," BAS194"," BAS195"," BAS196"," BAS197"," BAS198"," BAS199"," BAS200"," BAS201"," BAS202"," BAS203"," BAS204"," BAS205"," BAS206"," BAS207"," BAS208"," BAS209"," BAS210"," BAS211"," BAS212"," BAS213"," BAS214"," BAS215"," BAS216"," BAS217"," BAS218"," BAS219"," BAS220"," BAS221"," BAS222"," BAS223"," BAS224"," BAS225"," BAS226"," BAS227"," BAS228"," BAS229"," BAS230"]
[1,1,4,3,1,0,0,33,62,30,37,12,19,1,1,1,0,1,0,0,0,0,0,0,0,0,0,0,0,0,0,1,0,0,0,0,0,0,0,0,0,0,0,0,0,0,0,0,0,0,0,0,1,0,0,0,0,0,0,0,0,0,0,0,0,0,0,0,0,0,0,0,0,0,0,0,0,0,0,0,0,0,0,0,0,0,0,0,0,0,0,42,47,26,29,6,10,2,8,5,5,0,2,0,0,0,0,0,0,0,0,0,0,0,0,0,0,0,0,0,0,0,0,0,0,0,0,0,0,0,0,0,0,0,0,0,0,0,0,0,0,0,0,0,0,0,0,0,0,0,0,0,0,0,0,0,0,0,0,0,0,0,0,0,0,0,0,0,0,0,0,0,0,0,0,0,0,0,0,0,0,0,0,0,0,0,0,0,0,0,0,0,0,0,0,0,0,0,0,0,0,0,0,0,0,0,0,0,0,0,0,0,0,0,0,0,0,0,0,0,0,0,0,0,0,0,0,0,0,0,0]
[2,5,4,1,2,1,0,65,79,36,52,17,31,0,1,0,1,1,0,0,0,0,0,0,0,1,0,0,2,1,0,6,1,0,0,0,0,0,0,0,0,0,0,0,0,0,0,0,0,0,0,0,0,0,0,0,0,0,0,0,0,0,0,0,0,0,0,0,0,0,0,0,0,0,0,0,0,0,0,0,0,0,0,0,0,0,0,0,0,0,0,39,63,22,21,13,11,10,5,4,5,1,0,0,0,0,0,0,0,0,0,0,0,0,0,0,0,0,0,0,0,0,0,0,0,0,0,0,0,0,0,0,0,0,0,0,0,0,0,0,0,0,0,0,0,0,0,0,0,0,0,0,0,0,0,0,0,0,0,0,0,0,0,0,0,0,0,0,0,0,0,0,0,0,0,0,0,0,0,0,0,0,0,0,0,0,0,0,0,0,0,0,0,0,0,0,0,0,0,0,0,0,0,0,0,0,0,0,0,0,0,0,0,0,0,0,0,0,0,0,0,0,0,0,0,0,0,0,0,0,0]
[3,1,1,0,1,0,1,35,63,29,42,10,16,2,0,0,1,1,1,0,0,0,0,0,0,0,0,0,0,0,0,18,4,0,1,1,0,0,0,0,0,0,0,0,0,0,0,0,0,0,0,0,2,0,0,0,0,0,0,0,0,0,0,0,0,0,0,0,0,0,0,0,0,0,0,0,0,0,0,0,0,0,0,0,0,0,0,0,0,0,0,41,71,35,52,15,13,1,9,4,1,1,0,0,0,0,0,0,0,0,0,0,0,0,0,0,0,0,0,0,0,0,0,0,0,0,0,0,0,0,0,0,0,0,0,0,0,0,0,0,0,0,0,0,0,0,0,0,0,0,0,0,0,0,0,0,0,0,0,0,0,0,0,0,0,0,0,0,0,0,0,0,0,0,0,0,0,0,0,0,0,0,0,0,0,0,0,0,0,0,0,0,0,0,0,0,0,0,0,0,0,0,0,0,0,0,0,0,0,0,0,0,0,0,0,0,0,0,0,0,0,0,0,0,0,0,0,0,0,0,0]
[4,1,2,2,2,0,0,47,61,26,43,23,18,0,0,0,0,0,0,0,0,0,0,0,0,1,1,0,0,0,0,7,3,0,2,0,0,0,0,0,0,0,0,0,0,0,1,0,0,0,0,0,2,0,0,0,0,0,0,0,0,0,0,0,0,0,0,0,0,0,0,0,0,0,0,0,0,0,0,0,0,0,0,0,0,0,0,0,0,0,0,64,79,50,57,21,21,0,4,0,1,1,0,0,0,0,0,0,0,0,0,0,0,0,0,0,0,0,0,0,0,0,0,0,0,0,0,0,0,0,0,0,0,0,0,0,0,0,0,0,0,0,0,0,0,0,0,0,0,0,0,0,0,0,0,0,0,0,0,0,0,0,0,0,0,0,0,0,0,0,0,0,0,0,0,0,0,0,0,0,0,0,0,0,0,0,0,0,0,0,0,0,0,0,0,0,0,0,0,0,0,0,0,0,0,0,0,0,0,0,0,0,0,0,0,0,0,0,0,0,0,0,0,0,0,0,0,0,0,0,0]
[5,0,2,0,0,0,0,33,30,30,33,12,12,0,0,0,0,0,0,0,0,0,0,0,0,0,0,0,0,0,0,20,9,0,2,0,0,0,0,0,0,0,0,0,0,0,0,0,0,0,0,0,0,0,0,0,0,0,0,0,0,0,0,0,0,0,0,0,0,0,0,0,0,0,0,0,0,0,0,0,0,0,0,0,0,0,0,0,0,0,0,53,74,37,42,12,22,0,1,0,0,0,0,0,0,0,0,0,0,0,0,0,0,0,0,0,0,0,0,0,0,0,0,0,0,0,0,0,0,0,0,0,0,0,0,0,0,0,0,0,0,0,0,0,0,0,0,0,0,0,0,0,0,0,0,0,0,0,0,0,0,0,0,0,0,0,0,0,0,0,0,0,0,0,0,0,0,0,0,0,0,0,0,0,0,0,0,0,0,0,0,0,0,0,0,0,0,0,0,0,0,0,0,0,0,0,0,0,0,0,0,0,0,0,0,0,0,0,0,0,0,0,0,0,0,0,0,0,0,0,0]
[6,1,2,1,0,1,3,24,33,12,29,10,17,0,0,0,0,0,0,0,0,0,0,0,0,0,0,0,0,0,0,28,13,0,1,1,0,0,0,0,0,0,0,0,0,0,2,0,0,1,0,0,1,0,0,0,0,0,0,0,0,0,0,0,0,0,0,0,0,0,0,0,0,0,0,0,0,0,0,5,0,0,0,0,0,0,0,0,0,0,0,57,76,34,39,21,19,4,1,5,1,3,0,0,0,0,0,0,0,0,0,0,0,0,0,0,0,0,0,0,0,0,0,0,0,0,0,0,0,0,0,0,0,0,0,0,0,0,0,0,0,0,0,0,0,0,0,0,0,0,0,0,0,0,0,0,0,0,0,0,0,0,0,0,0,0,0,0,0,0,0,0,0,0,0,0,0,0,0,0,0,0,0,0,0,0,0,0,0,0,0,0,0,0,0,0,0,0,0,0,0,0,0,0,0,0,0,0,0,0,0,0,0,0,0,0,0,0,0,0,0,0,0,0,0,0,0,0,0,0,0]
[8,3,0,2,2,3,2,32,48,23,32,32,19,0,0,0,0,0,0,0,0,0,0,0,0,0,0,0,0,0,0,45,14,1,5,3,0,0,0,0,0,0,0,0,0,0,0,0,0,0,0,0,0,0,0,0,0,0,0,0,0,0,0,0,0,0,0,0,0,0,0,0,0,0,0,0,14,1,0,15,0,0,0,0,0,0,0,0,0,0,0,49,66,31,32,25,22,0,3,1,0,0,0,0,0,0,0,0,0,0,0,0,0,0,0,0,0,0,0,0,0,0,0,0,0,0,0,0,0,0,0,0,0,0,0,0,0,0,0,0,0,0,0,0,0,0,0,0,0,0,0,0,0,0,0,0,0,0,0,0,0,0,0,0,0,0,0,0,0,0,0,0,0,0,0,0,0,0,0,0,0,0,0,0,0,0,0,0,0,0,0,0,0,0,0,0,0,0,0,0,0,0,0,0,0,0,0,0,0,0,0,0,0,0,0,0,0,0,0,0,0,0,0,0,0,0,0,0,0,0,0]
[7,10,9,11,10,4,5,17,33,23,38,11,12,0,0,0,0,0,0,0,0,0,0,0,0,3,1,1,0,1,0,29,14,1,2,2,1,0,0,0,0,0,0,0,0,0,0,0,0,0,0,0,0,0,0,0,0,0,0,0,0,0,0,0,0,0,0,0,0,0,0,0,0,0,0,0,3,0,0,15,2,0,0,0,0,0,0,0,0,0,0,54,61,33,45,11,9,5,5,2,4,0,1,0,0,0,0,0,0,0,0,0,0,0,0,0,0,0,0,0,0,0,0,0,0,0,0,0,0,0,0,0,0,0,0,0,0,0,0,0,0,0,0,0,0,0,0,0,0,0,0,0,0,0,0,0,0,0,0,0,0,0,0,0,0,0,0,0,0,0,0,0,0,0,0,0,0,0,0,0,0,0,0,0,0,0,0,0,0,0,0,0,0,0,0,0,0,0,0,0,0,0,0,0,0,0,0,0,0,0,0,0,0,0,0,0,0,0,0,0,0,0,0,0,0,0,0,0,0,0,0]
[11,6,7,4,3,3,3,32,53,23,40,14,22,0,0,0,0,0,0,0,0,0,0,0,0,0,0,0,0,0,0,56,26,0,4,1,0,0,0,0,0,0,0,0,0,0,0,0,0,0,0,0,0,0,0,0,0,0,0,0,0,0,0,0,0,0,0,1,0,0,0,0,0,0,0,0,0,0,0,14,0,0,0,0,0,0,0,0,0,0,0,39,58,32,37,12,12,2,1,2,0,1,1,0,0,0,0,0,0,0,0,0,0,0,0,0,0,0,0,0,0,0,0,0,0,0,0,0,0,0,0,0,0,0,0,0,0,0,0,0,0,0,0,0,0,0,0,0,0,0,0,0,0,0,0,0,0,0,0,0,0,0,0,0,0,0,0,0,0,0,0,0,0,0,0,0,0,0,0,0,0,0,0,0,0,0,0,0,0,0,0,0,0,0,0,0,0,0,0,0,0,0,0,0,0,0,0,0,0,0,0,0,0,0,0,0,0,0,0,0,0,0,0,0,0,0,0,0,0,0,0]
[9,2,1,2,3,2,2,40,36,29,31,15,20,0,1,1,0,0,0,0,0,0,0,0,0,0,0,0,0,0,0,12,8,1,3,1,0,0,0,0,0,0,0,0,0,0,0,0,0,1,0,0,1,0,0,3,0,0,0,0,0,0,0,0,0,0,0,0,0,0,0,0,0,0,0,0,19,0,0,20,0,0,0,0,0,0,0,0,0,0,0,44,65,27,36,12,17,1,1,1,0,0,0,0,0,0,0,0,0,0,0,0,0,0,0,0,0,0,0,0,0,0,0,0,0,0,0,0,0,0,0,0,0,0,0,0,0,0,0,0,0,0,0,0,0,0,0,0,0,0,0,0,0,0,0,0,0,0,0,0,0,0,0,0,0,0,0,0,0,0,0,0,0,0,0,0,0,0,0,0,0,0,0,0,0,0,0,0,0,0,0,0,0,0,0,0,0,0,0,0,0,0,0,0,0,0,0,0,0,0,0,0,0,0,0,0,0,0,0,0,0,0,0,0,0,0,0,0,0,0,0]
[10,15,12,4,7,6,3,45,40,31,29,15,13,0,0,0,0,1,0,0,0,0,0,0,0,0,0,0,0,0,0,58,25,3,1,3,1,0,0,0,0,0,0,0,0,0,1,0,0,1,0,0,1,0,0,0,0,0,0,0,0,0,0,0,0,0,0,0,0,0,0,0,0,0,0,0,0,0,0,168,14,0,0,0,0,0,0,0,0,0,0,35,57,33,42,18,16,2,2,4,3,1,0,0,0,0,0,0,0,0,0,0,0,0,0,0,0,0,0,0,0,0,0,0,0,0,0,0,0,0,0,0,0,0,0,0,0,0,0,0,0,0,0,0,0,0,0,0,0,0,0,0,0,0,0,0,0,0,0,0,0,0,0,0,0,0,0,0,0,0,0,0,0,0,0,0,0,0,0,0,0,0,0,0,0,0,0,0,0,0,0,0,0,0,0,0,0,0,0,0,0,0,0,0,0,0,0,0,0,0,0,0,0,0,0,0,0,0,0,0,0,0,0,0,0,0,0,0,0,0,0]
["Total general",45,44,30,31,20,19,403,538,292,406,171,199,3,3,2,2,4,1,0,0,0,0,0,0,5,2,1,2,2,0,280,117,6,21,12,2,0,0,0,0,0,0,0,0,0,4,0,0,3,0,0,8,0,0,3,0,0,0,0,0,0,0,0,0,0,0,1,0,0,0,0,0,0,0,0,36,1,0,237,16,0,0,0,0,0,0,0,0,0,0,517,717,360,432,166,172,27,40,28,20,8,4,0,0,0,0,0,0,0,0,0,0,0,0,0,0,0,0,0,0,0,0,0,0,0,0,0,0,0,0,0,0,0,0,0,0,0,0,0,0,0,0,0,0,0,0,0,0,0,0,0,0,0,0,0,0,0,0,0,0,0,0,0,0,0,0,0,0,0,0,0,0,0,0,0,0,0,0,0,0,0,0,0,0,0,0,0,0,0,0,0,0,0,0,0,0,0,0,0,0,0,0,0,0,0,0,0,0,0,0,0,0,0,0,0,0,0,0,0,0,0,0,0,0,0,0,0,0,0,0]
[]
[]
[]
[]
[]
["TOTAL"]
[{"$f":"COUNT(A96:A114)","v":11},{"$f":"SUM(B96:B114)","v":90},{"$f":"SUM(C96:C114)","v":88},60,62,40,38,806,1076,584,812,342,398,6,6,4,4,8,2,0,0,0,0,0,0,10,4,2,4,4,0,560,234,12,42,24,4,0,0,0,0,0,0,0,0,0,8,0,0,6,0,0,16,0,0,6,0,0,0,0,0,0,0,0,0,0,{"$f":"SUM(BO96:BO114)","v":0},2,0,0,0,0,0,0,0,0,72,2,0,474,32,0,0,0,0,0,0,0,0,0,0,1034,1434,720,864,332,344,54,80,56,40,16,8,0,0,0,0,0,0,0,0,0,0,0,0,0,0,0,0,0,0,0,0,0,0,0,0,0,0,0,{"$f":"SUM(EA96:EA114)","v":0},0,0,0,0,0,0,0,0,0,0,0,0,0,0,0,0,0,0,0,0,0,0,0,0,0,0,0,0,0,0,0,0,0,0,0,0,0,0,0,0,0,0,0,0,0,0,0,0,0,0,0,0,0,0,0,0,0,0,0,0,0,0,0,{"$f":"SUM(GM96:GM114)","v":0},0,0,0,0,0,0,0,0,0,0,0,0,0,0,0,0,0,0,0,0,0,0,0,0,0,0,0,0,0,0,0,0,0,0,0,0,0]
[{"$f":"CONCATENATE(A99,\"-\",A100,\"-\",A101,\"-\",A102,\"-\",A103,\"-\",A104,\"-\",A105,\"-\",A106,\"-\",A107,\"-\",A108,\"-\",A109,\"-\",A110)","v":"1-2-3-4-5-6-8-7-11-9-10-Total general"}]
[null," BAS001"," BAS002"," BAS003"," BAS004"," BAS005"," BAS006"," BAS007"," BAS008"," BAS009"," BAS010"," BAS011"," BAS012"," BAS013"," BAS014"," BAS015"," BAS016"," BAS017"," BAS018"," BAS019"," BAS020"," BAS021"," BAS022"," BAS023"," BAS024"," BAS025"," BAS026"," BAS027"," BAS028"," BAS029"," BAS030"," BAS031"," BAS032"," BAS033"," BAS034"," BAS035"," BAS036"," BAS037"," BAS038"," BAS039"," BAS040"," BAS041"," BAS042"," BAS043"," BAS044"," BAS045"," BAS046"," BAS047"," BAS048"," BAS049"," BAS050"," BAS051"," BAS052"," BAS053"," BAS054"," BAS055"," BAS056"," BAS057"," BAS058"," BAS059"," BAS060"," BAS061"," BAS062"," BAS063"," BAS064"," BAS065"," BAS066"," BAS067"," BAS068"," BAS069"," BAS070"," BAS071"," BAS072"," BAS073"," BAS074"," BAS075"," BAS076"," BAS077"," BAS078"," BAS079"," BAS080"," BAS081"," BAS082"," BAS083"," BAS084"," BAS085"," BAS086"," BAS087"," BAS088"," BAS089"," BAS090"," BAS091"," BAS092"," BAS093"," BAS094"," BAS095"," BAS096"," BAS097"," BAS098"," BAS099"," BAS100"," BAS101"," BAS102"," BAS103"," BAS104"," BAS105"," BAS106"," BAS107"," BAS108"," BAS109"," BAS110"," BAS111"," BAS112"," BAS113"," BAS114"," BAS115"," BAS116"," BAS117"," BAS118"," BAS119"," BAS120"," BAS121"," BAS122"," BAS123"," BAS124"," BAS125"," BAS126"," BAS127"," BAS128"," BAS129"," BAS130"," BAS131"," BAS132"," BAS133"," BAS134"," BAS135"," BAS136"," BAS137"," BAS138"," BAS139"," BAS140"," BAS141"," BAS142"," BAS143"," BAS144"," BAS145"," BAS146"," BAS147"," BAS148"," BAS149"," BAS150"," BAS151"," BAS152"," BAS153"," BAS154"," BAS155"," BAS156"," BAS157"," BAS158"," BAS159"," BAS160"," BAS161"," BAS162"," BAS163"," BAS164"," BAS165"," BAS166"," BAS167"," BAS168"," BAS169"," BAS170"," BAS171"," BAS172"," BAS173"," BAS174"," BAS175"," BAS176"," BAS177"," BAS178"," BAS179"," BAS180"," BAS181"," BAS182"," BAS183"," BAS184"," BAS185"," BAS186"," BAS187"," BAS188"," BAS189"," BAS190"," BAS191"," BAS192"," BAS193"," BAS194"," BAS195"," BAS196"," BAS197"," BAS198"," BAS199"," BAS200"," BAS201"," BAS202"," BAS203"," BAS204"," BAS205"," BAS206"," BAS207"," BAS208"," BAS209"," BAS210"," BAS211"," BAS212"," BAS213"," BAS214"," BAS215"," BAS216"," BAS217"," BAS218"," BAS219"," BAS220"," BAS221"," BAS222"," BAS223"," BAS224"," BAS225"," BAS226"," BAS227"," BAS228"," BAS229"," BAS230"]
[null,{"$f":"IF(B119=B98,\"SI\",\"NO\")","v":"SI"},{"$f":"IF(C119=C98,\"SI\",\"NO\")","v":"SI"},"SI","SI","SI","SI","SI","SI","SI","SI","SI","SI","SI","SI","SI","SI","SI","SI","SI","SI","SI","SI","SI","SI","SI","SI","SI","SI","SI","SI","SI","SI","SI","SI","SI","SI","SI","SI","SI","SI","SI","SI","SI","SI","SI","SI","SI","SI","SI","SI","SI","SI","SI","SI","SI","SI","SI","SI","SI","SI","SI","SI","SI","SI","SI",{"$f":"IF(BO119=BO98,\"SI\",\"NO\")","v":"SI"},"SI","SI","SI","SI","SI","SI","SI","SI","SI","SI","SI","SI","SI","SI","SI","SI","SI","SI","SI","SI","SI","SI","SI","SI","SI","SI","SI","SI","SI","SI","SI","SI","SI","SI","SI","SI","SI","SI","SI","SI","SI","SI","SI","SI","SI","SI","SI","SI","SI","SI","SI","SI","SI","SI","SI","SI","SI","SI","SI","SI","SI","SI","SI",{"$f":"IF(EA119=EA98,\"SI\",\"NO\")","v":"SI"},"SI","SI","SI","SI","SI","SI","SI","SI","SI","SI","SI","SI","SI","SI","SI","SI","SI","SI","SI","SI","SI","SI","SI","SI","SI","SI","SI","SI","SI","SI","SI","SI","SI","SI","SI","SI","SI","SI","SI","SI","SI","SI","SI","SI","SI","SI","SI","SI","SI","SI","SI","SI","SI","SI","SI","SI","SI","SI","SI","SI","SI","SI","SI",{"$f":"IF(GM119=GM98,\"SI\",\"NO\")","v":"SI"},"SI","SI","SI","SI","SI","SI","SI","SI","SI","SI","SI","SI","SI","SI","SI","SI","SI","SI","SI","SI","SI","SI","SI","SI","SI","SI","SI","SI","SI","SI","SI","SI","SI","SI","SI","SI"]

{"sheet":"INFORME","index":2,"n_rows":102,"n_cols":33,"rows_kept":102,"cut":false,"hidden":false,"merged":[[100,1,100,10],[11,5,11,6],[9,5,9,6],[7,5,7,6],[5,5,5,6],[20,1,20,10],[23,1,23,10],[37,1,37,10],[61,1,61,10],[66,1,66,10],[98,1,98,10],[52,1,55,1],[57,1,60,1],[62,1,65,1],[67,1,73,1],[74,1,97,1],[0,0,0,10],[1,0,1,10],[48,1,50,1],[3,0,3,10],[13,3,13,4],[13,5,13,6],[13,7,13,8],[13,9,13,10],[16,1,19,1],[15,1,15,10],[21,1,22,1],[24,1,28,1],[29,1,36,1],[39,1,42,1],[44,1,46,1]]}
["GERENCIA REGIONAL DE SALUD CUSCO"]
["DIRECCION DE ESTADISTICA, INFORMATICA Y TELECOMUNICACIONES"]
[]
["Reporte de Actividades de la Etapa de Vida Adulto Mayor"]
[]
[null,"DIRESA:","CUSCO",null,"RED DE SALUD",{"$f":"+TABLAS!O9","v":"03 - LA CONVENCION"},null,null,null,"MES:",{"$f":"+TABLAS!N26","v":"ENE - NOV"}]
[]
[null,null,null,null,"MICRO RED",{"$f":"+TABLAS!O10","v":""},null,null,null,"AÑO:",{"$f":"+TABLAS!J16","v":"2024"}]
[]
[null,null,null,null,"PROVINCIA",{"$f":"+TABLAS!O12","v":""}]
[]
[null,"EE.SS.:",{"$f":"+TABLAS!O11","v":""},null,"DISTRITO",{"$f":"+TABLAS!O13","v":""}]
[null,null,null,null,null,null,null,null,null,null,null,null,null,"=+IMPORTARDATOSDINAMICOS(\" BAS"]
[null,null,null,"TOTAL",null,"De 60 a 69 años",null,"De 70 a 79 años",null,"De 80 años a más",null,null,null,"\";TABLAS!$A$97)"]
[null,null,null,"Masc","Fem","Masc","Fem","Masc","Fem","Masc","Fem"]
[null,"VALORACIÓN CLÍNICA DEL ADULTO MAYOR (VACAM) TRAMA_BASE_AMAYOR_RPT_01_VACAM_CONSOLIDADO"]
[1,"Clasificación","Persona Adulta Mayor Saludable",{"$f":"F17+H17+J17","v":25},{"$f":"G17+I17+K17","v":28},{"$f":"+GETPIVOTDATA(\" BAS001\",TABLAS!$A$59)","v":16},{"$f":"+GETPIVOTDATA(\" BAS002\",TABLAS!$A$59)","v":23},{"$f":"+GETPIVOTDATA(\" BAS003\",TABLAS!$A$59)","v":8},{"$f":"+GETPIVOTDATA(\" BAS004\",TABLAS!$A$59)","v":2},{"$f":"+GETPIVOTDATA(\" BAS005\",TABLAS!$A$59)","v":1},{"$f":"+GETPIVOTDATA(\" BAS006\",TABLAS!$A$59)","v":3}]
[2,null,"Persona Adulta Mayor Enferma",0,2,{"$f":"+GETPIVOTDATA(\" BAS007\",TABLAS!$A$59)","v":0},{"$f":"+GETPIVOTDATA(\" BAS008\",TABLAS!$A$59)","v":1},{"$f":"+GETPIVOTDATA(\" BAS009\",TABLAS!$A$59)","v":0},{"$f":"+GETPIVOTDATA(\" BAS010\",TABLAS!$A$59)","v":0},{"$f":"+GETPIVOTDATA(\" BAS011\",TABLAS!$A$59)","v":0},{"$f":"+GETPIVOTDATA(\" BAS012\",TABLAS!$A$59)","v":1}]
[3,null,"Persona Adulta Mayor Fragil",13,22,{"$f":"+GETPIVOTDATA(\" BAS013\",TABLAS!$A$59)","v":7},{"$f":"+GETPIVOTDATA(\" BAS014\",TABLAS!$A$59)","v":9},{"$f":"+GETPIVOTDATA(\" BAS015\",TABLAS!$A$59)","v":4},{"$f":"+GETPIVOTDATA(\" BAS016\",TABLAS!$A$59)","v":9},{"$f":"+GETPIVOTDATA(\" BAS017\",TABLAS!$A$59)","v":2},{"$f":"+GETPIVOTDATA(\" BAS018\",TABLAS!$A$59)","v":4},null,null,{"$f":"CONCATENATE($N$13,U19,$N$14)","v":"=+IMPORTARDATOSDINAMICOS(\" BAS013\";TABLAS!$A$97)"},{"$f":"CONCATENATE($N$13,V19,$N$14)","v":"=+IMPORTARDATOSDINAMICOS(\" BAS014\";TABLAS!$A$97)"},{"$f":"CONCATENATE($N$13,W19,$N$14)","v":"=+IMPORTARDATOSDINAMICOS(\" BAS015\";TABLAS!$A$97)"},{"$f":"CONCATENATE($N$13,X19,$N$14)","v":"=+IMPORTARDATOSDINAMICOS(\" BAS016\";TABLAS!$A$97)"},{"$f":"CONCATENATE($N$13,Y19,$N$14)","v":"=+IMPORTARDATOSDINAMICOS(\" BAS017\";TABLAS!$A$97)"},{"$f":"CONCATENATE($N$13,Z19,$N$14)","v":"=+IMPORTARDATOSDINAMICOS(\" BAS018\";TABLAS!$A$97)"},null,{"$f":"IF(AB19<10,CONCATENATE(\"00\",AB19),IF(AND(AB19<100,AB19>9),CONCATENATE(\"0\",AB19),AB19))","v":"013"},{"$f":"IF(AC19<10,CONCATENATE(\"00\",AC19),IF(AND(AC19<100,AC19>9),CONCATENATE(\"0\",AC19),AC19))","v":"014"},{"$f":"IF(AD19<10,CONCATENATE(\"00\",AD19),IF(AND(AD19<100,AD19>9),CONCATENATE(\"0\",AD19),AD19))","v":"015"},{"$f":"IF(AE19<10,CONCATENATE(\"00\",AE19),IF(AND(AE19<100,AE19>9),CONCATENATE(\"0\",AE19),AE19))","v":"016"},{"$f":"IF(AF19<10,CONCATENATE(\"00\",AF19),IF(AND(AF19<100,AF19>9),CONCATENATE(\"0\",AF19),AF19))","v":"017"},{"$f":"IF(AG19<10,CONCATENATE(\"00\",AG19),IF(AND(AG19<100,AG19>9),CONCATENATE(\"0\",AG19),AG19))","v":"018"},null,{"$f":"+AG64+1","v":13},{"$f":"+AB19+1","v":14},15,16,17,18]
[4,null,"Persona Adulta Mayor Geriatrico complejo",0,0,{"$f":"+GETPIVOTDATA(\" BAS019\",TABLAS!$A$59)","v":0},{"$f":"+GETPIVOTDATA(\" BAS020\",TABLAS!$A$59)","v":0},{"$f":"+GETPIVOTDATA(\" BAS021\",TABLAS!$A$59)","v":0},{"$f":"+GETPIVOTDATA(\" BAS022\",TABLAS!$A$59)","v":0},{"$f":"+GETPIVOTDATA(\" BAS023\",TABLAS!$A$59)","v":0},{"$f":"+GETPIVOTDATA(\" BAS024\",TABLAS!$A$59)","v":0},null,null,"=+IMPORTARDATOSDINAMICOS(\" BAS019\";TABLAS!$A$97)","=+IMPORTARDATOSDINAMICOS(\" BAS020\";TABLAS!$A$97)","=+IMPORTARDATOSDINAMICOS(\" BAS021\";TABLAS!$A$97)","=+IMPORTARDATOSDINAMICOS(\" BAS022\";TABLAS!$A$97)","=+IMPORTARDATOSDINAMICOS(\" BAS023\";TABLAS!$A$97)","=+IMPORTARDATOSDINAMICOS(\" BAS024\";TABLAS!$A$97)",null,"019","020","021","022","023","024",null,{"$f":"+AG19+1","v":19},{"$f":"+AB20+1","v":20},21,22,23,24]
[null,"PLAN DE ATENCIÓN TRAMA_BASE_AMAYOR_RPT_02_PAI_CONSOLIDADO"]
[5,null,"Plan de Atencion Integral Elaborado",{"$f":"F22+H22+J22","v":210},227,{"$f":"+GETPIVOTDATA(\" BAS025\",TABLAS!$A$59)","v":82},{"$f":"+GETPIVOTDATA(\" BAS026\",TABLAS!$A$59)","v":105},{"$f":"+GETPIVOTDATA(\" BAS027\",TABLAS!$A$59)","v":77},{"$f":"+GETPIVOTDATA(\" BAS028\",TABLAS!$A$59)","v":73},{"$f":"+GETPIVOTDATA(\" BAS029\",TABLAS!$A$59)","v":51},{"$f":"+GETPIVOTDATA(\" BAS030\",TABLAS!$A$59)","v":49},null,null,{"$f":"CONCATENATE($N$13,U22,$N$14)","v":"=+IMPORTARDATOSDINAMICOS(\" BAS025\";TABLAS!$A$97)"},{"$f":"CONCATENATE($N$13,V22,$N$14)","v":"=+IMPORTARDATOSDINAMICOS(\" BAS026\";TABLAS!$A$97)"},{"$f":"CONCATENATE($N$13,W22,$N$14)","v":"=+IMPORTARDATOSDINAMICOS(\" BAS027\";TABLAS!$A$97)"},{"$f":"CONCATENATE($N$13,X22,$N$14)","v":"=+IMPORTARDATOSDINAMICOS(\" BAS028\";TABLAS!$A$97)"},{"$f":"CONCATENATE($N$13,Y22,$N$14)","v":"=+IMPORTARDATOSDINAMICOS(\" BAS029\";TABLAS!$A$97)"},{"$f":"CONCATENATE($N$13,Z22,$N$14)","v":"=+IMPORTARDATOSDINAMICOS(\" BAS030\";TABLAS!$A$97)"},null,"025",{"$f":"IF(AC22<10,CONCATENATE(\"00\",AC22),IF(AND(AC22<100,AC22>9),CONCATENATE(\"0\",AC22),AC22))","v":"026"},{"$f":"IF(AD22<10,CONCATENATE(\"00\",AD22),IF(AND(AD22<100,AD22>9),CONCATENATE(\"0\",AD22),AD22))","v":"027"},{"$f":"IF(AE22<10,CONCATENATE(\"00\",AE22),IF(AND(AE22<100,AE22>9),CONCATENATE(\"0\",AE22),AE22))","v":"028"},{"$f":"IF(AF22<10,CONCATENATE(\"00\",AF22),IF(AND(AF22<100,AF22>9),CONCATENATE(\"0\",AF22),AF22))","v":"029"},{"$f":"IF(AG22<10,CONCATENATE(\"00\",AG22),IF(AND(AG22<100,AG22>9),CONCATENATE(\"0\",AG22),AG22))","v":"030"},null,{"$f":"+AG20+1","v":25},26,27,28,29,30]
[6,null,"Plan de Atencion Integral Ejecutado",29,19,{"$f":"+GETPIVOTDATA(\" BAS031\",TABLAS!$A$59)","v":14},{"$f":"+GETPIVOTDATA(\" BAS032\",TABLAS!$A$59)","v":11},{"$f":"+GETPIVOTDATA(\" BAS033\",TABLAS!$A$59)","v":11},{"$f":"+GETPIVOTDATA(\" BAS034\",TABLAS!$A$59)","v":5},{"$f":"+GETPIVOTDATA(\" BAS035\",TABLAS!$A$59)","v":4},{"$f":"+GETPIVOTDATA(\" BAS036\",TABLAS!$A$59)","v":3},null,null,"=+IMPORTARDATOSDINAMICOS(\" BAS031\";TABLAS!$A$97)","=+IMPORTARDATOSDINAMICOS(\" BAS032\";TABLAS!$A$97)","=+IMPORTARDATOSDINAMICOS(\" BAS033\";TABLAS!$A$97)","=+IMPORTARDATOSDINAMICOS(\" BAS034\";TABLAS!$A$97)","=+IMPORTARDATOSDINAMICOS(\" BAS035\";TABLAS!$A$97)","=+IMPORTARDATOSDINAMICOS(\" BAS036\";TABLAS!$A$97)",null,"031",{"$f":"IF(AC23<10,CONCATENATE(\"00\",AC23),IF(AND(AC23<100,AC23>9),CONCATENATE(\"0\",AC23),AC23))","v":"032"},{"$f":"IF(AD23<10,CONCATENATE(\"00\",AD23),IF(AND(AD23<100,AD23>9),CONCATENATE(\"0\",AD23),AD23))","v":"033"},{"$f":"IF(AE23<10,CONCATENATE(\"00\",AE23),IF(AND(AE23<100,AE23>9),CONCATENATE(\"0\",AE23),AE23))","v":"034"},{"$f":"IF(AF23<10,CONCATENATE(\"00\",AF23),IF(AND(AF23<100,AF23>9),CONCATENATE(\"0\",AF23),AF23))","v":"035"},{"$f":"IF(AG23<10,CONCATENATE(\"00\",AG23),IF(AND(AG23<100,AG23>9),CONCATENATE(\"0\",AG23),AG23))","v":"036"},null,{"$f":"+AG22+1","v":31},32,33,34,35,36]
[null,"ENTREVISTA DE TAMIZAJE EN SALUD MENTAL TRAMA_BASE_AMAYOR_RPT_03_TAMIZAJE_CONSOLIDADO"]
[7,"Tamizados","Violencia Intrafamiliar",{"$f":"F25+H25+J25","v":0},0,{"$f":"+GETPIVOTDATA(\" BAS037\",TABLAS!$A$59)","v":0},{"$f":"+GETPIVOTDATA(\" BAS038\",TABLAS!$A$59)","v":0},{"$f":"+GETPIVOTDATA(\" BAS039\",TABLAS!$A$59)","v":0},{"$f":"+GETPIVOTDATA(\" BAS040\",TABLAS!$A$59)","v":0},{"$f":"+GETPIVOTDATA(\" BAS041\",TABLAS!$A$59)","v":0},{"$f":"+GETPIVOTDATA(\" BAS042\",TABLAS!$A$59)","v":0},null,null,{"$f":"CONCATENATE($N$13,U25,$N$14)","v":"=+IMPORTARDATOSDINAMICOS(\" BAS037\";TABLAS!$A$97)"},{"$f":"CONCATENATE($N$13,V25,$N$14)","v":"=+IMPORTARDATOSDINAMICOS(\" BAS038\";TABLAS!$A$97)"},{"$f":"CONCATENATE($N$13,W25,$N$14)","v":"=+IMPORTARDATOSDINAMICOS(\" BAS039\";TABLAS!$A$97)"},{"$f":"CONCATENATE($N$13,X25,$N$14)","v":"=+IMPORTARDATOSDINAMICOS(\" BAS040\";TABLAS!$A$97)"},{"$f":"CONCATENATE($N$13,Y25,$N$14)","v":"=+IMPORTARDATOSDINAMICOS(\" BAS041\";TABLAS!$A$97)"},{"$f":"CONCATENATE($N$13,Z25,$N$14)","v":"=+IMPORTARDATOSDINAMICOS(\" BAS042\";TABLAS!$A$97)"},null,{"$f":"IF(AB25<10,CONCATENATE(\"00\",AB25),IF(AND(AB25<100,AB25>9),CONCATENATE(\"0\",AB25),AB25))","v":"037"},{"$f":"IF(AC25<10,CONCATENATE(\"00\",AC25),IF(AND(AC25<100,AC25>9),CONCATENATE(\"0\",AC25),AC25))","v":"038"},{"$f":"IF(AD25<10,CONCATENATE(\"00\",AD25),IF(AND(AD25<100,AD25>9),CONCATENATE(\"0\",AD25),AD25))","v":"039"},{"$f":"IF(AE25<10,CONCATENATE(\"00\",AE25),IF(AND(AE25<100,AE25>9),CONCATENATE(\"0\",AE25),AE25))","v":"040"},{"$f":"IF(AF25<10,CONCATENATE(\"00\",AF25),IF(AND(AF25<100,AF25>9),CONCATENATE(\"0\",AF25),AF25))","v":"041"},{"$f":"IF(AG25<10,CONCATENATE(\"00\",AG25),IF(AND(AG25<100,AG25>9),CONCATENATE(\"0\",AG25),AG25))","v":"042"},null,{"$f":"+AG23+1","v":37},38,39,40,41,42]
[8,null,"Transtornos Depresivos",2,1,{"$f":"+GETPIVOTDATA(\" BAS043\",TABLAS!$A$59)","v":1},{"$f":"+GETPIVOTDATA(\" BAS044\",TABLAS!$A$59)","v":1},{"$f":"+GETPIVOTDATA(\" BAS045\",TABLAS!$A$59)","v":0},{"$f":"+GETPIVOTDATA(\" BAS046\",TABLAS!$A$59)","v":0},{"$f":"+GETPIVOTDATA(\" BAS047\",TABLAS!$A$59)","v":1},{"$f":"+GETPIVOTDATA(\" BAS048\",TABLAS!$A$59)","v":0},null,null,{"$f":"CONCATENATE($N$13,U26,$N$14)","v":"=+IMPORTARDATOSDINAMICOS(\" BAS043\";TABLAS!$A$97)"},{"$f":"CONCATENATE($N$13,V26,$N$14)","v":"=+IMPORTARDATOSDINAMICOS(\" BAS044\";TABLAS!$A$97)"},{"$f":"CONCATENATE($N$13,W26,$N$14)","v":"=+IMPORTARDATOSDINAMICOS(\" BAS045\";TABLAS!$A$97)"},{"$f":"CONCATENATE($N$13,X26,$N$14)","v":"=+IMPORTARDATOSDINAMICOS(\" BAS046\";TABLAS!$A$97)"},{"$f":"CONCATENATE($N$13,Y26,$N$14)","v":"=+IMPORTARDATOSDINAMICOS(\" BAS047\";TABLAS!$A$97)"},{"$f":"CONCATENATE($N$13,Z26,$N$14)","v":"=+IMPORTARDATOSDINAMICOS(\" BAS048\";TABLAS!$A$97)"},null,{"$f":"IF(AB26<10,CONCATENATE(\"00\",AB26),IF(AND(AB26<100,AB26>9),CONCATENATE(\"0\",AB26),AB26))","v":"043"},{"$f":"IF(AC26<10,CONCATENATE(\"00\",AC26),IF(AND(AC26<100,AC26>9),CONCATENATE(\"0\",AC26),AC26))","v":"044"},{"$f":"IF(AD26<10,CONCATENATE(\"00\",AD26),IF(AND(AD26<100,AD26>9),CONCATENATE(\"0\",AD26),AD26))","v":"045"},{"$f":"IF(AE26<10,CONCATENATE(\"00\",AE26),IF(AND(AE26<100,AE26>9),CONCATENATE(\"0\",AE26),AE26))","v":"046"},{"$f":"IF(AF26<10,CONCATENATE(\"00\",AF26),IF(AND(AF26<100,AF26>9),CONCATENATE(\"0\",AF26),AF26))","v":"047"},{"$f":"IF(AG26<10,CONCATENATE(\"00\",AG26),IF(AND(AG26<100,AG26>9),CONCATENATE(\"0\",AG26),AG26))","v":"048"},null,{"$f":"+AG25+1","v":43},{"$f":"+AB26+1","v":44},45,46,47,48]
[9,null,"Alcohol y drogas",0,0,{"$f":"+GETPIVOTDATA(\" BAS049\",TABLAS!$A$59)","v":0},{"$f":"+GETPIVOTDATA(\" BAS050\",TABLAS!$A$59)","v":0},{"$f":"+GETPIVOTDATA(\" BAS051\",TABLAS!$A$59)","v":0},{"$f":"+GETPIVOTDATA(\" BAS052\",TABLAS!$A$59)","v":0},{"$f":"+GETPIVOTDATA(\" BAS053\",TABLAS!$A$59)","v":0},{"$f":"+GETPIVOTDATA(\" BAS054\",TABLAS!$A$59)","v":0},null,null,"=+IMPORTARDATOSDINAMICOS(\" BAS049\";TABLAS!$A$97)","=+IMPORTARDATOSDINAMICOS(\" BAS050\";TABLAS!$A$97)","=+IMPORTARDATOSDINAMICOS(\" BAS051\";TABLAS!$A$97)","=+IMPORTARDATOSDINAMICOS(\" BAS052\";TABLAS!$A$97)","=+IMPORTARDATOSDINAMICOS(\" BAS053\";TABLAS!$A$97)","=+IMPORTARDATOSDINAMICOS(\" BAS054\";TABLAS!$A$97)",null,"049","050","051","052","053","054",null,{"$f":"+AG26+1","v":49},{"$f":"+AB27+1","v":50},51,52,53,54]
[10,null,"Episodio Psicótico",63,178,{"$f":"+GETPIVOTDATA(\" BAS055\",TABLAS!$A$59)","v":36},{"$f":"+GETPIVOTDATA(\" BAS056\",TABLAS!$A$59)","v":92},{"$f":"+GETPIVOTDATA(\" BAS057\",TABLAS!$A$59)","v":21},{"$f":"+GETPIVOTDATA(\" BAS058\",TABLAS!$A$59)","v":63},{"$f":"+GETPIVOTDATA(\" BAS059\",TABLAS!$A$59)","v":6},{"$f":"+GETPIVOTDATA(\" BAS060\",TABLAS!$A$59)","v":23},null,null,"=+IMPORTARDATOSDINAMICOS(\" BAS055\";TABLAS!$A$97)","=+IMPORTARDATOSDINAMICOS(\" BAS056\";TABLAS!$A$97)","=+IMPORTARDATOSDINAMICOS(\" BAS057\";TABLAS!$A$97)","=+IMPORTARDATOSDINAMICOS(\" BAS058\";TABLAS!$A$97)","=+IMPORTARDATOSDINAMICOS(\" BAS059\";TABLAS!$A$97)","=+IMPORTARDATOSDINAMICOS(\" BAS060\";TABLAS!$A$97)",null,"055","056","057","058","059","060",null,55,{"$f":"+AB28+1","v":56},57,58,59,60]
[11,null,"Tamizaje en Víctimas de Violencia Política",0,0,{"$f":"+GETPIVOTDATA(\" BAS061\",TABLAS!$A$59)","v":0},{"$f":"+GETPIVOTDATA(\" BAS062\",TABLAS!$A$59)","v":0},{"$f":"+GETPIVOTDATA(\" BAS063\",TABLAS!$A$59)","v":0},{"$f":"+GETPIVOTDATA(\" BAS064\",TABLAS!$A$59)","v":0},{"$f":"+GETPIVOTDATA(\" BAS065\",TABLAS!$A$59)","v":0},{"$f":"+GETPIVOTDATA(\" BAS066\",TABLAS!$A$59)","v":0},null,null,"=+IMPORTARDATOSDINAMICOS(\" BAS061\";TABLAS!$A$97)","=+IMPORTARDATOSDINAMICOS(\" BAS062\";TABLAS!$A$97)","=+IMPORTARDATOSDINAMICOS(\" BAS063\";TABLAS!$A$97)","=+IMPORTARDATOSDINAMICOS(\" BAS064\";TABLAS!$A$97)","=+IMPORTARDATOSDINAMICOS(\" BAS065\";TABLAS!$A$97)","=+IMPORTARDATOSDINAMICOS(\" BAS066\";TABLAS!$A$97)",null,"061","062","063","064","065","066",null,61,{"$f":"+AB29+1","v":62},63,64,65,66]
[12,"Positivos","Violencia Intrafamiliar",0,0,{"$f":"+GETPIVOTDATA(\" BAS067\",TABLAS!$A$59)","v":0},{"$f":"+GETPIVOTDATA(\" BAS068\",TABLAS!$A$59)","v":0},{"$f":"+GETPIVOTDATA(\" BAS069\",TABLAS!$A$59)","v":0},{"$f":"+GETPIVOTDATA(\" BAS070\",TABLAS!$A$59)","v":0},{"$f":"+GETPIVOTDATA(\" BAS071\",TABLAS!$A$59)","v":0},{"$f":"+GETPIVOTDATA(\" BAS072\",TABLAS!$A$59)","v":0},null,null,"=+IMPORTARDATOSDINAMICOS(\" BAS067\";TABLAS!$A$97)","=+IMPORTARDATOSDINAMICOS(\" BAS068\";TABLAS!$A$97)","=+IMPORTARDATOSDINAMICOS(\" BAS069\";TABLAS!$A$97)","=+IMPORTARDATOSDINAMICOS(\" BAS070\";TABLAS!$A$97)","=+IMPORTARDATOSDINAMICOS(\" BAS071\";TABLAS!$A$97)","=+IMPORTARDATOSDINAMICOS(\" BAS072\";TABLAS!$A$97)",null,"067","068","069","070","071","072",null,67,{"$f":"+AB30+1","v":68},69,70,71,72]
[13,null,"Transtornos Depresivos",0,0,{"$f":"+GETPIVOTDATA(\" BAS073\",TABLAS!$A$59)","v":0},{"$f":"+GETPIVOTDATA(\" BAS074\",TABLAS!$A$59)","v":0},{"$f":"+GETPIVOTDATA(\" BAS075\",TABLAS!$A$59)","v":0},{"$f":"+GETPIVOTDATA(\" BAS076\",TABLAS!$A$59)","v":0},{"$f":"+GETPIVOTDATA(\" BAS077\",TABLAS!$A$59)","v":0},{"$f":"+GETPIVOTDATA(\" BAS078\",TABLAS!$A$59)","v":0},null,null,"=+IMPORTARDATOSDINAMICOS(\" BAS073\";TABLAS!$A$97)","=+IMPORTARDATOSDINAMICOS(\" BAS074\";TABLAS!$A$97)","=+IMPORTARDATOSDINAMICOS(\" BAS075\";TABLAS!$A$97)","=+IMPORTARDATOSDINAMICOS(\" BAS076\";TABLAS!$A$97)","=+IMPORTARDATOSDINAMICOS(\" BAS077\";TABLAS!$A$97)","=+IMPORTARDATOSDINAMICOS(\" BAS078\";TABLAS!$A$97)",null,"073","074","075","076","077","078",null,73,{"$f":"+AB31+1","v":74},75,76,77,78]
[null,null,"Alcohol y drogas",0,0,{"$f":"SUM(F33:F35)","v":0},{"$f":"SUM(G33:G35)","v":0},0,0,0,0]
[14,null,"- Problemas Relacionados con el Uso de Tabaco",0,0,{"$f":"+GETPIVOTDATA(\" BAS085\",TABLAS!$A$59)","v":0},{"$f":"+GETPIVOTDATA(\" BAS086\",TABLAS!$A$59)","v":0},{"$f":"+GETPIVOTDATA(\" BAS087\",TABLAS!$A$59)","v":0},{"$f":"+GETPIVOTDATA(\" BAS088\",TABLAS!$A$59)","v":0},{"$f":"+GETPIVOTDATA(\" BAS089\",TABLAS!$A$59)","v":0},{"$f":"+GETPIVOTDATA(\" BAS090\",TABLAS!$A$59)","v":0},null,null,"=+IMPORTARDATOSDINAMICOS(\" BAS079\";TABLAS!$A$97)","=+IMPORTARDATOSDINAMICOS(\" BAS080\";TABLAS!$A$97)","=+IMPORTARDATOSDINAMICOS(\" BAS081\";TABLAS!$A$97)","=+IMPORTARDATOSDINAMICOS(\" BAS082\";TABLAS!$A$97)","=+IMPORTARDATOSDINAMICOS(\" BAS083\";TABLAS!$A$97)","=+IMPORTARDATOSDINAMICOS(\" BAS084\";TABLAS!$A$97)",null,"079","080","081","082","083","084",null,{"$f":"+AG31+1","v":79},{"$f":"+AB33+1","v":80},81,82,83,84]
[15,null,"- Problemas Sociales Relacionados con el Uso de Alcohol",0,0,{"$f":"+GETPIVOTDATA(\" BAS091\",TABLAS!$A$59)","v":0},{"$f":"+GETPIVOTDATA(\" BAS092\",TABLAS!$A$59)","v":0},{"$f":"+GETPIVOTDATA(\" BAS093\",TABLAS!$A$59)","v":0},{"$f":"+GETPIVOTDATA(\" BAS094\",TABLAS!$A$59)","v":0},{"$f":"+GETPIVOTDATA(\" BAS095\",TABLAS!$A$59)","v":0},{"$f":"+GETPIVOTDATA(\" BAS096\",TABLAS!$A$59)","v":0},null,null,"=+IMPORTARDATOSDINAMICOS(\" BAS085\";TABLAS!$A$97)","=+IMPORTARDATOSDINAMICOS(\" BAS086\";TABLAS!$A$97)","=+IMPORTARDATOSDINAMICOS(\" BAS087\";TABLAS!$A$97)","=+IMPORTARDATOSDINAMICOS(\" BAS088\";TABLAS!$A$97)","=+IMPORTARDATOSDINAMICOS(\" BAS089\";TABLAS!$A$97)","=+IMPORTARDATOSDINAMICOS(\" BAS090\";TABLAS!$A$97)",null,"085","086","087","088","089","090",null,85,{"$f":"+AB34+1","v":86},87,88,89,90]
[16,null,"- Problemas Sociales Relacionados con el Uso de drogas",0,0,{"$f":"+GETPIVOTDATA(\" BAS097\",TABLAS!$A$59)","v":0},{"$f":"+GETPIVOTDATA(\" BAS098\",TABLAS!$A$59)","v":0},{"$f":"+GETPIVOTDATA(\" BAS099\",TABLAS!$A$59)","v":0},{"$f":"+GETPIVOTDATA(\" BAS100\",TABLAS!$A$59)","v":0},{"$f":"+GETPIVOTDATA(\" BAS101\",TABLAS!$A$59)","v":0},{"$f":"+GETPIVOTDATA(\" BAS102\",TABLAS!$A$59)","v":0},null,null,"=+IMPORTARDATOSDINAMICOS(\" BAS091\";TABLAS!$A$97)","=+IMPORTARDATOSDINAMICOS(\" BAS092\";TABLAS!$A$97)","=+IMPORTARDATOSDINAMICOS(\" BAS093\";TABLAS!$A$97)","=+IMPORTARDATOSDINAMICOS(\" BAS094\";TABLAS!$A$97)","=+IMPORTARDATOSDINAMICOS(\" BAS095\";TABLAS!$A$97)","=+IMPORTARDATOSDINAMICOS(\" BAS096\";TABLAS!$A$97)",null,"091","092","093","094","095","096",null,91,{"$f":"+AB35+1","v":92},93,94,95,96]
[17,null,"Episodio Psicótico",0,0,{"$f":"+GETPIVOTDATA(\" BAS103\",TABLAS!$A$59)","v":0},{"$f":"+GETPIVOTDATA(\" BAS104\",TABLAS!$A$59)","v":0},{"$f":"+GETPIVOTDATA(\" BAS105\",TABLAS!$A$59)","v":0},{"$f":"+GETPIVOTDATA(\" BAS106\",TABLAS!$A$59)","v":0},{"$f":"+GETPIVOTDATA(\" BAS107\",TABLAS!$A$59)","v":0},{"$f":"+GETPIVOTDATA(\" BAS108\",TABLAS!$A$59)","v":0},null,null,"=+IMPORTARDATOSDINAMICOS(\" BAS097\";TABLAS!$A$97)","=+IMPORTARDATOSDINAMICOS(\" BAS098\";TABLAS!$A$97)","=+IMPORTARDATOSDINAMICOS(\" BAS099\";TABLAS!$A$97)","=+IMPORTARDATOSDINAMICOS(\" BAS100\";TABLAS!$A$97)","=+IMPORTARDATOSDINAMICOS(\" BAS101\";TABLAS!$A$97)","=+IMPORTARDATOSDINAMICOS(\" BAS102\";TABLAS!$A$97)",null,"097","098","099",100,101,102,null,97,{"$f":"+AB36+1","v":98},99,100,101,102]
[18,null,"Tamizaje Positivo en Víctimas de Violencia Política",97,92,{"$f":"+GETPIVOTDATA(\" BAS109\",TABLAS!$A$59)","v":35},{"$f":"+GETPIVOTDATA(\" BAS110\",TABLAS!$A$59)","v":24},{"$f":"+GETPIVOTDATA(\" BAS111\",TABLAS!$A$59)","v":39},{"$f":"+GETPIVOTDATA(\" BAS112\",TABLAS!$A$59)","v":35},{"$f":"+GETPIVOTDATA(\" BAS113\",TABLAS!$A$59)","v":23},{"$f":"+GETPIVOTDATA(\" BAS114\",TABLAS!$A$59)","v":33},null,null,"=+IMPORTARDATOSDINAMICOS(\" BAS103\";TABLAS!$A$97)","=+IMPORTARDATOSDINAMICOS(\" BAS104\";TABLAS!$A$97)","=+IMPORTARDATOSDINAMICOS(\" BAS105\";TABLAS!$A$97)","=+IMPORTARDATOSDINAMICOS(\" BAS106\";TABLAS!$A$97)","=+IMPORTARDATOSDINAMICOS(\" BAS107\";TABLAS!$A$97)","=+IMPORTARDATOSDINAMICOS(\" BAS108\";TABLAS!$A$97)",null,103,104,105,106,107,108,null,103,{"$f":"+AB37+1","v":104},105,106,107,108]
[null,"CLASIFICACIÓN DEL ESTADO NUTRICIONAL DEL ADULTO MAYOR TRAMA_BASE_AMAYOR_RPT_04_NUTRICIONAL_CONSOLIDADO"]
[null,null,"Índice de Masa Corporal"]
[19,"IMC","Delgadez",{"$f":"F40+H40+J40","v":97},92,{"$f":"+GETPIVOTDATA(\" BAS109\",TABLAS!$A$59)","v":35},{"$f":"+GETPIVOTDATA(\" BAS110\",TABLAS!$A$59)","v":24},{"$f":"+GETPIVOTDATA(\" BAS111\",TABLAS!$A$59)","v":39},{"$f":"+GETPIVOTDATA(\" BAS112\",TABLAS!$A$59)","v":35},{"$f":"+GETPIVOTDATA(\" BAS113\",TABLAS!$A$59)","v":23},{"$f":"+GETPIVOTDATA(\" BAS114\",TABLAS!$A$59)","v":33},null,null,{"$f":"CONCATENATE($N$13,U40,$N$14)","v":"=+IMPORTARDATOSDINAMICOS(\" BAS109\";TABLAS!$A$97)"},"=+IMPORTARDATOSDINAMICOS(\" BAS110\";TABLAS!$A$97)","=+IMPORTARDATOSDINAMICOS(\" BAS111\";TABLAS!$A$97)","=+IMPORTARDATOSDINAMICOS(\" BAS112\";TABLAS!$A$97)","=+IMPORTARDATOSDINAMICOS(\" BAS113\";TABLAS!$A$97)","=+IMPORTARDATOSDINAMICOS(\" BAS114\";TABLAS!$A$97)",null,{"$f":"IF(AB40<10,CONCATENATE(\"00\",AB40),IF(AND(AB40<100,AB40>9),CONCATENATE(\"0\",AB40),AB40))","v":109},110,111,112,113,114,null,{"$f":"+AG37+1","v":109},{"$f":"+AB40+1","v":110},111,112,113,114]
[20,null,"Normal",218,188,{"$f":"+GETPIVOTDATA(\" BAS115\",TABLAS!$A$59)","v":118},{"$f":"+GETPIVOTDATA(\" BAS116\",TABLAS!$A$59)","v":88},{"$f":"+GETPIVOTDATA(\" BAS117\",TABLAS!$A$59)","v":65},{"$f":"+GETPIVOTDATA(\" BAS118\",TABLAS!$A$59)","v":66},{"$f":"+GETPIVOTDATA(\" BAS119\",TABLAS!$A$59)","v":35},{"$f":"+GETPIVOTDATA(\" BAS120\",TABLAS!$A$59)","v":34},null,null,{"$f":"CONCATENATE($N$13,U41,$N$14)","v":"=+IMPORTARDATOSDINAMICOS(\" BAS115\";TABLAS!$A$97)"},{"$f":"CONCATENATE($N$13,V41,$N$14)","v":"=+IMPORTARDATOSDINAMICOS(\" BAS116\";TABLAS!$A$97)"},{"$f":"CONCATENATE($N$13,W41,$N$14)","v":"=+IMPORTARDATOSDINAMICOS(\" BAS117\";TABLAS!$A$97)"},{"$f":"CONCATENATE($N$13,X41,$N$14)","v":"=+IMPORTARDATOSDINAMICOS(\" BAS118\";TABLAS!$A$97)"},{"$f":"CONCATENATE($N$13,Y41,$N$14)","v":"=+IMPORTARDATOSDINAMICOS(\" BAS119\";TABLAS!$A$97)"},{"$f":"CONCATENATE($N$13,Z41,$N$14)","v":"=+IMPORTARDATOSDINAMICOS(\" BAS120\";TABLAS!$A$97)"},null,{"$f":"IF(AB41<10,CONCATENATE(\"00\",AB41),IF(AND(AB41<100,AB41>9),CONCATENATE(\"0\",AB41),AB41))","v":115},{"$f":"IF(AC41<10,CONCATENATE(\"00\",AC41),IF(AND(AC41<100,AC41>9),CONCATENATE(\"0\",AC41),AC41))","v":116},{"$f":"IF(AD41<10,CONCATENATE(\"00\",AD41),IF(AND(AD41<100,AD41>9),CONCATENATE(\"0\",AD41),AD41))","v":117},{"$f":"IF(AE41<10,CONCATENATE(\"00\",AE41),IF(AND(AE41<100,AE41>9),CONCATENATE(\"0\",AE41),AE41))","v":118},{"$f":"IF(AF41<10,CONCATENATE(\"00\",AF41),IF(AND(AF41<100,AF41>9),CONCATENATE(\"0\",AF41),AF41))","v":119},{"$f":"IF(AG41<10,CONCATENATE(\"00\",AG41),IF(AND(AG41<100,AG41>9),CONCATENATE(\"0\",AG41),AG41))","v":120},null,{"$f":"+AG40+1","v":115},{"$f":"+AB41+1","v":116},117,118,119,120]
[21,null,"Sobrepeso ",53,88,{"$f":"+GETPIVOTDATA(\" BAS121\",TABLAS!$A$59)","v":24},{"$f":"+GETPIVOTDATA(\" BAS122\",TABLAS!$A$59)","v":49},{"$f":"+GETPIVOTDATA(\" BAS123\",TABLAS!$A$59)","v":21},{"$f":"+GETPIVOTDATA(\" BAS124\",TABLAS!$A$59)","v":32},{"$f":"+GETPIVOTDATA(\" BAS125\",TABLAS!$A$59)","v":8},{"$f":"+GETPIVOTDATA(\" BAS126\",TABLAS!$A$59)","v":7},null,null,"=+IMPORTARDATOSDINAMICOS(\" BAS121\";TABLAS!$A$97)","=+IMPORTARDATOSDINAMICOS(\" BAS122\";TABLAS!$A$97)","=+IMPORTARDATOSDINAMICOS(\" BAS123\";TABLAS!$A$97)","=+IMPORTARDATOSDINAMICOS(\" BAS124\";TABLAS!$A$97)","=+IMPORTARDATOSDINAMICOS(\" BAS125\";TABLAS!$A$97)","=+IMPORTARDATOSDINAMICOS(\" BAS126\";TABLAS!$A$97)",null,121,122,123,124,125,126,null,{"$f":"+AG41+1","v":121},{"$f":"+AB42+1","v":122},123,124,125,126]
[22,null,"Obesidad",36,96,{"$f":"+GETPIVOTDATA(\" BAS127\",TABLAS!$A$59)","v":22},{"$f":"+GETPIVOTDATA(\" BAS128\",TABLAS!$A$59)","v":48},{"$f":"+GETPIVOTDATA(\" BAS129\",TABLAS!$A$59)","v":6},{"$f":"+GETPIVOTDATA(\" BAS130\",TABLAS!$A$59)","v":34},{"$f":"+GETPIVOTDATA(\" BAS131\",TABLAS!$A$59)","v":8},{"$f":"+GETPIVOTDATA(\" BAS132\",TABLAS!$A$59)","v":14},null,null,"=+IMPORTARDATOSDINAMICOS(\" BAS127\";TABLAS!$A$97)","=+IMPORTARDATOSDINAMICOS(\" BAS128\";TABLAS!$A$97)","=+IMPORTARDATOSDINAMICOS(\" BAS129\";TABLAS!$A$97)","=+IMPORTARDATOSDINAMICOS(\" BAS130\";TABLAS!$A$97)","=+IMPORTARDATOSDINAMICOS(\" BAS131\";TABLAS!$A$97)","=+IMPORTARDATOSDINAMICOS(\" BAS132\";TABLAS!$A$97)",null,127,128,129,130,131,132,null,{"$f":"+AG42+1","v":127},{"$f":"+AB43+1","v":128},129,130,131,132]
[null,null,"Evaluación del Perímetro Abdominal"]
[23,"PAB","Riesgo Bajo",{"$f":"F45+H45+J45","v":138},101,{"$f":"+GETPIVOTDATA(\" BAS133\",TABLAS!$A$59)","v":51},{"$f":"+GETPIVOTDATA(\" BAS134\",TABLAS!$A$59)","v":40},{"$f":"+GETPIVOTDATA(\" BAS135\",TABLAS!$A$59)","v":53},{"$f":"+GETPIVOTDATA(\" BAS136\",TABLAS!$A$59)","v":39},{"$f":"+GETPIVOTDATA(\" BAS137\",TABLAS!$A$59)","v":34},{"$f":"+GETPIVOTDATA(\" BAS138\",TABLAS!$A$59)","v":22},null,null,{"$f":"CONCATENATE($N$13,U45,$N$14)","v":"=+IMPORTARDATOSDINAMICOS(\" BAS133\";TABLAS!$A$97)"},"=+IMPORTARDATOSDINAMICOS(\" BAS134\";TABLAS!$A$97)","=+IMPORTARDATOSDINAMICOS(\" BAS135\";TABLAS!$A$97)","=+IMPORTARDATOSDINAMICOS(\" BAS136\";TABLAS!$A$97)","=+IMPORTARDATOSDINAMICOS(\" BAS137\";TABLAS!$A$97)","=+IMPORTARDATOSDINAMICOS(\" BAS138\";TABLAS!$A$97)",null,{"$f":"IF(AB45<10,CONCATENATE(\"00\",AB45),IF(AND(AB45<100,AB45>9),CONCATENATE(\"0\",AB45),AB45))","v":133},134,135,136,137,138,null,{"$f":"+AG43+1","v":133},{"$f":"+AB45+1","v":134},135,136,137,138]
[24,null,"Riesgo Alto",70,57,{"$f":"+GETPIVOTDATA(\" BAS139\",TABLAS!$A$59)","v":39},{"$f":"+GETPIVOTDATA(\" BAS140\",TABLAS!$A$59)","v":24},{"$f":"+GETPIVOTDATA(\" BAS141\",TABLAS!$A$59)","v":18},{"$f":"+GETPIVOTDATA(\" BAS142\",TABLAS!$A$59)","v":24},{"$f":"+GETPIVOTDATA(\" BAS143\",TABLAS!$A$59)","v":13},{"$f":"+GETPIVOTDATA(\" BAS144\",TABLAS!$A$59)","v":9},null,null,{"$f":"CONCATENATE($N$13,U46,$N$14)","v":"=+IMPORTARDATOSDINAMICOS(\" BAS139\";TABLAS!$A$97)"},{"$f":"CONCATENATE($N$13,V46,$N$14)","v":"=+IMPORTARDATOSDINAMICOS(\" BAS140\";TABLAS!$A$97)"},{"$f":"CONCATENATE($N$13,W46,$N$14)","v":"=+IMPORTARDATOSDINAMICOS(\" BAS141\";TABLAS!$A$97)"},{"$f":"CONCATENATE($N$13,X46,$N$14)","v":"=+IMPORTARDATOSDINAMICOS(\" BAS142\";TABLAS!$A$97)"},{"$f":"CONCATENATE($N$13,Y46,$N$14)","v":"=+IMPORTARDATOSDINAMICOS(\" BAS143\";TABLAS!$A$97)"},{"$f":"CONCATENATE($N$13,Z46,$N$14)","v":"=+IMPORTARDATOSDINAMICOS(\" BAS144\";TABLAS!$A$97)"},null,{"$f":"IF(AB46<10,CONCATENATE(\"00\",AB46),IF(AND(AB46<100,AB46>9),CONCATENATE(\"0\",AB46),AB46))","v":139},{"$f":"IF(AC46<10,CONCATENATE(\"00\",AC46),IF(AND(AC46<100,AC46>9),CONCATENATE(\"0\",AC46),AC46))","v":140},{"$f":"IF(AD46<10,CONCATENATE(\"00\",AD46),IF(AND(AD46<100,AD46>9),CONCATENATE(\"0\",AD46),AD46))","v":141},{"$f":"IF(AE46<10,CONCATENATE(\"00\",AE46),IF(AND(AE46<100,AE46>9),CONCATENATE(\"0\",AE46),AE46))","v":142},{"$f":"IF(AF46<10,CONCATENATE(\"00\",AF46),IF(AND(AF46<100,AF46>9),CONCATENATE(\"0\",AF46),AF46))","v":143},{"$f":"IF(AG46<10,CONCATENATE(\"00\",AG46),IF(AND(AG46<100,AG46>9),CONCATENATE(\"0\",AG46),AG46))","v":144},null,{"$f":"+AG45+1","v":139},{"$f":"+AB46+1","v":140},141,142,143,144]
[25,null,"Riesgo Muy Alto",63,178,{"$f":"+GETPIVOTDATA(\" BAS145\",TABLAS!$A$59)","v":36},{"$f":"+GETPIVOTDATA(\" BAS146\",TABLAS!$A$59)","v":92},{"$f":"+GETPIVOTDATA(\" BAS147\",TABLAS!$A$59)","v":21},{"$f":"+GETPIVOTDATA(\" BAS148\",TABLAS!$A$59)","v":63},{"$f":"+GETPIVOTDATA(\" BAS149\",TABLAS!$A$59)","v":6},{"$f":"+GETPIVOTDATA(\" BAS150\",TABLAS!$A$59)","v":23},null,null,"=+IMPORTARDATOSDINAMICOS(\" BAS145\";TABLAS!$A$97)","=+IMPORTARDATOSDINAMICOS(\" BAS146\";TABLAS!$A$97)","=+IMPORTARDATOSDINAMICOS(\" BAS147\";TABLAS!$A$97)","=+IMPORTARDATOSDINAMICOS(\" BAS148\";TABLAS!$A$97)","=+IMPORTARDATOSDINAMICOS(\" BAS149\";TABLAS!$A$97)","=+IMPORTARDATOSDINAMICOS(\" BAS150\";TABLAS!$A$97)",null,145,146,147,148,149,150,null,{"$f":"+AG46+1","v":145},{"$f":"+AB47+1","v":146},147,148,149,150]
[null,null,"Mini Valoración Nutricional"]
[26,"MVN","Bien Nutridos",{"$f":"F49+H49+J49","v":1},1,{"$f":"+GETPIVOTDATA(\" BAS151\",TABLAS!$A$59)","v":1},{"$f":"+GETPIVOTDATA(\" BAS152\",TABLAS!$A$59)","v":0},{"$f":"+GETPIVOTDATA(\" BAS153\",TABLAS!$A$59)","v":0},{"$f":"+GETPIVOTDATA(\" BAS154\",TABLAS!$A$59)","v":1},{"$f":"+GETPIVOTDATA(\" BAS155\",TABLAS!$A$59)","v":0},{"$f":"+GETPIVOTDATA(\" BAS156\",TABLAS!$A$59)","v":0},null,null,{"$f":"CONCATENATE($N$13,U49,$N$14)","v":"=+IMPORTARDATOSDINAMICOS(\" BAS151\";TABLAS!$A$97)"},{"$f":"CONCATENATE($N$13,V49,$N$14)","v":"=+IMPORTARDATOSDINAMICOS(\" BAS152\";TABLAS!$A$97)"},{"$f":"CONCATENATE($N$13,W49,$N$14)","v":"=+IMPORTARDATOSDINAMICOS(\" BAS153\";TABLAS!$A$97)"},{"$f":"CONCATENATE($N$13,X49,$N$14)","v":"=+IMPORTARDATOSDINAMICOS(\" BAS154\";TABLAS!$A$97)"},{"$f":"CONCATENATE($N$13,Y49,$N$14)","v":"=+IMPORTARDATOSDINAMICOS(\" BAS155\";TABLAS!$A$97)"},{"$f":"CONCATENATE($N$13,Z49,$N$14)","v":"=+IMPORTARDATOSDINAMICOS(\" BAS156\";TABLAS!$A$97)"},null,{"$f":"IF(AB49<10,CONCATENATE(\"00\",AB49),IF(AND(AB49<100,AB49>9),CONCATENATE(\"0\",AB49),AB49))","v":151},{"$f":"IF(AC49<10,CONCATENATE(\"00\",AC49),IF(AND(AC49<100,AC49>9),CONCATENATE(\"0\",AC49),AC49))","v":152},{"$f":"IF(AD49<10,CONCATENATE(\"00\",AD49),IF(AND(AD49<100,AD49>9),CONCATENATE(\"0\",AD49),AD49))","v":153},{"$f":"IF(AE49<10,CONCATENATE(\"00\",AE49),IF(AND(AE49<100,AE49>9),CONCATENATE(\"0\",AE49),AE49))","v":154},{"$f":"IF(AF49<10,CONCATENATE(\"00\",AF49),IF(AND(AF49<100,AF49>9),CONCATENATE(\"0\",AF49),AF49))","v":155},{"$f":"IF(AG49<10,CONCATENATE(\"00\",AG49),IF(AND(AG49<100,AG49>9),CONCATENATE(\"0\",AG49),AG49))","v":156},null,{"$f":"+AG47+1","v":151},{"$f":"+AB49+1","v":152},{"$f":"+AC49+1","v":153},{"$f":"+AD49+1","v":154},{"$f":"+AE49+1","v":155},{"$f":"+AF49+1","v":156}]
[27,null,"Riesgo de Desnutrición",0,0,{"$f":"+GETPIVOTDATA(\" BAS157\",TABLAS!$A$59)","v":0},{"$f":"+GETPIVOTDATA(\" BAS158\",TABLAS!$A$59)","v":0},{"$f":"+GETPIVOTDATA(\" BAS159\",TABLAS!$A$59)","v":0},{"$f":"+GETPIVOTDATA(\" BAS160\",TABLAS!$A$59)","v":0},{"$f":"+GETPIVOTDATA(\" BAS161\",TABLAS!$A$59)","v":0},{"$f":"+GETPIVOTDATA(\" BAS162\",TABLAS!$A$59)","v":0},null,null,{"$f":"CONCATENATE($N$13,U50,$N$14)","v":"=+IMPORTARDATOSDINAMICOS(\" BAS157\";TABLAS!$A$97)"},{"$f":"CONCATENATE($N$13,V50,$N$14)","v":"=+IMPORTARDATOSDINAMICOS(\" BAS158\";TABLAS!$A$97)"},{"$f":"CONCATENATE($N$13,W50,$N$14)","v":"=+IMPORTARDATOSDINAMICOS(\" BAS159\";TABLAS!$A$97)"},{"$f":"CONCATENATE($N$13,X50,$N$14)","v":"=+IMPORTARDATOSDINAMICOS(\" BAS160\";TABLAS!$A$97)"},{"$f":"CONCATENATE($N$13,Y50,$N$14)","v":"=+IMPORTARDATOSDINAMICOS(\" BAS161\";TABLAS!$A$97)"},{"$f":"CONCATENATE($N$13,Z50,$N$14)","v":"=+IMPORTARDATOSDINAMICOS(\" BAS162\";TABLAS!$A$97)"},null,{"$f":"IF(AB50<10,CONCATENATE(\"00\",AB50),IF(AND(AB50<100,AB50>9),CONCATENATE(\"0\",AB50),AB50))","v":157},{"$f":"IF(AC50<10,CONCATENATE(\"00\",AC50),IF(AND(AC50<100,AC50>9),CONCATENATE(\"0\",AC50),AC50))","v":158},{"$f":"IF(AD50<10,CONCATENATE(\"00\",AD50),IF(AND(AD50<100,AD50>9),CONCATENATE(\"0\",AD50),AD50))","v":159},{"$f":"IF(AE50<10,CONCATENATE(\"00\",AE50),IF(AND(AE50<100,AE50>9),CONCATENATE(\"0\",AE50),AE50))","v":160},{"$f":"IF(AF50<10,CONCATENATE(\"00\",AF50),IF(AND(AF50<100,AF50>9),CONCATENATE(\"0\",AF50),AF50))","v":161},{"$f":"IF(AG50<10,CONCATENATE(\"00\",AG50),IF(AND(AG50<100,AG50>9),CONCATENATE(\"0\",AG50),AG50))","v":162},null,{"$f":"+AG49+1","v":157},{"$f":"+AB50+1","v":158},159,160,161,162]
[28,null,"Desnutrido",0,0,{"$f":"+GETPIVOTDATA(\" BAS163\",TABLAS!$A$59)","v":0},{"$f":"+GETPIVOTDATA(\" BAS164\",TABLAS!$A$59)","v":0},{"$f":"+GETPIVOTDATA(\" BAS165\",TABLAS!$A$59)","v":0},{"$f":"+GETPIVOTDATA(\" BAS166\",TABLAS!$A$59)","v":0},{"$f":"+GETPIVOTDATA(\" BAS167\",TABLAS!$A$59)","v":0},{"$f":"+GETPIVOTDATA(\" BAS168\",TABLAS!$A$59)","v":0},null,null,"=+IMPORTARDATOSDINAMICOS(\" BAS163\";TABLAS!$A$97)","=+IMPORTARDATOSDINAMICOS(\" BAS164\";TABLAS!$A$97)","=+IMPORTARDATOSDINAMICOS(\" BAS165\";TABLAS!$A$97)","=+IMPORTARDATOSDINAMICOS(\" BAS166\";TABLAS!$A$97)","=+IMPORTARDATOSDINAMICOS(\" BAS167\";TABLAS!$A$97)","=+IMPORTARDATOSDINAMICOS(\" BAS168\";TABLAS!$A$97)",null,163,164,165,166,167,168,null,{"$f":"+AG50+1","v":163},{"$f":"+AB51+1","v":164},165,166,167,168]
[null,null,"Atención en Nutrición"]
[29,null,"1º Atención",{"$f":"F53+H53+J53","v":283},356,{"$f":"+GETPIVOTDATA(\" BAS169\",TABLAS!$A$59)","v":145},{"$f":"+GETPIVOTDATA(\" BAS170\",TABLAS!$A$59)","v":167},{"$f":"+GETPIVOTDATA(\" BAS171\",TABLAS!$A$59)","v":85},{"$f":"+GETPIVOTDATA(\" BAS172\",TABLAS!$A$59)","v":131},{"$f":"+GETPIVOTDATA(\" BAS173\",TABLAS!$A$59)","v":53},{"$f":"+GETPIVOTDATA(\" BAS174\",TABLAS!$A$59)","v":58},null,null,{"$f":"CONCATENATE($N$13,U53,$N$14)","v":"=+IMPORTARDATOSDINAMICOS(\" BAS169\";TABLAS!$A$97)"},"=+IMPORTARDATOSDINAMICOS(\" BAS170\";TABLAS!$A$97)","=+IMPORTARDATOSDINAMICOS(\" BAS171\";TABLAS!$A$97)","=+IMPORTARDATOSDINAMICOS(\" BAS172\";TABLAS!$A$97)","=+IMPORTARDATOSDINAMICOS(\" BAS173\";TABLAS!$A$97)","=+IMPORTARDATOSDINAMICOS(\" BAS174\";TABLAS!$A$97)",null,{"$f":"IF(AB53<10,CONCATENATE(\"00\",AB53),IF(AND(AB53<100,AB53>9),CONCATENATE(\"0\",AB53),AB53))","v":169},170,171,172,173,174,null,{"$f":"+AG51+1","v":169},{"$f":"+AB53+1","v":170},171,172,173,174]
[30,null,"2º Atención",35,55,{"$f":"+GETPIVOTDATA(\" BAS175\",TABLAS!$A$59)","v":11},{"$f":"+GETPIVOTDATA(\" BAS176\",TABLAS!$A$59)","v":25},{"$f":"+GETPIVOTDATA(\" BAS177\",TABLAS!$A$59)","v":15},{"$f":"+GETPIVOTDATA(\" BAS178\",TABLAS!$A$59)","v":20},{"$f":"+GETPIVOTDATA(\" BAS179\",TABLAS!$A$59)","v":9},{"$f":"+GETPIVOTDATA(\" BAS180\",TABLAS!$A$59)","v":10},null,null,{"$f":"CONCATENATE($N$13,U54,$N$14)","v":"=+IMPORTARDATOSDINAMICOS(\" BAS175\";TABLAS!$A$97)"},{"$f":"CONCATENATE($N$13,V54,$N$14)","v":"=+IMPORTARDATOSDINAMICOS(\" BAS176\";TABLAS!$A$97)"},{"$f":"CONCATENATE($N$13,W54,$N$14)","v":"=+IMPORTARDATOSDINAMICOS(\" BAS177\";TABLAS!$A$97)"},{"$f":"CONCATENATE($N$13,X54,$N$14)","v":"=+IMPORTARDATOSDINAMICOS(\" BAS178\";TABLAS!$A$97)"},{"$f":"CONCATENATE($N$13,Y54,$N$14)","v":"=+IMPORTARDATOSDINAMICOS(\" BAS179\";TABLAS!$A$97)"},{"$f":"CONCATENATE($N$13,Z54,$N$14)","v":"=+IMPORTARDATOSDINAMICOS(\" BAS180\";TABLAS!$A$97)"},null,{"$f":"IF(AB54<10,CONCATENATE(\"00\",AB54),IF(AND(AB54<100,AB54>9),CONCATENATE(\"0\",AB54),AB54))","v":175},{"$f":"IF(AC54<10,CONCATENATE(\"00\",AC54),IF(AND(AC54<100,AC54>9),CONCATENATE(\"0\",AC54),AC54))","v":176},{"$f":"IF(AD54<10,CONCATENATE(\"00\",AD54),IF(AND(AD54<100,AD54>9),CONCATENATE(\"0\",AD54),AD54))","v":177},{"$f":"IF(AE54<10,CONCATENATE(\"00\",AE54),IF(AND(AE54<100,AE54>9),CONCATENATE(\"0\",AE54),AE54))","v":178},{"$f":"IF(AF54<10,CONCATENATE(\"00\",AF54),IF(AND(AF54<100,AF54>9),CONCATENATE(\"0\",AF54),AF54))","v":179},{"$f":"IF(AG54<10,CONCATENATE(\"00\",AG54),IF(AND(AG54<100,AG54>9),CONCATENATE(\"0\",AG54),AG54))","v":180},null,{"$f":"+AG53+1","v":175},{"$f":"+AB54+1","v":176},177,178,179,180]
[31,null,"3º Atención",12,11,{"$f":"+GETPIVOTDATA(\" BAS181\",TABLAS!$A$59)","v":2},{"$f":"+GETPIVOTDATA(\" BAS182\",TABLAS!$A$59)","v":6},{"$f":"+GETPIVOTDATA(\" BAS183\",TABLAS!$A$59)","v":3},{"$f":"+GETPIVOTDATA(\" BAS184\",TABLAS!$A$59)","v":5},{"$f":"+GETPIVOTDATA(\" BAS185\",TABLAS!$A$59)","v":7},{"$f":"+GETPIVOTDATA(\" BAS186\",TABLAS!$A$59)","v":0},null,null,"=+IMPORTARDATOSDINAMICOS(\" BAS181\";TABLAS!$A$97)","=+IMPORTARDATOSDINAMICOS(\" BAS182\";TABLAS!$A$97)","=+IMPORTARDATOSDINAMICOS(\" BAS183\";TABLAS!$A$97)","=+IMPORTARDATOSDINAMICOS(\" BAS184\";TABLAS!$A$97)","=+IMPORTARDATOSDINAMICOS(\" BAS185\";TABLAS!$A$97)","=+IMPORTARDATOSDINAMICOS(\" BAS186\";TABLAS!$A$97)",null,181,182,183,184,185,186,null,{"$f":"+AG54+1","v":181},{"$f":"+AB55+1","v":182},183,184,185,186]
[32,null,"4º a + Atenciones",7,7,{"$f":"+GETPIVOTDATA(\" BAS187\",TABLAS!$A$59)","v":2},{"$f":"+GETPIVOTDATA(\" BAS188\",TABLAS!$A$59)","v":6},{"$f":"+GETPIVOTDATA(\" BAS189\",TABLAS!$A$59)","v":2},{"$f":"+GETPIVOTDATA(\" BAS190\",TABLAS!$A$59)","v":0},{"$f":"+GETPIVOTDATA(\" BAS191\",TABLAS!$A$59)","v":3},{"$f":"+GETPIVOTDATA(\" BAS192\",TABLAS!$A$59)","v":1},null,null,"=+IMPORTARDATOSDINAMICOS(\" BAS187\";TABLAS!$A$97)","=+IMPORTARDATOSDINAMICOS(\" BAS188\";TABLAS!$A$97)","=+IMPORTARDATOSDINAMICOS(\" BAS189\";TABLAS!$A$97)","=+IMPORTARDATOSDINAMICOS(\" BAS190\";TABLAS!$A$97)","=+IMPORTARDATOSDINAMICOS(\" BAS191\";TABLAS!$A$97)","=+IMPORTARDATOSDINAMICOS(\" BAS192\";TABLAS!$A$97)",null,187,188,189,190,191,192,null,{"$f":"+AG55+1","v":187},{"$f":"+AB56+1","v":188},189,190,191,192]
[null,null,"Indicación Nutricional"]
[33,null,"Recomendación Nutricional",{"$f":"F58+H58+J58","v":12},14,{"$f":"+GETPIVOTDATA(\" BAS193\",TABLAS!$A$59)","v":7},{"$f":"+GETPIVOTDATA(\" BAS194\",TABLAS!$A$59)","v":5},{"$f":"+GETPIVOTDATA(\" BAS195\",TABLAS!$A$59)","v":4},{"$f":"+GETPIVOTDATA(\" BAS196\",TABLAS!$A$59)","v":4},{"$f":"+GETPIVOTDATA(\" BAS197\",TABLAS!$A$59)","v":1},{"$f":"+GETPIVOTDATA(\" BAS198\",TABLAS!$A$59)","v":5},null,null,{"$f":"CONCATENATE($N$13,U58,$N$14)","v":"=+IMPORTARDATOSDINAMICOS(\" BAS193\";TABLAS!$A$97)"},{"$f":"CONCATENATE($N$13,V58,$N$14)","v":"=+IMPORTARDATOSDINAMICOS(\" BAS194\";TABLAS!$A$97)"},{"$f":"CONCATENATE($N$13,W58,$N$14)","v":"=+IMPORTARDATOSDINAMICOS(\" BAS195\";TABLAS!$A$97)"},{"$f":"CONCATENATE($N$13,X58,$N$14)","v":"=+IMPORTARDATOSDINAMICOS(\" BAS196\";TABLAS!$A$97)"},{"$f":"CONCATENATE($N$13,Y58,$N$14)","v":"=+IMPORTARDATOSDINAMICOS(\" BAS197\";TABLAS!$A$97)"},{"$f":"CONCATENATE($N$13,Z58,$N$14)","v":"=+IMPORTARDATOSDINAMICOS(\" BAS198\";TABLAS!$A$97)"},null,{"$f":"IF(AB58<10,CONCATENATE(\"00\",AB58),IF(AND(AB58<100,AB58>9),CONCATENATE(\"0\",AB58),AB58))","v":193},{"$f":"IF(AC58<10,CONCATENATE(\"00\",AC58),IF(AND(AC58<100,AC58>9),CONCATENATE(\"0\",AC58),AC58))","v":194},{"$f":"IF(AD58<10,CONCATENATE(\"00\",AD58),IF(AND(AD58<100,AD58>9),CONCATENATE(\"0\",AD58),AD58))","v":195},{"$f":"IF(AE58<10,CONCATENATE(\"00\",AE58),IF(AND(AE58<100,AE58>9),CONCATENATE(\"0\",AE58),AE58))","v":196},{"$f":"IF(AF58<10,CONCATENATE(\"00\",AF58),IF(AND(AF58<100,AF58>9),CONCATENATE(\"0\",AF58),AF58))","v":197},{"$f":"IF(AG58<10,CONCATENATE(\"00\",AG58),IF(AND(AG58<100,AG58>9),CONCATENATE(\"0\",AG58),AG58))","v":198},null,{"$f":"+AG56+1","v":193},{"$f":"+AB58+1","v":194},{"$f":"+AC58+1","v":195},{"$f":"+AD58+1","v":196},{"$f":"+AE58+1","v":197},{"$f":"+AF58+1","v":198}]
[34,null,"Prescripción Nutrioterapéutica",17,21,{"$f":"+GETPIVOTDATA(\" BAS199\",TABLAS!$A$59)","v":5},{"$f":"+GETPIVOTDATA(\" BAS200\",TABLAS!$A$59)","v":3},{"$f":"+GETPIVOTDATA(\" BAS201\",TABLAS!$A$59)","v":6},{"$f":"+GETPIVOTDATA(\" BAS202\",TABLAS!$A$59)","v":7},{"$f":"+GETPIVOTDATA(\" BAS203\",TABLAS!$A$59)","v":6},{"$f":"+GETPIVOTDATA(\" BAS204\",TABLAS!$A$59)","v":11},null,null,{"$f":"CONCATENATE($N$13,U59,$N$14)","v":"=+IMPORTARDATOSDINAMICOS(\" BAS199\";TABLAS!$A$97)"},{"$f":"CONCATENATE($N$13,V59,$N$14)","v":"=+IMPORTARDATOSDINAMICOS(\" BAS200\";TABLAS!$A$97)"},{"$f":"CONCATENATE($N$13,W59,$N$14)","v":"=+IMPORTARDATOSDINAMICOS(\" BAS201\";TABLAS!$A$97)"},{"$f":"CONCATENATE($N$13,X59,$N$14)","v":"=+IMPORTARDATOSDINAMICOS(\" BAS202\";TABLAS!$A$97)"},{"$f":"CONCATENATE($N$13,Y59,$N$14)","v":"=+IMPORTARDATOSDINAMICOS(\" BAS203\";TABLAS!$A$97)"},{"$f":"CONCATENATE($N$13,Z59,$N$14)","v":"=+IMPORTARDATOSDINAMICOS(\" BAS204\";TABLAS!$A$97)"},null,{"$f":"IF(AB59<10,CONCATENATE(\"00\",AB59),IF(AND(AB59<100,AB59>9),CONCATENATE(\"0\",AB59),AB59))","v":199},{"$f":"IF(AC59<10,CONCATENATE(\"00\",AC59),IF(AND(AC59<100,AC59>9),CONCATENATE(\"0\",AC59),AC59))","v":200},{"$f":"IF(AD59<10,CONCATENATE(\"00\",AD59),IF(AND(AD59<100,AD59>9),CONCATENATE(\"0\",AD59),AD59))","v":201},{"$f":"IF(AE59<10,CONCATENATE(\"00\",AE59),IF(AND(AE59<100,AE59>9),CONCATENATE(\"0\",AE59),AE59))","v":202},{"$f":"IF(AF59<10,CONCATENATE(\"00\",AF59),IF(AND(AF59<100,AF59>9),CONCATENATE(\"0\",AF59),AF59))","v":203},{"$f":"IF(AG59<10,CONCATENATE(\"00\",AG59),IF(AND(AG59<100,AG59>9),CONCATENATE(\"0\",AG59),AG59))","v":204},null,{"$f":"+AG58+1","v":199},{"$f":"+AB59+1","v":200},201,202,203,204]
[35,null,"Recomendación Dietética",1,0,{"$f":"+GETPIVOTDATA(\" BAS205\",TABLAS!$A$59)","v":0},{"$f":"+GETPIVOTDATA(\" BAS206\",TABLAS!$A$59)","v":0},{"$f":"+GETPIVOTDATA(\" BAS207\",TABLAS!$A$59)","v":1},{"$f":"+GETPIVOTDATA(\" BAS208\",TABLAS!$A$59)","v":0},{"$f":"+GETPIVOTDATA(\" BAS209\",TABLAS!$A$59)","v":0},{"$f":"+GETPIVOTDATA(\" BAS210\",TABLAS!$A$59)","v":0},null,null,"=+IMPORTARDATOSDINAMICOS(\" BAS205\";TABLAS!$A$97)","=+IMPORTARDATOSDINAMICOS(\" BAS206\";TABLAS!$A$97)","=+IMPORTARDATOSDINAMICOS(\" BAS207\";TABLAS!$A$97)","=+IMPORTARDATOSDINAMICOS(\" BAS208\";TABLAS!$A$97)","=+IMPORTARDATOSDINAMICOS(\" BAS209\";TABLAS!$A$97)","=+IMPORTARDATOSDINAMICOS(\" BAS210\";TABLAS!$A$97)",null,205,206,207,208,209,210,null,{"$f":"+AG59+1","v":205},{"$f":"+AB60+1","v":206},207,208,209,210]
[36,null,"Prescripción Dietoterapéutica",149,220,{"$f":"+GETPIVOTDATA(\" BAS211\",TABLAS!$A$59)","v":76},{"$f":"+GETPIVOTDATA(\" BAS212\",TABLAS!$A$59)","v":107},{"$f":"+GETPIVOTDATA(\" BAS213\",TABLAS!$A$59)","v":44},{"$f":"+GETPIVOTDATA(\" BAS214\",TABLAS!$A$59)","v":86},{"$f":"+GETPIVOTDATA(\" BAS215\",TABLAS!$A$59)","v":29},{"$f":"+GETPIVOTDATA(\" BAS216\",TABLAS!$A$59)","v":27},null,null,"=+IMPORTARDATOSDINAMICOS(\" BAS211\";TABLAS!$A$97)","=+IMPORTARDATOSDINAMICOS(\" BAS212\";TABLAS!$A$97)","=+IMPORTARDATOSDINAMICOS(\" BAS213\";TABLAS!$A$97)","=+IMPORTARDATOSDINAMICOS(\" BAS214\";TABLAS!$A$97)","=+IMPORTARDATOSDINAMICOS(\" BAS215\";TABLAS!$A$97)","=+IMPORTARDATOSDINAMICOS(\" BAS216\";TABLAS!$A$97)",null,211,212,213,214,215,216,null,{"$f":"+AG60+1","v":211},{"$f":"+AB61+1","v":212},213,214,215,216]
[null,"CONSEJERÍAS TRAMA_BASE_AMAYOR_RPT_05_CONSEJERIA_CONSOLIDADO"]
[37,"Total","Nutricionales",{"$f":"F63+H63+J63","v":95},94,{"$f":"+GETPIVOTDATA(\" BAS001\",TABLAS!$A$97)","v":45},{"$f":"+GETPIVOTDATA(\" BAS002\",TABLAS!$A$97)","v":44},{"$f":"+GETPIVOTDATA(\" BAS003\",TABLAS!$A$97)","v":30},{"$f":"+GETPIVOTDATA(\" BAS004\",TABLAS!$A$97)","v":31},{"$f":"+GETPIVOTDATA(\" BAS005\",TABLAS!$A$97)","v":20},{"$f":"+GETPIVOTDATA(\" BAS006\",TABLAS!$A$97)","v":19},null,null,{"$f":"CONCATENATE($N$13,U63,$N$14)","v":"=+IMPORTARDATOSDINAMICOS(\" BAS001\";TABLAS!$A$97)"},{"$f":"CONCATENATE($N$13,V63,$N$14)","v":"=+IMPORTARDATOSDINAMICOS(\" BAS002\";TABLAS!$A$97)"},"=+IMPORTARDATOSDINAMICOS(\" BAS003\";TABLAS!$A$97)","=+IMPORTARDATOSDINAMICOS(\" BAS004\";TABLAS!$A$97)","=+IMPORTARDATOSDINAMICOS(\" BAS005\";TABLAS!$A$97)","=+IMPORTARDATOSDINAMICOS(\" BAS006\";TABLAS!$A$97)",null,{"$f":"IF(AB63<10,CONCATENATE(\"00\",AB63),IF(AND(AB63<100,AB63>9),CONCATENATE(\"0\",AB63),AB63))","v":"001"},{"$f":"IF(AC63<10,CONCATENATE(\"00\",AC63),IF(AND(AC63<100,AC63>9),CONCATENATE(\"0\",AC63),AC63))","v":"002"},"003","004","005","006",null,1,{"$f":"+AB63+1","v":2},3,4,{"$f":"+AE63+1","v":5},6]
[38,null,"Integrales",866,1143,{"$f":"+GETPIVOTDATA(\" BAS007\",TABLAS!$A$97)","v":403},{"$f":"+GETPIVOTDATA(\" BAS008\",TABLAS!$A$97)","v":538},{"$f":"+GETPIVOTDATA(\" BAS009\",TABLAS!$A$97)","v":292},{"$f":"+GETPIVOTDATA(\" BAS010\",TABLAS!$A$97)","v":406},{"$f":"+GETPIVOTDATA(\" BAS011\",TABLAS!$A$97)","v":171},{"$f":"+GETPIVOTDATA(\" BAS012\",TABLAS!$A$97)","v":199},null,null,{"$f":"CONCATENATE($N$13,U64,$N$14)","v":"=+IMPORTARDATOSDINAMICOS(\" BAS007\";TABLAS!$A$97)"},{"$f":"CONCATENATE($N$13,V64,$N$14)","v":"=+IMPORTARDATOSDINAMICOS(\" BAS008\";TABLAS!$A$97)"},{"$f":"CONCATENATE($N$13,W64,$N$14)","v":"=+IMPORTARDATOSDINAMICOS(\" BAS009\";TABLAS!$A$97)"},{"$f":"CONCATENATE($N$13,X64,$N$14)","v":"=+IMPORTARDATOSDINAMICOS(\" BAS010\";TABLAS!$A$97)"},{"$f":"CONCATENATE($N$13,Y64,$N$14)","v":"=+IMPORTARDATOSDINAMICOS(\" BAS011\";TABLAS!$A$97)"},{"$f":"CONCATENATE($N$13,Z64,$N$14)","v":"=+IMPORTARDATOSDINAMICOS(\" BAS012\";TABLAS!$A$97)"},null,{"$f":"IF(AB64<10,CONCATENATE(\"00\",AB64),IF(AND(AB64<100,AB64>9),CONCATENATE(\"0\",AB64),AB64))","v":"007"},{"$f":"IF(AC64<10,CONCATENATE(\"00\",AC64),IF(AND(AC64<100,AC64>9),CONCATENATE(\"0\",AC64),AC64))","v":"008"},{"$f":"IF(AD64<10,CONCATENATE(\"00\",AD64),IF(AND(AD64<100,AD64>9),CONCATENATE(\"0\",AD64),AD64))","v":"009"},{"$f":"IF(AE64<10,CONCATENATE(\"00\",AE64),IF(AND(AE64<100,AE64>9),CONCATENATE(\"0\",AE64),AE64))","v":"010"},{"$f":"IF(AF64<10,CONCATENATE(\"00\",AF64),IF(AND(AF64<100,AF64>9),CONCATENATE(\"0\",AF64),AF64))","v":"011"},{"$f":"IF(AG64<10,CONCATENATE(\"00\",AG64),IF(AND(AG64<100,AG64>9),CONCATENATE(\"0\",AG64),AG64))","v":"012"},null,{"$f":"+AG63+1","v":7},8,9,10,{"$f":"+AE64+1","v":11},12]
[39,null,"Salud Mental",9,6,{"$f":"+GETPIVOTDATA(\" BAS013\",TABLAS!$A$97)","v":3},{"$f":"+GETPIVOTDATA(\" BAS014\",TABLAS!$A$97)","v":3},{"$f":"+GETPIVOTDATA(\" BAS015\",TABLAS!$A$97)","v":2},{"$f":"+GETPIVOTDATA(\" BAS016\",TABLAS!$A$97)","v":2},{"$f":"+GETPIVOTDATA(\" BAS017\",TABLAS!$A$97)","v":4},{"$f":"+GETPIVOTDATA(\" BAS018\",TABLAS!$A$97)","v":1},null,null,{"$f":"CONCATENATE($N$13,U65,$N$14)","v":"=+IMPORTARDATOSDINAMICOS(\" BAS013\";TABLAS!$A$97)"},{"$f":"CONCATENATE($N$13,V65,$N$14)","v":"=+IMPORTARDATOSDINAMICOS(\" BAS014\";TABLAS!$A$97)"},{"$f":"CONCATENATE($N$13,W65,$N$14)","v":"=+IMPORTARDATOSDINAMICOS(\" BAS015\";TABLAS!$A$97)"},{"$f":"CONCATENATE($N$13,X65,$N$14)","v":"=+IMPORTARDATOSDINAMICOS(\" BAS016\";TABLAS!$A$97)"},{"$f":"CONCATENATE($N$13,Y65,$N$14)","v":"=+IMPORTARDATOSDINAMICOS(\" BAS017\";TABLAS!$A$97)"},{"$f":"CONCATENATE($N$13,Z65,$N$14)","v":"=+IMPORTARDATOSDINAMICOS(\" BAS018\";TABLAS!$A$97)"},null,{"$f":"IF(AB65<10,CONCATENATE(\"00\",AB65),IF(AND(AB65<100,AB65>9),CONCATENATE(\"0\",AB65),AB65))","v":"013"},{"$f":"IF(AC65<10,CONCATENATE(\"00\",AC65),IF(AND(AC65<100,AC65>9),CONCATENATE(\"0\",AC65),AC65))","v":"014"},{"$f":"IF(AD65<10,CONCATENATE(\"00\",AD65),IF(AND(AD65<100,AD65>9),CONCATENATE(\"0\",AD65),AD65))","v":"015"},{"$f":"IF(AE65<10,CONCATENATE(\"00\",AE65),IF(AND(AE65<100,AE65>9),CONCATENATE(\"0\",AE65),AE65))","v":"016"},{"$f":"IF(AF65<10,CONCATENATE(\"00\",AF65),IF(AND(AF65<100,AF65>9),CONCATENATE(\"0\",AF65),AF65))","v":"017"},{"$f":"IF(AG65<10,CONCATENATE(\"00\",AG65),IF(AND(AG65<100,AG65>9),CONCATENATE(\"0\",AG65),AG65))","v":"018"},null,{"$f":"+AG64+1","v":13},{"$f":"+AB65+1","v":14},15,16,17,18]
[40,null,"Prevención de Cáncer",0,0,{"$f":"+GETPIVOTDATA(\" BAS019\",TABLAS!$A$97)","v":0},{"$f":"+GETPIVOTDATA(\" BAS020\",TABLAS!$A$97)","v":0},{"$f":"+GETPIVOTDATA(\" BAS021\",TABLAS!$A$97)","v":0},{"$f":"+GETPIVOTDATA(\" BAS022\",TABLAS!$A$97)","v":0},{"$f":"+GETPIVOTDATA(\" BAS023\",TABLAS!$A$97)","v":0},{"$f":"+GETPIVOTDATA(\" BAS024\",TABLAS!$A$97)","v":0},null,null,"=+IMPORTARDATOSDINAMICOS(\" BAS019\";TABLAS!$A$97)","=+IMPORTARDATOSDINAMICOS(\" BAS020\";TABLAS!$A$97)","=+IMPORTARDATOSDINAMICOS(\" BAS021\";TABLAS!$A$97)","=+IMPORTARDATOSDINAMICOS(\" BAS022\";TABLAS!$A$97)","=+IMPORTARDATOSDINAMICOS(\" BAS023\";TABLAS!$A$97)","=+IMPORTARDATOSDINAMICOS(\" BAS024\";TABLAS!$A$97)",null,"019","020","021","022","023","024",null,19,{"$f":"+AB66+1","v":20},21,22,23,24]
[null,"TAMIZAJE DE CÁNCER TRAMA_BASE_AMAYOR_RPT_06_CANCER_CONSOLIDADO"]
[null,"Hombre","Examen para Tumor de Prostata"]
[41,null,"- Evaluación Normal",{"$f":"F69+H69+J69","v":4},null,{"$f":"+GETPIVOTDATA(\" BAS028\",TABLAS!$A$97)","v":2},null,{"$f":"+GETPIVOTDATA(\" BAS029\",TABLAS!$A$97)","v":2},null,{"$f":"+GETPIVOTDATA(\" BAS030\",TABLAS!$A$97)","v":0},null,null,null,{"$f":"CONCATENATE($N$13,U69,$N$14)","v":"=+IMPORTARDATOSDINAMICOS(\" BAS025\";TABLAS!$A$97)"},null,{"$f":"CONCATENATE($N$13,W69,$N$14)","v":"=+IMPORTARDATOSDINAMICOS(\" BAS026\";TABLAS!$A$97)"},null,{"$f":"CONCATENATE($N$13,Y69,$N$14)","v":"=+IMPORTARDATOSDINAMICOS(\" BAS027\";TABLAS!$A$97)"},null,null,{"$f":"IF(AB69<10,CONCATENATE(\"00\",AB69),IF(AND(AB69<100,AB69>9),CONCATENATE(\"0\",AB69),AB69))","v":"025"},null,{"$f":"IF(AD69<10,CONCATENATE(\"00\",AD69),IF(AND(AD69<100,AD69>9),CONCATENATE(\"0\",AD69),AD69))","v":"026"},null,{"$f":"IF(AF69<10,CONCATENATE(\"00\",AF69),IF(AND(AF69<100,AF69>9),CONCATENATE(\"0\",AF69),AF69))","v":"027"},null,null,{"$f":"+AG66+1","v":25},null,{"$f":"+AB69+1","v":26},null,{"$f":"+AD69+1","v":27}]
[42,null,"- Evaluación Anormal",403,null,{"$f":"+GETPIVOTDATA(\" BAS031\",TABLAS!$A$97)","v":280},null,{"$f":"+GETPIVOTDATA(\" BAS032\",TABLAS!$A$97)","v":117},null,{"$f":"+GETPIVOTDATA(\" BAS033\",TABLAS!$A$97)","v":6},null,null,null,"=+IMPORTARDATOSDINAMICOS(\" BAS028\";TABLAS!$A$97)",null,"=+IMPORTARDATOSDINAMICOS(\" BAS029\";TABLAS!$A$97)",null,"=+IMPORTARDATOSDINAMICOS(\" BAS030\";TABLAS!$A$97)",null,null,"028",null,"029",null,"030",null,null,{"$f":"+AF69+1","v":28},null,29,null,30]
[null,null,"Antigeno Prostatico Especifico (PSA)"]
[43,null,"- Resultado Normal",0,null,{"$f":"+GETPIVOTDATA(\" BAS037\",TABLAS!$A$97)","v":0},null,{"$f":"+GETPIVOTDATA(\" BAS038\",TABLAS!$A$97)","v":0},null,{"$f":"+GETPIVOTDATA(\" BAS039\",TABLAS!$A$97)","v":0},null,null,null,"=+IMPORTARDATOSDINAMICOS(\" BAS031\";TABLAS!$A$97)",null,"=+IMPORTARDATOSDINAMICOS(\" BAS032\";TABLAS!$A$97)",null,"=+IMPORTARDATOSDINAMICOS(\" BAS033\";TABLAS!$A$97)",null,null,"031",null,"032",null,"033",null,null,{"$f":"+AF70+1","v":31},null,32,null,33]
[44,null,"- Resultado Anormal",0,null,{"$f":"+GETPIVOTDATA(\" BAS040\",TABLAS!$A$97)","v":0},null,{"$f":"+GETPIVOTDATA(\" BAS041\",TABLAS!$A$97)","v":0},null,{"$f":"+GETPIVOTDATA(\" BAS042\",TABLAS!$A$97)","v":0},null,null,null,"=+IMPORTARDATOSDINAMICOS(\" BAS034\";TABLAS!$A$97)",null,"=+IMPORTARDATOSDINAMICOS(\" BAS035\";TABLAS!$A$97)",null,"=+IMPORTARDATOSDINAMICOS(\" BAS036\";TABLAS!$A$97)",null,null,"034",null,"035",null,"036",null,null,34,null,35,null,36]
[45,null,"Biopsia de Próstata",0,null,{"$f":"+GETPIVOTDATA(\" BAS043\",TABLAS!$A$97)","v":0},null,{"$f":"+GETPIVOTDATA(\" BAS044\",TABLAS!$A$97)","v":0},null,{"$f":"+GETPIVOTDATA(\" BAS045\",TABLAS!$A$97)","v":0},null,null,null,"=+IMPORTARDATOSDINAMICOS(\" BAS037\";TABLAS!$A$97)",null,"=+IMPORTARDATOSDINAMICOS(\" BAS038\";TABLAS!$A$97)",null,"=+IMPORTARDATOSDINAMICOS(\" BAS039\";TABLAS!$A$97)",null,null,"037",null,"038",null,"039",null,null,37,null,38,null,39]
[null,"Mujer","Papanicolaou"]
[46,null,"- Primera vez",null,3,null,{"$f":"+GETPIVOTDATA(\" BAS049\",TABLAS!$A$97)","v":3},null,{"$f":"+GETPIVOTDATA(\" BAS050\",TABLAS!$A$97)","v":0},null,{"$f":"+GETPIVOTDATA(\" BAS051\",TABLAS!$A$97)","v":0},null,null,null,{"$f":"CONCATENATE($N$13,V76,$N$14)","v":"=+IMPORTARDATOSDINAMICOS(\" BAS040\";TABLAS!$A$97)"},null,{"$f":"CONCATENATE($N$13,X76,$N$14)","v":"=+IMPORTARDATOSDINAMICOS(\" BAS041\";TABLAS!$A$97)"},null,{"$f":"CONCATENATE($N$13,Z76,$N$14)","v":"=+IMPORTARDATOSDINAMICOS(\" BAS042\";TABLAS!$A$97)"},null,null,{"$f":"IF(AC76<10,CONCATENATE(\"00\",AC76),IF(AND(AC76<100,AC76>9),CONCATENATE(\"0\",AC76),AC76))","v":"040"},null,{"$f":"IF(AE76<10,CONCATENATE(\"00\",AE76),IF(AND(AE76<100,AE76>9),CONCATENATE(\"0\",AE76),AE76))","v":"041"},null,{"$f":"IF(AG76<10,CONCATENATE(\"00\",AG76),IF(AND(AG76<100,AG76>9),CONCATENATE(\"0\",AG76),AG76))","v":"042"},null,null,{"$f":"+AF74+1","v":40},null,{"$f":"+AC76+1","v":41},null,{"$f":"+AE76+1","v":42}]
[47,null,"- Segunda a + veces",null,8,null,{"$f":"+GETPIVOTDATA(\" BAS052\",TABLAS!$A$97)","v":8},null,{"$f":"+GETPIVOTDATA(\" BAS053\",TABLAS!$A$97)","v":0},null,{"$f":"+GETPIVOTDATA(\" BAS054\",TABLAS!$A$97)","v":0},null,null,null,"=+IMPORTARDATOSDINAMICOS(\" BAS043\";TABLAS!$A$97)",null,"=+IMPORTARDATOSDINAMICOS(\" BAS044\";TABLAS!$A$97)",null,"=+IMPORTARDATOSDINAMICOS(\" BAS045\";TABLAS!$A$97)",null,null,"043",null,"044",null,"045",null,null,{"$f":"+AG76+1","v":43},null,44,null,45]
[null,null,"Evaluación de los Resultados de PAP"]
[48,null,"Lesión Intraepitelial de Bajo Grado – LIEB (NIC I)",null,0,null,{"$f":"+GETPIVOTDATA(\" BAS058\",TABLAS!$A$97)","v":0},null,{"$f":"+GETPIVOTDATA(\" BAS059\",TABLAS!$A$97)","v":0},null,{"$f":"+GETPIVOTDATA(\" BAS060\",TABLAS!$A$97)","v":0},null,null,null,"=+IMPORTARDATOSDINAMICOS(\" BAS046\";TABLAS!$A$97)",null,"=+IMPORTARDATOSDINAMICOS(\" BAS047\";TABLAS!$A$97)",null,"=+IMPORTARDATOSDINAMICOS(\" BAS048\";TABLAS!$A$97)",null,null,"046",null,"047",null,"048",null,null,{"$f":"+AG77+1","v":46},null,47,null,48]
[49,null,"Lesión Intraepitelial de Alto Grado – LIEA (NIC II, NIC III)",null,0,null,{"$f":"+GETPIVOTDATA(\" BAS061\",TABLAS!$A$97)","v":0},null,{"$f":"+GETPIVOTDATA(\" BAS062\",TABLAS!$A$97)","v":0},null,{"$f":"+GETPIVOTDATA(\" BAS063\",TABLAS!$A$97)","v":0},null,null,null,"=+IMPORTARDATOSDINAMICOS(\" BAS049\";TABLAS!$A$97)",null,"=+IMPORTARDATOSDINAMICOS(\" BAS050\";TABLAS!$A$97)",null,"=+IMPORTARDATOSDINAMICOS(\" BAS051\";TABLAS!$A$97)",null,null,"049",null,"050",null,"051",null,null,49,null,50,null,51]
[50,null,"Carcinoma in Situ",null,0,null,{"$f":"+GETPIVOTDATA(\" BAS064\",TABLAS!$A$97)","v":0},null,{"$f":"+GETPIVOTDATA(\" BAS065\",TABLAS!$A$97)","v":0},null,{"$f":"+GETPIVOTDATA(\" BAS066\",TABLAS!$A$97)","v":0},null,null,null,"=+IMPORTARDATOSDINAMICOS(\" BAS052\";TABLAS!$A$97)",null,"=+IMPORTARDATOSDINAMICOS(\" BAS053\";TABLAS!$A$97)",null,"=+IMPORTARDATOSDINAMICOS(\" BAS054\";TABLAS!$A$97)",null,null,"052",null,"053",null,"054",null,null,52,null,53,null,54]
[null,null,"Examen Pélvico"]
[51,null,"- Evaluación Normal",null,0,null,{"$f":"+GETPIVOTDATA(\" BAS070\",TABLAS!$A$97)","v":0},null,{"$f":"+GETPIVOTDATA(\" BAS071\",TABLAS!$A$97)","v":0},null,{"$f":"+GETPIVOTDATA(\" BAS072\",TABLAS!$A$97)","v":0},null,null,null,"=+IMPORTARDATOSDINAMICOS(\" BAS055\";TABLAS!$A$97)",null,"=+IMPORTARDATOSDINAMICOS(\" BAS056\";TABLAS!$A$97)",null,"=+IMPORTARDATOSDINAMICOS(\" BAS057\";TABLAS!$A$97)",null,null,"055",null,"056",null,"057",null,null,{"$f":"+AG81+1","v":55},null,56,null,57]
[52,null,"- Evaluación Anormal",null,0,null,{"$f":"+GETPIVOTDATA(\" BAS073\",TABLAS!$A$97)","v":0},null,{"$f":"+GETPIVOTDATA(\" BAS074\",TABLAS!$A$97)","v":0},null,{"$f":"+GETPIVOTDATA(\" BAS075\",TABLAS!$A$97)","v":0},null,null,null,"=+IMPORTARDATOSDINAMICOS(\" BAS058\";TABLAS!$A$97)",null,"=+IMPORTARDATOSDINAMICOS(\" BAS059\";TABLAS!$A$97)",null,"=+IMPORTARDATOSDINAMICOS(\" BAS060\";TABLAS!$A$97)",null,null,"058",null,"059",null,"060",null,null,58,null,59,null,60]
[null,null,"IVVA / IVVAM"]
[53,null,"- Evaluación Normal",null,{"$f":"G86+I86+K86","v":253},null,{"$f":"+GETPIVOTDATA(\" BAS079\",TABLAS!$A$97)","v":237},null,{"$f":"+GETPIVOTDATA(\" BAS080\",TABLAS!$A$97)","v":16},null,{"$f":"+GETPIVOTDATA(\" BAS081\",TABLAS!$A$97)","v":0},null,null,null,"=+IMPORTARDATOSDINAMICOS(\" BAS061\";TABLAS!$A$97)",null,"=+IMPORTARDATOSDINAMICOS(\" BAS062\";TABLAS!$A$97)",null,"=+IMPORTARDATOSDINAMICOS(\" BAS063\";TABLAS!$A$97)",null,null,"061",null,"062",null,"063",null,null,{"$f":"+AG84+1","v":61},null,62,null,63]
[54,null,"- Evaluación Anormal",null,0,null,{"$f":"+GETPIVOTDATA(\" BAS082\",TABLAS!$A$97)","v":0},null,{"$f":"+GETPIVOTDATA(\" BAS083\",TABLAS!$A$97)","v":0},null,{"$f":"+GETPIVOTDATA(\" BAS084\",TABLAS!$A$97)","v":0},null,null,null,"=+IMPORTARDATOSDINAMICOS(\" BAS064\";TABLAS!$A$97)",null,"=+IMPORTARDATOSDINAMICOS(\" BAS065\";TABLAS!$A$97)",null,"=+IMPORTARDATOSDINAMICOS(\" BAS066\";TABLAS!$A$97)",null,null,"064",null,"065",null,"066",null,null,64,null,65,null,66]
[null,null,"Examen Clínico de Mama (ECM)"]
[55,null,"- Evaluación Normal",null,0,null,{"$f":"+GETPIVOTDATA(\" BAS088\",TABLAS!$A$97)","v":0},null,{"$f":"+GETPIVOTDATA(\" BAS089\",TABLAS!$A$97)","v":0},null,{"$f":"+GETPIVOTDATA(\" BAS090\",TABLAS!$A$97)","v":0},null,null,null,"=+IMPORTARDATOSDINAMICOS(\" BAS067\";TABLAS!$A$97)",null,"=+IMPORTARDATOSDINAMICOS(\" BAS068\";TABLAS!$A$97)",null,"=+IMPORTARDATOSDINAMICOS(\" BAS069\";TABLAS!$A$97)",null,null,"067",null,"068",null,"069",null,null,{"$f":"+AG87+1","v":67},null,68,null,69]
[56,null,"- Evaluación Anormal",null,1594,null,{"$f":"+GETPIVOTDATA(\" BAS091\",TABLAS!$A$97)","v":517},null,{"$f":"+GETPIVOTDATA(\" BAS092\",TABLAS!$A$97)","v":717},null,{"$f":"+GETPIVOTDATA(\" BAS093\",TABLAS!$A$97)","v":360},null,null,null,"=+IMPORTARDATOSDINAMICOS(\" BAS070\";TABLAS!$A$97)",null,"=+IMPORTARDATOSDINAMICOS(\" BAS071\";TABLAS!$A$97)",null,"=+IMPORTARDATOSDINAMICOS(\" BAS072\";TABLAS!$A$97)",null,null,"070",null,"071",null,"072",null,null,70,null,71,null,72]
[null,null,"Mamografía"]
[57,null,"Mamografía Unilateral ",null,95,null,{"$f":"+GETPIVOTDATA(\" BAS097\",TABLAS!$A$97)","v":27},null,{"$f":"+GETPIVOTDATA(\" BAS098\",TABLAS!$A$97)","v":40},null,{"$f":"+GETPIVOTDATA(\" BAS099\",TABLAS!$A$97)","v":28},null,null,null,"=+IMPORTARDATOSDINAMICOS(\" BAS073\";TABLAS!$A$97)",null,"=+IMPORTARDATOSDINAMICOS(\" BAS074\";TABLAS!$A$97)",null,"=+IMPORTARDATOSDINAMICOS(\" BAS075\";TABLAS!$A$97)",null,null,"073",null,"074",null,"075",null,null,{"$f":"+AG90+1","v":73},null,74,null,75]
[58,null,"Mamografía Bilateral",null,32,null,{"$f":"+GETPIVOTDATA(\" BAS100\",TABLAS!$A$97)","v":20},null,{"$f":"+GETPIVOTDATA(\" BAS101\",TABLAS!$A$97)","v":8},null,{"$f":"+GETPIVOTDATA(\" BAS102\",TABLAS!$A$97)","v":4},null,null,null,"=+IMPORTARDATOSDINAMICOS(\" BAS076\";TABLAS!$A$97)",null,"=+IMPORTARDATOSDINAMICOS(\" BAS077\";TABLAS!$A$97)",null,"=+IMPORTARDATOSDINAMICOS(\" BAS078\";TABLAS!$A$97)",null,null,"076",null,"077",null,"078",null,null,76,null,77,null,78]
[59,null,"Mamografía Screening",null,0,null,{"$f":"+GETPIVOTDATA(\" BAS103\",TABLAS!$A$97)","v":0},null,{"$f":"+GETPIVOTDATA(\" BAS104\",TABLAS!$A$97)","v":0},null,{"$f":"+GETPIVOTDATA(\" BAS105\",TABLAS!$A$97)","v":0},null,null,null,"=+IMPORTARDATOSDINAMICOS(\" BAS079\";TABLAS!$A$97)",null,"=+IMPORTARDATOSDINAMICOS(\" BAS080\";TABLAS!$A$97)",null,"=+IMPORTARDATOSDINAMICOS(\" BAS081\";TABLAS!$A$97)",null,null,"079",null,"080",null,"081",null,null,79,null,80,null,81]
[]
[60,null,"Biopsia por Aspiración con Aguja Fina (BAAF)",null,0,null,{"$f":"+GETPIVOTDATA(\" BAS109\",TABLAS!$A$97)","v":0},null,{"$f":"+GETPIVOTDATA(\" BAS110\",TABLAS!$A$97)","v":0},null,{"$f":"+GETPIVOTDATA(\" BAS111\",TABLAS!$A$97)","v":0},null,null,null,"=+IMPORTARDATOSDINAMICOS(\" BAS082\";TABLAS!$A$97)",null,"=+IMPORTARDATOSDINAMICOS(\" BAS083\";TABLAS!$A$97)",null,"=+IMPORTARDATOSDINAMICOS(\" BAS084\";TABLAS!$A$97)",null,null,"082",null,"083",null,"084",null,null,{"$f":"+AG94+1","v":82},null,83,null,84]
[61,null,"Entrega de Resultados Biopsia de Mama Positivos",null,0,null,{"$f":"+GETPIVOTDATA(\" BAS112\",TABLAS!$A$97)","v":0},null,{"$f":"+GETPIVOTDATA(\" BAS113\",TABLAS!$A$97)","v":0},null,{"$f":"+GETPIVOTDATA(\" BAS114\",TABLAS!$A$97)","v":0},null,null,null,"=+IMPORTARDATOSDINAMICOS(\" BAS085\";TABLAS!$A$97)",null,"=+IMPORTARDATOSDINAMICOS(\" BAS086\";TABLAS!$A$97)",null,"=+IMPORTARDATOSDINAMICOS(\" BAS087\";TABLAS!$A$97)",null,null,"085",null,"086",null,"087",null,null,85,null,86,null,87]
[62,null,"Entrega de Resultados Biopsia de Mama Negativos",null,0,null,{"$f":"+GETPIVOTDATA(\" BAS115\",TABLAS!$A$97)","v":0},null,{"$f":"+GETPIVOTDATA(\" BAS116\",TABLAS!$A$97)","v":0},null,{"$f":"+GETPIVOTDATA(\" BAS117\",TABLAS!$A$97)","v":0},null,null,null,"=+IMPORTARDATOSDINAMICOS(\" BAS088\";TABLAS!$A$97)",null,"=+IMPORTARDATOSDINAMICOS(\" BAS089\";TABLAS!$A$97)",null,"=+IMPORTARDATOSDINAMICOS(\" BAS090\";TABLAS!$A$97)",null,null,"088",null,"089",null,"090",null,null,88,null,89,null,90]
[null,"IDENTIFICACIÓN DE FACTORES DE RIESGO Y TAMIZAJE LABORATORIAL TRAMA_BASE_AMAYOR_RPT_07_FACTORES_CONSOLIDADO"]
[63,"DNT","Valoración Clínica de Factores de Riesgo",{"$f":"F100+H100+J100","v":1043},{"$f":"G100+I100+K100","v":1321},{"$f":"+GETPIVOTDATA(\" BAS091\",TABLAS!$A$97)","v":517},{"$f":"+GETPIVOTDATA(\" BAS092\",TABLAS!$A$97)","v":717},{"$f":"+GETPIVOTDATA(\" BAS093\",TABLAS!$A$97)","v":360},{"$f":"+GETPIVOTDATA(\" BAS094\",TABLAS!$A$97)","v":432},{"$f":"+GETPIVOTDATA(\" BAS095\",TABLAS!$A$97)","v":166},{"$f":"+GETPIVOTDATA(\" BAS096\",TABLAS!$A$97)","v":172},null,null,{"$f":"CONCATENATE($N$13,U100,$N$14)","v":"=+IMPORTARDATOSDINAMICOS(\" BAS091\";TABLAS!$A$97)"},{"$f":"CONCATENATE($N$13,V100,$N$14)","v":"=+IMPORTARDATOSDINAMICOS(\" BAS092\";TABLAS!$A$97)"},{"$f":"CONCATENATE($N$13,W100,$N$14)","v":"=+IMPORTARDATOSDINAMICOS(\" BAS093\";TABLAS!$A$97)"},{"$f":"CONCATENATE($N$13,X100,$N$14)","v":"=+IMPORTARDATOSDINAMICOS(\" BAS094\";TABLAS!$A$97)"},{"$f":"CONCATENATE($N$13,Y100,$N$14)","v":"=+IMPORTARDATOSDINAMICOS(\" BAS095\";TABLAS!$A$97)"},{"$f":"CONCATENATE($N$13,Z100,$N$14)","v":"=+IMPORTARDATOSDINAMICOS(\" BAS096\";TABLAS!$A$97)"},null,{"$f":"IF(AB100<10,CONCATENATE(\"00\",AB100),IF(AND(AB100<100,AB100>9),CONCATENATE(\"0\",AB100),AB100))","v":"091"},{"$f":"IF(AC100<10,CONCATENATE(\"00\",AC100),IF(AND(AC100<100,AC100>9),CONCATENATE(\"0\",AC100),AC100))","v":"092"},{"$f":"IF(AD100<10,CONCATENATE(\"00\",AD100),IF(AND(AD100<100,AD100>9),CONCATENATE(\"0\",AD100),AD100))","v":"093"},{"$f":"IF(AE100<10,CONCATENATE(\"00\",AE100),IF(AND(AE100<100,AE100>9),CONCATENATE(\"0\",AE100),AE100))","v":"094"},{"$f":"IF(AF100<10,CONCATENATE(\"00\",AF100),IF(AND(AF100<100,AF100>9),CONCATENATE(\"0\",AF100),AF100))","v":"095"},{"$f":"IF(AG100<10,CONCATENATE(\"00\",AG100),IF(AND(AG100<100,AG100>9),CONCATENATE(\"0\",AG100),AG100))","v":"096"},null,{"$f":"+AG98+1","v":91},{"$f":"+AB100+1","v":92},93,94,95,96]
[null,"ATENCIÓN DEL ADULTO MAYOR EN EL DOMICILIO TRAMA_BASE_AMAYOR_RPT_08_VISITA_CONSOLIDADO"]
[64,"VD","Visita de Atención Integral",{"$f":"F102+H102+J102","v":63},64,{"$f":"+GETPIVOTDATA(\" BAS097\",TABLAS!$A$97)","v":27},{"$f":"+GETPIVOTDATA(\" BAS098\",TABLAS!$A$97)","v":40},{"$f":"+GETPIVOTDATA(\" BAS099\",TABLAS!$A$97)","v":28},{"$f":"+GETPIVOTDATA(\" BAS100\",TABLAS!$A$97)","v":20},{"$f":"+GETPIVOTDATA(\" BAS101\",TABLAS!$A$97)","v":8},{"$f":"+GETPIVOTDATA(\" BAS102\",TABLAS!$A$97)","v":4},null,null,{"$f":"CONCATENATE($N$13,U102,$N$14)","v":"=+IMPORTARDATOSDINAMICOS(\" BAS097\";TABLAS!$A$97)"},{"$f":"CONCATENATE($N$13,V102,$N$14)","v":"=+IMPORTARDATOSDINAMICOS(\" BAS098\";TABLAS!$A$97)"},{"$f":"CONCATENATE($N$13,W102,$N$14)","v":"=+IMPORTARDATOSDINAMICOS(\" BAS099\";TABLAS!$A$97)"},{"$f":"CONCATENATE($N$13,X102,$N$14)","v":"=+IMPORTARDATOSDINAMICOS(\" BAS100\";TABLAS!$A$97)"},{"$f":"CONCATENATE($N$13,Y102,$N$14)","v":"=+IMPORTARDATOSDINAMICOS(\" BAS101\";TABLAS!$A$97)"},{"$f":"CONCATENATE($N$13,Z102,$N$14)","v":"=+IMPORTARDATOSDINAMICOS(\" BAS102\";TABLAS!$A$97)"},null,{"$f":"IF(AB102<10,CONCATENATE(\"00\",AB102),IF(AND(AB102<100,AB102>9),CONCATENATE(\"0\",AB102),AB102))","v":"097"},{"$f":"IF(AC102<10,CONCATENATE(\"00\",AC102),IF(AND(AC102<100,AC102>9),CONCATENATE(\"0\",AC102),AC102))","v":"098"},{"$f":"IF(AD102<10,CONCATENATE(\"00\",AD102),IF(AND(AD102<100,AD102>9),CONCATENATE(\"0\",AD102),AD102))","v":"099"},{"$f":"IF(AE102<10,CONCATENATE(\"00\",AE102),IF(AND(AE102<100,AE102>9),CONCATENATE(\"0\",AE102),AE102))","v":100},{"$f":"IF(AF102<10,CONCATENATE(\"00\",AF102),IF(AND(AF102<100,AF102>9),CONCATENATE(\"0\",AF102),AF102))","v":101},{"$f":"IF(AG102<10,CONCATENATE(\"00\",AG102),IF(AND(AG102<100,AG102>9),CONCATENATE(\"0\",AG102),AG102))","v":102},null,{"$f":"+AG100+1","v":97},98,99,100,101,102]

{"sheet":"Datos","index":3,"n_rows":444,"n_cols":32,"rows_kept":444,"cut":false,"hidden":true,"merged":[]}
[]
[]
[]
[]
[]
[]
[]
[]
[null,"ANO",null,"MESES",null,"COD_RED","DESC_RED","CONCATENAR",null,"COD_RED","COD_MIC","DESC_MICRO","CONCATENAR",null,"COD_ESTAB","DESC_ESTAB","COD_RED","COD_MIC","COD_PROV","COD_DIST","REDMIC","CONCATENAR",null,"COD_PROV","DESC_PROV","CONCATENAR",null,"COD_PROV","COD_DIST","DESC_DIST","PROVDIST","CONCATENAR"]
[null,2024,null,"01-Enero",null,"00","NO TIENE ASIGNADO NINGUNA RED",{"$f":"CONCATENATE(F10,\" - \",G10)","v":"00 - NO TIENE ASIGNADO NINGUNA RED"},null,"00","00","NO PERTENECE A NINGUNA MICRORED                                                                     ",{"$f":"CONCATENATE(J10,K10,\" - \",L10)","v":"0000 - NO PERTENECE A NINGUNA MICRORED                                                                     "},null,"000000000","(All)","00","00",null,null,{"$f":"CONCATENATE(Q10,R10)","v":"0000"},{"$f":"CONCATENATE(O10,\" - \",P10)","v":"000000000 - (All)"},null,"00","(All)",{"$f":"CONCATENATE(X10,\" - \",Y10)","v":"00 - (All)"},null,"01","00","(All)",{"$f":"CONCATENATE(AB10,AC10)","v":"0100"},{"$f":"CONCATENATE(AB10,AC10,\" - \",AD10)","v":"0100 - (All)"}]
[null,null,null,"02-Febrero",null,"01","CUSCO SUR",{"$f":"CONCATENATE(F11,\" - \",G11)","v":"01 - CUSCO SUR"},null,"00","99","(All)","0099 - (All)",null,"000028190","SAMUE CUSCO","00","00","01","01",{"$f":"CONCATENATE(Q11,R11)","v":"0000"},{"$f":"CONCATENATE(O11,\" - \",P11)","v":"000028190 - SAMUE CUSCO"},null,"01","CUSCO",{"$f":"CONCATENATE(X11,\" - \",Y11)","v":"01 - CUSCO"},null,"01","01","CUSCO",{"$f":"CONCATENATE(AB11,AC11)","v":"0101"},{"$f":"CONCATENATE(AB11,AC11,\" - \",AD11)","v":"0101 - CUSCO"}]
[null,null,null,"03-Marzo",null,"02","CUSCO NORTE","02 - CUSCO NORTE",null,"01","00","NO PERTENECE A NINGUNA MICRORED                                                                     ","0100 - NO PERTENECE A NINGUNA MICRORED                                                                     ",null,"000002289","HOSPITAL DE APOYO DEPARTAMENTAL CUSCO","00","00","01","01","0000","000002289 - HOSPITAL DE APOYO DEPARTAMENTAL CUSCO",null,"02","ACOMAYO",{"$f":"CONCATENATE(X12,\" - \",Y12)","v":"02 - ACOMAYO"},null,"01","02","CCORCA","0102","0102 - CCORCA"]
[null,null,null,"04-Abril",null,"03","LA CONVENCION","03 - LA CONVENCION",null,"01","16","CUSCO                                                                                               ","0116 - CUSCO                                                                                               ",null,"000002305","ANTONIO LORENA DEL CUSCO","00","00","01","06","0000","000002305 - ANTONIO LORENA DEL CUSCO",null,"03","ANTA","03 - ANTA",null,"01","03","POROY","0103","0103 - POROY"]
[null,null,null,"05-Mayo",null,"04","CANAS-CANCHIS-ESPINAR","04 - CANAS-CANCHIS-ESPINAR",null,"01","03","PARURO                                                                                              ","0103 - PARURO                                                                                              ",null,"999999999","(All)","00","99",null,null,"0099","999999999 - (All)",null,"04","CALCA","04 - CALCA",null,"01","04","SAN JERONIMO","0104","0104 - SAN JERONIMO"]
[null,null,null,"06-Junio",null,"05","KIMBIRI PICHARI","05 - KIMBIRI PICHARI",null,"01","06","PAUCARTAMBO                                                                                         ","0106 - PAUCARTAMBO                                                                                         ",null,"000025210","TUPAC AMARU","01","00","01","05","0100","000025210 - TUPAC AMARU",null,"05","CANAS","05 - CANAS",null,"01","05","SAN SEBASTIAN","0105","0105 - SAN SEBASTIAN"]
[null,null,null,"07-Julio",null,"06","CHUMBIVILCAS","06 - CHUMBIVILCAS",null,"01","12","URCOS                                                                                               ","0112 - URCOS                                                                                               ",null,"000000000","(All)","01","03",null,null,"0103","000000000 - (All)",null,"06","CANCHIS","06 - CANCHIS",null,"01","06","SANTIAGO","0106","0106 - SANTIAGO"]
[null,null,null,"08-Agosto",null,"99","(All)","99 - (All)",null,"01","13","ACOMAYO                                                                                             ","0113 - ACOMAYO                                                                                             ",null,"000002499","PARURO","01","03","10","01","0103","000002499 - PARURO",null,"07","CHUMBIVILCAS","07 - CHUMBIVILCAS",null,"01","07","SAYLLA","0107","0107 - SAYLLA"]
[null,null,null,"09-Setiembre",null,null,null,null,null,"01","15","OCONGATE                                                                                            ","0115 - OCONGATE                                                                                            ",null,"000002500","ACCHA","01","03","10","02","0103","000002500 - ACCHA",null,"08","ESPINAR","08 - ESPINAR",null,"01","08","WANCHAQ","0108","0108 - WANCHAQ"]
[null,null,null,"10-Octubre",null,null,null,null,null,"01","99","(All)","0199 - (All)",null,"000002501","CCAPI","01","03","10","03","0103","000002501 - CCAPI",null,"09","LA CONVENCION","09 - LA CONVENCION",null,"02","00","(All)","0200","0200 - (All)"]
[null,null,null,"11-Noviembre",null,"EJECUTORAS",null,null,null,"02","01","BELEMPAMPA                                                                                          ","0201 - BELEMPAMPA                                                                                          ",null,"000002502","CCOYABAMBA","01","03","10","03","0103","000002502 - CCOYABAMBA",null,"10","PARURO","10 - PARURO",null,"02","01","ACOMAYO","0201","0201 - ACOMAYO"]
[null,null,null,"12-Diciembre",null,"COD_RED","DESC_RED","CONCATENAR",null,"02","02","WANCHAQ                                                                                             ","0202 - WANCHAQ                                                                                             ",null,"000002503","COLCHA","01","03","10","04","0103","000002503 - COLCHA",null,"11","PAUCARTAMBO","11 - PAUCARTAMBO",null,"02","02","ACOPIA","0202","0202 - ACOPIA"]
[null,null,null,null,null,"01","HOSPITAL REGIONAL CUSCO",{"$f":"CONCATENATE(F22,\" - \",G22)","v":"01 - HOSPITAL REGIONAL CUSCO"},null,"02","03","ANTA                                                                                                ","0203 - ANTA                                                                                                ",null,"000002504","HUANOQUITE","01","03","10","05","0103","000002504 - HUANOQUITE",null,"12","QUISPICANCHI","12 - QUISPICANCHI",null,"02","03","ACOS","0203","0203 - ACOS"]
[null,null,null,null,null,"02","HOSPITAL ANTONIO LORENA",{"$f":"CONCATENATE(F23,\" - \",G23)","v":"02 - HOSPITAL ANTONIO LORENA"},null,"02","04","LIMATAMBO                                                                                           ","0204 - LIMATAMBO                                                                                           ",null,"000002505","OMACHA","01","03","10","06","0103","000002505 - OMACHA",null,"13","URUBAMBA","13 - URUBAMBA",null,"02","04","MOSOC LLACTA","0204","0204 - MOSOC LLACTA"]
[null,null,null,null,null,"03","CUSCO NORTE","03 - CUSCO NORTE",null,"02","05","PISAC                                                                                               ","0205 - PISAC                                                                                               ",null,"000002506","ANTAPALLPA","01","03","10","06","0103","000002506 - ANTAPALLPA",null,null,null,null,null,"02","05","POMACANCHI","0205","0205 - POMACANCHI"]
[null,null,null,null,null,"04","CUSCO SUR","04 - CUSCO SUR",null,"02","06","CALCA                                                                                               ","0206 - CALCA                                                                                               ",null,"000002507","PACCARECTAMBO","01","03","10","07","0103","000002507 - PACCARECTAMBO",null,null,null,null,null,"02","06","RONDOCAN","0206","0206 - RONDOCAN"]
[null,null,null,null,null,"05","LA CONVENCION","05 - LA CONVENCION",null,"02","07","URUBAMBA                                                                                            ","0207 - URUBAMBA                                                                                            ",null,"000002509","YAURISQUE","01","03","10","09","0103","000002509 - YAURISQUE",null,null,null,null,null,"02","07","SANGARARA","0207","0207 - SANGARARA"]
[null,null,null,null,null,"06","HOSPITAL QUILLABAMBA","06 - HOSPITAL QUILLABAMBA",null,"02","08","YANATILE                                                                                            ","0208 - YANATILE                                                                                            ",null,"000006978","CCOCHIRIHUAY","01","03","10","04","0103","000006978 - CCOCHIRIHUAY",null,null,null,null,null,"03","00","(All)","0300","0300 - (All)"]
[null,null,null,null,null,"07","CANAS CANCHIS ESPINAR","07 - CANAS CANCHIS ESPINAR",null,"02","09","SIETE CUARTONES                                                                                     ","0209 - SIETE CUARTONES                                                                                     ",null,"000007147","PUESTO DE SALUD DE HUASQUILLAY","01","03","10","06","0103","000007147 - PUESTO DE SALUD DE HUASQUILLAY",null,null,null,null,null,"03","01","ANTA","0301","0301 - ANTA"]
[null,null,null,null,null,"08","HOSPITAL SICUANI","08 - HOSPITAL SICUANI",null,"02","99","(All)","0299 - (All)",null,"000012924","SAHUA SAHUA","01","03","10","06","0103","000012924 - SAHUA SAHUA",null,null,null,null,null,"03","02","ANCAHUASI","0302","0302 - ANCAHUASI"]
[null,null,null,null,null,"09","HOSPITAL ESPINAR","09 - HOSPITAL ESPINAR",null,"03","00","NO PERTENECE A NINGUNA MICRORED                                                                     ","0300 - NO PERTENECE A NINGUNA MICRORED                                                                     ",null,"000000000","(All)","01","06",null,null,"0106","000000000 - (All)",null,null,null,null,null,"03","03","CACHIMAYO","0303","0303 - CACHIMAYO"]
[null,null,null,null,null,"10","KIMBIRI PICHARI","10 - KIMBIRI PICHARI",null,"03","01","SANTA ANA                                                                                           ","0301 - SANTA ANA                                                                                           ",null,"000002510","PAUCARTAMBO","01","06","11","01","0106","000002510 - PAUCARTAMBO",null,null,null,null,null,"03","04","CHINCHAYPUJIO","0304","0304 - CHINCHAYPUJIO"]
[null,null,null,null,null,"11","CHUMBIVILCAS","11 - CHUMBIVILCAS",null,"03","02","MARANURA                                                                                            ","0302 - MARANURA                                                                                            ",null,"000002511","MOLLOMARCA","01","06","11","01","0106","000002511 - MOLLOMARCA",null,null,null,null,null,"03","05","HUAROCONDO","0305","0305 - HUAROCONDO"]
[null,null,null,null,null,"99","(ALL)",{"$f":"CONCATENATE(F33,\" - \",G33)","v":"99 - (ALL)"},null,"03","03","QUELLOUNO                                                                                           ","0303 - QUELLOUNO                                                                                           ",null,"000002512","CAICAY","01","06","11","02","0106","000002512 - CAICAY",null,null,null,null,null,"03","06","LIMATAMBO","0306","0306 - LIMATAMBO"]
[null,null,null,null,null,null,null,null,null,"03","04","KITENI                                                                                              ","0304 - KITENI                                                                                              ",null,"000002513","HUASAC","01","06","11","02","0106","000002513 - HUASAC",null,null,null,null,null,"03","07","MOLLEPATA","0307","0307 - MOLLEPATA"]
[null,null,null,null,null,null,null,null,null,"03","05","KAMISEA                                                                                             ","0305 - KAMISEA                                                                                             ",null,"000002514","CHALLABAMBA","01","06","11","03","0106","000002514 - CHALLABAMBA",null,null,null,null,null,"03","08","PUCYURA","0308","0308 - PUCYURA"]
[null,null,null,null,null,null,null,null,null,"03","06","PUCYURA                                                                                             ","0306 - PUCYURA                                                                                             ",null,"000002516","COLQUEPATA","01","06","11","04","0106","000002516 - COLQUEPATA",null,null,null,null,null,"03","09","ZURITE","0309","0309 - ZURITE"]
[null,null,null,null,null,null,null,null,null,"03","07","PALMA REAL","0307 - PALMA REAL",null,"000002517","PICHIHUA COLQUEPATA","01","06","11","04","0106","000002517 - PICHIHUA COLQUEPATA",null,null,null,null,null,"04","00","(All)","0400","0400 - (All)"]
[null,null,null,null,null,null,null,null,null,"03","99","(All)","0399 - (All)",null,"000002518","VIZCOCHONI","01","06","11","04","0106","000002518 - VIZCOCHONI",null,null,null,null,null,"04","01","CALCA","0401","0401 - CALCA"]
[null,null,null,null,null,null,null,null,null,"04","00","NO PERTENECE A NINGUNA MICRORED                                                                     ","0400 - NO PERTENECE A NINGUNA MICRORED                                                                     ",null,"000002519","AYRE","01","06","11","04","0106","000002519 - AYRE",null,null,null,null,null,"04","02","COYA","0402","0402 - COYA"]
[null,null,null,null,null,null,null,null,null,"04","01","YANAOCA                                                                                             ","0401 - YANAOCA                                                                                             ",null,"000002520","HUANCARANI","01","06","11","05","0106","000002520 - HUANCARANI",null,null,null,null,null,"04","03","LAMAY","0403","0403 - LAMAY"]
[null,null,null,null,null,null,null,null,null,"04","02","EL DESCANSO                                                                                         ","0402 - EL DESCANSO                                                                                         ",null,"000002521","PILCOPATA","01","06","11","06","0106","000002521 - PILCOPATA",null,null,null,null,null,"04","04","LARES","0404","0404 - LARES"]
[null,null,null,null,null,null,null,null,null,"04","03","COMBAPATA                                                                                           ","0403 - COMBAPATA                                                                                           ",null,"000002522","PATRIA","01","06","11","06","0106","000002522 - PATRIA",null,null,null,null,null,"04","05","PISAC","0405","0405 - PISAC"]
[null,null,null,null,null,null,null,null,null,"04","04","TECHO OBRERO                                                                                        ","0404 - TECHO OBRERO                                                                                        ",null,"000006979","TOCRA","01","06","11","04","0106","000006979 - TOCRA",null,null,null,null,null,"04","06","SAN SALVADOR","0406","0406 - SAN SALVADOR"]
[null,null,null,null,null,null,null,null,null,"04","05","PAMPAPHALLA                                                                                         ","0405 - PAMPAPHALLA                                                                                         ",null,"000010077","PAUCARTAMBO -ESSALUD","01","06","11","01","0106","000010077 - PAUCARTAMBO -ESSALUD",null,null,null,null,null,"04","07","TARAY","0407","0407 - TARAY"]
[null,null,null,null,null,null,null,null,null,"04","06","YAURI                                                                                               ","0406 - YAURI                                                                                               ",null,"000033777","MENTAL COMUNITARIO VIRGEN DEL ROSARIO","01","06","11","01","0106","000033777 - MENTAL COMUNITARIO VIRGEN DEL ROSARIO",null,null,null,null,null,"04","08","YANATILE","0408","0408 - YANATILE"]
[null,null,null,null,null,null,null,null,null,"04","99","(All)","0499 - (All)",null,"000000000","(All)","01","12",null,null,"0112","000000000 - (All)",null,null,null,null,null,"05","00","(All)","0500","0500 - (All)"]
[null,null,null,null,null,null,null,null,null,"05","00","NO PERTENECE A NINGUNA MICRORED                                                                     ","0500 - NO PERTENECE A NINGUNA MICRORED                                                                     ",null,"000002523","URCOS","01","12","12","01","0112","000002523 - URCOS",null,null,null,null,null,"05","01","YANAOCA","0501","0501 - YANAOCA"]
[null,null,null,null,null,null,null,null,null,"05","01","KIMBIRI                                                                                             ","0501 - KIMBIRI                                                                                             ",null,"000002525","ANDAHUAYLILLAS","01","12","12","02","0112","000002525 - ANDAHUAYLILLAS",null,null,null,null,null,"05","02","CHECCA","0502","0502 - CHECCA"]
[null,null,null,null,null,null,null,null,null,"05","02","PICHARI                                                                                             ","0502 - PICHARI                                                                                             ",null,"000002530","CUSIPATA","01","12","12","06","0112","000002530 - CUSIPATA",null,null,null,null,null,"05","03","KUNTURKANKI","0503","0503 - KUNTURKANKI"]
[null,null,null,null,null,null,null,null,null,"05","99","(All)","0599 - (All)",null,"000002532","HUARO","01","12","12","07","0112","000002532 - HUARO",null,null,null,null,null,"05","04","LANGUI","0504","0504 - LANGUI"]
[null,null,null,null,null,null,null,null,null,"06","00","NO PERTENECE A NINGUNA MICRORED                                                                     ","0600 - NO PERTENECE A NINGUNA MICRORED                                                                     ",null,"000002533","URPAY","01","12","12","07","0112","000002533 - URPAY",null,null,null,null,null,"05","05","LAYO","0505","0505 - LAYO"]
[null,null,null,null,null,null,null,null,null,"06","09","SANTO TOMAS                                                                                         ","0609 - SANTO TOMAS                                                                                         ",null,"000002534","LUCRE","01","12","12","08","0112","000002534 - LUCRE",null,null,null,null,null,"05","06","PAMPAMARCA","0506","0506 - PAMPAMARCA"]
[null,null,null,null,null,null,null,null,null,"06","01","LIVITACA                                                                                            ","0601 - LIVITACA                                                                                            ",null,"000002537","OROPESA","01","12","12","11","0112","000002537 - OROPESA",null,null,null,null,null,"05","07","QUEHUE","0507","0507 - QUEHUE"]
[null,null,null,null,null,null,null,null,null,"06","99","(All)","0699 - (All)",null,"000002538","QUIQUIJANA","01","12","12","12","0112","000002538 - QUIQUIJANA",null,null,null,null,null,"05","08","TUPAC AMARU","0508","0508 - TUPAC AMARU"]
[null,null,null,null,null,null,null,null,null,"99","99","(All)","9999 - (All)",null,"000002539","CCOLCA","01","12","12","12","0112","000002539 - CCOLCA",null,null,null,null,null,"06","00","(All)","0600","0600 - (All)"]
[null,null,null,null,null,null,null,null,null,null,null,null,null,null,"000006980","CHILLIHUANI","01","12","12","06","0112","000006980 - CHILLIHUANI",null,null,null,null,null,"06","01","SICUANI","0601","0601 - SICUANI"]
[null,null,null,null,null,null,null,null,null,null,null,null,null,null,"000008911","HUARA HUARA","01","12","12","05","0112","000008911 - HUARA HUARA",null,null,null,null,null,"06","02","CHECACUPE","0602","0602 - CHECACUPE"]
[null,null,null,null,null,null,null,null,null,null,null,null,null,null,"000011747","POSTA MEDICA POLICIAL PUCUTO","01","12","12","07","0112","000011747 - POSTA MEDICA POLICIAL PUCUTO",null,null,null,null,null,"06","03","COMBAPATA","0603","0603 - COMBAPATA"]
[null,null,null,null,null,null,null,null,null,null,null,null,null,null,"000026385","URCOS - ESSALUD","01","12","12","01","0112","000026385 - URCOS - ESSALUD",null,null,null,null,null,"06","04","MARANGANI","0604","0604 - MARANGANI"]
[null,null,null,null,null,null,null,null,null,null,null,null,null,null,"000030708","MENTAL COMUNITARIO HUARO","01","12","12","07","0112","000030708 - MENTAL COMUNITARIO HUARO",null,null,null,null,null,"06","05","PITUMARCA","0605","0605 - PITUMARCA"]
[null,null,null,null,null,null,null,null,null,null,null,null,null,null,"000000000","(All)","01","13",null,null,"0113","000000000 - (All)",null,null,null,null,null,"06","06","SAN PABLO","0606","0606 - SAN PABLO"]
[null,null,null,null,null,null,null,null,null,null,null,null,null,null,"000002317","ACOMAYO","01","13","02","01","0113","000002317 - ACOMAYO",null,null,null,null,null,"06","07","SAN PEDRO","0607","0607 - SAN PEDRO"]
[null,null,null,null,null,null,null,null,null,null,null,null,null,null,"000002318","ACOPIA","01","13","02","02","0113","000002318 - ACOPIA",null,null,null,null,null,"06","08","TINTA","0608","0608 - TINTA"]
[null,null,null,null,null,null,null,null,null,null,null,null,null,null,"000002319","ACOS","01","13","02","03","0113","000002319 - ACOS",null,null,null,null,null,"07","00","(All)","0700","0700 - (All)"]
[null,null,null,null,null,null,null,null,null,null,null,null,null,null,"000002321","POMACANCHI","01","13","02","05","0113","000002321 - POMACANCHI",null,null,null,null,null,"07","01","SANTO TOMAS","0701","0701 - SANTO TOMAS"]
[null,null,null,null,null,null,null,null,null,null,null,null,null,null,"000002322","SAN JUAN DE POMACANCHI","01","13","02","05","0113","000002322 - SAN JUAN DE POMACANCHI",null,null,null,null,null,"07","02","CAPACMARCA","0702","0702 - CAPACMARCA"]
[null,null,null,null,null,null,null,null,null,null,null,null,null,null,"000002324","PUESTO DE SALUD SANGARARA","01","13","02","07","0113","000002324 - PUESTO DE SALUD SANGARARA",null,null,null,null,null,"07","03","CHAMACA","0703","0703 - CHAMACA"]
[null,null,null,null,null,null,null,null,null,null,null,null,null,null,"000002325","PUESTO DE SALUD MARCACONGA","01","13","02","07","0113","000002325 - PUESTO DE SALUD MARCACONGA",null,null,null,null,null,"07","04","COLQUEMARCA","0704","0704 - COLQUEMARCA"]
[null,null,null,null,null,null,null,null,null,null,null,null,null,null,"000002508","PILLPINTO","01","13","10","08","0113","000002508 - PILLPINTO",null,null,null,null,null,"07","05","LIVITACA","0705","0705 - LIVITACA"]
[null,null,null,null,null,null,null,null,null,null,null,null,null,null,"000010076","ACOMAYO - ESSALUD","01","13","02","01","0113","000010076 - ACOMAYO - ESSALUD",null,null,null,null,null,"07","06","LLUSCO","0706","0706 - LLUSCO"]
[null,null,null,null,null,null,null,null,null,null,null,null,null,0,"000012926","SANTA LUCIA","01","13","02","05","0113","000012926 - SANTA LUCIA",null,null,null,null,null,"07","07","QUIÑOTA","0707","0707 - QUIÑOTA"]
[null,null,null,null,null,null,null,null,null,null,null,null,null,1,"000000000","(All)","01","15",null,null,"0115","000000000 - (All)",null,null,null,null,null,"07","08","VELILLE","0708","0708 - VELILLE"]
[null,null,null,null,null,null,null,null,null,null,null,null,null,2,"000002524","PAMPACAMARA","01","15","12","05","0115","000002524 - PAMPACAMARA",null,null,null,null,null,"08","00","(All)","0800","0800 - (All)"]
[null,null,null,null,null,null,null,null,null,null,null,null,null,3,"000002526","QUINCE MIL","01","15","12","03","0115","000002526 - QUINCE MIL",null,null,null,null,null,"08","01","ESPINAR","0801","0801 - ESPINAR"]
[null,null,null,null,null,null,null,null,null,null,null,null,null,4,"000002527","CCARHUAYO","01","15","12","04","0115","000002527 - CCARHUAYO",null,null,null,null,null,"08","02","CONDOROMA",{"$f":"CONCATENATE(AB75,AC75)","v":"0802"},{"$f":"CONCATENATE(AB75,AC75,\" - \",AD75)","v":"0802 - CONDOROMA"}]
[null,null,null,null,null,null,null,null,null,null,null,null,null,5,"000002528","CCATCCA","01","15","12","05","0115","000002528 - CCATCCA",null,null,null,null,null,"08","03","COPORAQUE","0803","0803 - COPORAQUE"]
[null,null,null,null,null,null,null,null,null,null,null,null,null,6,"000002529","KCAURY","01","15","12","05","0115","000002529 - KCAURY",null,null,null,null,null,"08","04","OCORURO","0804","0804 - OCORURO"]
[null,null,null,null,null,null,null,null,null,null,null,null,null,7,"000002535","MARCAPATA","01","15","12","09","0115","000002535 - MARCAPATA",null,null,null,null,null,"08","05","PALLPATA","0805","0805 - PALLPATA"]
[null,null,null,null,null,null,null,null,null,null,null,null,null,9,"000002536","OCONGATE","01","15","12","10","0115","000002536 - OCONGATE",null,null,null,null,null,"08","06","PICHIGUA","0806","0806 - PICHIGUA"]
[null,null,null,null,null,null,null,null,null,null,null,null,null,10,"000006977","TINKI","01","15","12","10",{"$f":"CONCATENATE(Q80,R80)","v":"0115"},{"$f":"CONCATENATE(O80,\" - \",P80)","v":"000006977 - TINKI"},null,null,null,null,null,"08","07","SUYCKUTAMBO","0807","0807 - SUYCKUTAMBO"]
[null,null,null,null,null,null,null,null,null,null,null,null,null,11,"000007110","INCACANCHA","01","15","12","09","0115","000007110 - INCACANCHA",null,null,null,null,null,"08","08","ALTO PICHIGUA","0808","0808 - ALTO PICHIGUA"]
[null,null,null,null,null,null,null,null,null,null,null,null,null,12,"000012931","CHICHINA","01","15","12","05","0115","000012931 - CHICHINA",null,null,null,null,null,"09","00","(All)","0900","0900 - (All)"]
[null,null,null,null,null,null,null,null,null,null,null,null,null,13,"000016335","CCAPANA","01","15","12","05","0115","000016335 - CCAPANA",null,null,null,null,null,"09","01","SANTA ANA","0901","0901 - SANTA ANA"]
[null,null,null,null,null,null,null,null,null,null,null,null,null,0,"000000000","(All)","01","16",null,null,"0116","000000000 - (All)",null,null,null,null,null,"09","02","ECHARATE","0902","0902 - ECHARATE"]
[null,null,null,null,null,null,null,null,null,null,null,null,null,1,"000002300","SAN JERONIMO","01","16","01","04","0116","000002300 - SAN JERONIMO",null,null,null,null,null,"09","03","HUAYOPATA","0903","0903 - HUAYOPATA"]
[null,null,null,null,null,null,null,null,null,null,null,null,null,2,"000002301","SAN SEBASTIAN","01","16","01","05","0116","000002301 - SAN SEBASTIAN",null,null,null,null,null,"09","04","MARANURA","0904","0904 - MARANURA"]
[null,null,null,null,null,null,null,null,null,null,null,null,null,3,"000002303","SANTA ROSA","01","16","01","05","0116","000002303 - SANTA ROSA",null,null,null,null,null,"09","05","OCOBAMBA","0905","0905 - OCOBAMBA"]
[null,null,null,null,null,null,null,null,null,null,null,null,null,4,"000002314","SAYLLA","01","16","01","07","0116","000002314 - SAYLLA",null,null,null,null,null,"09","06","QUELLOUNO","0906","0906 - QUELLOUNO"]
[null,null,null,null,null,null,null,null,null,null,null,null,null,5,"000002323","RONDOCAN","01","16","02","06","0116","000002323 - RONDOCAN",null,null,null,null,null,"09","07","KIMBIRI","0907","0907 - KIMBIRI"]
[null,null,null,null,null,null,null,null,null,null,null,null,null,6,"000007699","CONCHACALLE","01","16","01","04","0116","000007699 - CONCHACALLE",null,null,null,null,null,"09","08","SANTA TERESA","0908","0908 - SANTA TERESA"]
[null,null,null,null,null,null,null,null,null,null,null,null,null,7,"000010065","SAN SEBASTIAN ESSALUD","01","16","01","05","0116","000010065 - SAN SEBASTIAN ESSALUD",null,null,null,null,null,"09","09","VILCABAMBA","0909","0909 - VILCABAMBA"]
[null,null,null,null,null,null,null,null,null,null,null,null,null,8,"000011743","POLICIAL \"SANTA ROSA\"  CUSCO","01","16","01","05","0116","000011743 - POLICIAL \"SANTA ROSA\"  CUSCO",null,null,null,null,null,"09","10","PICHARI","0910","0910 - PICHARI"]
[null,null,null,null,null,null,null,null,null,null,null,null,null,9,"000018926","ESTABLECIMIENTO PENITENCIARIO CUSCO VARONES","01","16","01","04","0116","000018926 - ESTABLECIMIENTO PENITENCIARIO CUSCO VARONES",null,null,null,null,null,"09","11","INKAWASI                                ","0911","0911 - INKAWASI                                "]
[null,null,null,null,null,null,null,null,null,null,null,null,null,10,"000021187","ESTABLECIMIENTO PENITENCIARIO CUSCO MUJERES","01","16","01","04","0116","000021187 - ESTABLECIMIENTO PENITENCIARIO CUSCO MUJERES",null,null,null,null,null,"09","12","VILLA VIRGEN","0912","0912 - VILLA VIRGEN"]
[null,null,null,null,null,null,null,null,null,null,null,null,null,0,"000026181","MENTAL SAN SEBASTIAN","01","16","01","05","0116","000026181 - MENTAL SAN SEBASTIAN",null,null,null,null,null,"09","13","VILLA KINTIARINA","0913","0913 - VILLA KINTIARINA"]
[null,null,null,null,null,null,null,null,null,null,null,null,null,1,"000030727","PATRÓN SAN SEBASTIAN","01","16","01","04","0116","000030727 - PATRÓN SAN SEBASTIAN",null,null,null,null,null,"09","14","MEGANTONI","0914","0914 - MEGANTONI"]
[null,null,null,null,null,null,null,null,null,null,null,null,null,2,"999999999","(All)","01","99",null,null,"0199","999999999 - (All)",null,null,null,null,null,"09","15","KUMPIRUSHIATO","0915","0915 - KUMPIRUSHIATO"]
[null,null,null,null,null,null,null,null,null,null,null,null,null,3,"000000000","(All)","02","01",null,null,"0201","000000000 - (All)",null,null,null,null,null,"09","16","CIELO PUNCO","0916","0916 - CIELO PUNCO"]
[null,null,null,null,null,null,null,null,null,null,null,null,null,null,"000002292","INDEPENDENCIA","02","01","01","01","0201","000002292 - INDEPENDENCIA",null,null,null,null,null,"09","17","MANITEA","0917","0917 - MANITEA"]
[null,null,null,null,null,null,null,null,null,null,null,null,null,4,"000002297","CCORCCA","02","01","01","02","0201","000002297 - CCORCCA",null,null,null,null,null,"09","18","UNION ASHANINKA","0918","0918 - UNION ASHANINKA"]
[null,null,null,null,null,null,null,null,null,null,null,null,null,5,"000002306","BELEMPAMPA","02","01","01","06","0201","000002306 - BELEMPAMPA",null,null,null,null,null,"09","00","(All)","0900","0900 - (All)"]
[null,null,null,null,null,null,null,null,null,null,null,null,null,6,"000002308","ZARZUELA ALTA","02","01","01","06","0201","000002308 - ZARZUELA ALTA",null,null,null,null,null,"10","01","PARURO","1001","1001 - PARURO"]
[null,null,null,null,null,null,null,null,null,null,null,null,null,null,"000002309","DIGNIDAD NACIONAL","02","01","01","06","0201","000002309 - DIGNIDAD NACIONAL",null,null,null,null,null,"10","02","ACCHA","1002","1002 - ACCHA"]
[null,null,null,null,null,null,null,null,null,null,null,null,null,7,"000002313","OCCOPATA","02","01","01","06","0201","000002313 - OCCOPATA",null,null,null,null,null,"10","03","CCAPI","1003","1003 - CCAPI"]
[null,null,null,null,null,null,null,null,null,null,null,null,null,8,"000010067","C.M. SANTIAGO  ESSALUD","02","01","01","06","0201","000010067 - C.M. SANTIAGO  ESSALUD",null,null,null,null,null,"10","04","COLCHA","1004","1004 - COLCHA"]
[null,null,null,null,null,null,null,null,null,null,null,null,null,9,"000010920","QUINTA BRIGADA DE MONTAÑA","02","01","01","06","0201","000010920 - QUINTA BRIGADA DE MONTAÑA",null,null,null,null,null,"10","05","HUANOQUITE","1005","1005 - HUANOQUITE"]
[null,null,null,null,null,null,null,null,null,null,null,null,null,10,"000026182","MENTAL SANTIAGO","02","01","01","06","0201","000026182 - MENTAL SANTIAGO",null,null,null,null,null,"10","06","OMACHA","1006","1006 - OMACHA"]
[null,null,null,null,null,null,null,null,null,null,null,null,null,11,"000000000","(All)","02","02",null,null,"0202","000000000 - (All)",null,null,null,null,null,"10","07","PACCARITAMBO","1007","1007 - PACCARITAMBO"]
[null,null,null,null,null,null,null,null,null,null,null,null,null,0,"000002302","CCORAO","02","02","01","05","0202","000002302 - CCORAO",null,null,null,null,null,"10","08","PILLPINTO","1008","1008 - PILLPINTO"]
[null,null,null,null,null,null,null,null,null,null,null,null,null,1,"000002307","MANCO CAPAC","02","02","01","06","0202","000002307 - MANCO CAPAC",null,null,null,null,null,"10","09","YAURISQUE","1009","1009 - YAURISQUE"]
[null,null,null,null,null,null,null,null,null,null,null,null,null,null,"000002310","CHOCCO","02","02","01","06","0202","000002310 - CHOCCO",null,null,null,null,null,"11","00","(All)","1100","1100 - (All)"]
[null,null,null,null,null,null,null,null,null,null,null,null,null,null,"000002315","WANCHAQ","02","02","01","08","0202","000002315 - WANCHAQ",null,null,null,null,null,"11","01","PAUCARTAMBO","1101","1101 - PAUCARTAMBO"]
[null,null,null,null,null,null,null,null,null,null,null,null,null,2,"000002316","TTIO","02","02","01","08","0202","000002316 - TTIO",null,null,null,null,null,"11","02","CAICAY","1102","1102 - CAICAY"]
[null,null,null,null,null,null,null,null,null,null,null,null,null,3,"000010041","ADOLFO GUEVARA VELASCO","02","02","01","08","0202","000010041 - ADOLFO GUEVARA VELASCO",null,null,null,null,null,"11","03","CHALLABAMBA","1103","1103 - CHALLABAMBA"]
[null,null,null,null,null,null,null,null,null,null,null,null,null,4,"000026183","METROPOLITANO","02","02","01","08","0202","000026183 - METROPOLITANO",null,null,null,null,null,"11","04","COLQUEPATA","1104","1104 - COLQUEPATA"]
[null,null,null,null,null,null,null,null,null,null,null,null,null,5,"000030730","PATRON SANTIAGO","02","02","01","08","0202","000030730 - PATRON SANTIAGO",null,null,null,null,null,"11","05","HUANCARANI","1105","1105 - HUANCARANI"]
[null,null,null,null,null,null,null,null,null,null,null,null,null,6,"000000000","(All)","02","03",null,null,"0203","000000000 - (All)",null,null,null,null,null,"11","06","KOSÑIPATA","1106","1106 - KOSÑIPATA"]
[null,null,null,null,null,null,null,null,null,null,null,null,null,7,"000002326","ANTA","02","03","03","01","0203","000002326 - ANTA",null,null,null,null,null,"12","00","(All)","1200","1200 - (All)"]
[null,null,null,null,null,null,null,null,null,null,null,null,null,0,"000002327","CHACAN","02","03","03","01","0203","000002327 - CHACAN",null,null,null,null,null,"12","01","URCOS","1201","1201 - URCOS"]
[null,null,null,null,null,null,null,null,null,null,null,null,null,1,"000002328","COMPONE","02","03","03","01","0203","000002328 - COMPONE",null,null,null,null,null,"12","02","ANDAHUAYLILLAS","1202","1202 - ANDAHUAYLILLAS"]
[null,null,null,null,null,null,null,null,null,null,null,null,null,2,"000002329","CONCHACALLA","02","03","03","01","0203","000002329 - CONCHACALLA",null,null,null,null,null,"12","03","CAMANTI","1203","1203 - CAMANTI"]
[null,null,null,null,null,null,null,null,null,null,null,null,null,3,"000002330","ANCAHUASI","02","03","03","02","0203","000002330 - ANCAHUASI",null,null,null,null,null,"12","04","CCARHUAYO","1204","1204 - CCARHUAYO"]
[null,null,null,null,null,null,null,null,null,null,null,null,null,4,"000002331","CACHIMAYO","02","03","03","03","0203","000002331 - CACHIMAYO",null,null,null,null,null,"12","05","CCATCA","1205","1205 - CCATCA"]
[null,null,null,null,null,null,null,null,null,null,null,null,null,5,"000002332","CHINCHAYPUJIO","02","03","03","04","0203","000002332 - CHINCHAYPUJIO",null,null,null,null,null,"12","06","CUSIPATA","1206","1206 - CUSIPATA"]
[null,null,null,null,null,null,null,null,null,null,null,null,null,6,"000002333","HUAROCONDO","02","03","03","05","0203","000002333 - HUAROCONDO",null,null,null,null,null,"12","07","HUARO","1207","1207 - HUARO"]
[null,null,null,null,null,null,null,null,null,null,null,null,null,7,"000002334","HUAYLLACOCHA","02","03","03","05","0203","000002334 - HUAYLLACOCHA",null,null,null,null,null,"12","08","LUCRE","1208","1208 - LUCRE"]
[null,null,null,null,null,null,null,null,null,null,null,null,null,null,"000002339","PUCYURA ANTA","02","03","03","08","0203","000002339 - PUCYURA ANTA",null,null,null,null,null,"12","09","MARCAPATA","1209","1209 - MARCAPATA"]
[null,null,null,null,null,null,null,null,null,null,null,null,null,8,"000002340","ZURITE","02","03","03","09","0203","000002340 - ZURITE",null,null,null,null,null,"12","10","OCONGATE","1210","1210 - OCONGATE"]
[null,null,null,null,null,null,null,null,null,null,null,null,null,9,"000006972","PANTIPATA","02","03","03","04","0203","000006972 - PANTIPATA",null,null,null,null,null,"12","11","OROPESA","1211","1211 - OROPESA"]
[null,null,null,null,null,null,null,null,null,null,null,null,null,10,"000027790","MENTAL COMUNITARIO ANTA","02","03","03","01","0203","000027790 - MENTAL COMUNITARIO ANTA",null,null,null,null,null,"12","12","QUIQUIJANA","1212","1212 - QUIQUIJANA"]
[null,null,null,null,null,null,null,null,null,null,null,null,null,null,"000029514","ESSALUD ANTA","02","03","03","01","0203","000029514 - ESSALUD ANTA",null,null,null,null,null,"13","00","(All)","1300","1300 - (All)"]
[null,null,null,null,null,null,null,null,null,null,null,null,null,null,"000000000","(All)","02","04",null,null,"0204","000000000 - (All)",null,null,null,null,null,"13","01","URUBAMBA","1301","1301 - URUBAMBA"]
[null,null,null,null,null,null,null,null,null,null,null,null,null,null,"000002336","LIMATAMBO","02","04","03","06","0204","000002336 - LIMATAMBO",null,null,null,null,null,"13","02","CHINCHERO","1302","1302 - CHINCHERO"]
[null,null,null,null,null,null,null,null,null,null,null,null,null,null,"000002337","PAMPACONGA","02","04","03","06","0204","000002337 - PAMPACONGA",null,null,null,null,null,"13","03","HUAYLLABAMBA","1303","1303 - HUAYLLABAMBA"]
[null,null,null,null,null,null,null,null,null,null,null,null,null,null,"000002338","MOLLEPATA","02","04","03","07","0204","000002338 - MOLLEPATA",null,null,null,null,null,"13","04","MACHUPICCHU","1304","1304 - MACHUPICCHU"]
[null,null,null,null,null,null,null,null,null,null,null,null,null,null,"000010761","URATARI","02","04","03","06","0204","000010761 - URATARI",null,null,null,null,null,"13","05","MARAS","1305","1305 - MARAS"]
[null,null,null,null,null,null,null,null,null,null,null,null,null,null,"000021061","HUAMANPATA","02","04","03","07","0204","000021061 - HUAMANPATA",null,null,null,null,null,"13","06","OLLANTAYTAMBO","1306","1306 - OLLANTAYTAMBO"]
[null,null,null,null,null,null,null,null,null,null,null,null,null,null,"000000000","(All)","02","05",null,null,"0205","000000000 - (All)",null,null,null,null,null,"13","07","YUCAY",{"$f":"CONCATENATE(AB138,AC138)","v":"1307"},"1307 - YUCAY"]
[null,null,null,null,null,null,null,null,null,null,null,null,null,null,"000002343","COYA","02","05","04","02","0205","000002343 - COYA",null,null,null,null,null,"00","00","(All)",{"$f":"CONCATENATE(AB139,AC139)","v":"0000"},"0000 - (All)"]
[null,null,null,null,null,null,null,null,null,null,null,null,null,null,"000002344","LAMAY","02","05","04","03","0205","000002344 - LAMAY"]
[null,null,null,null,null,null,null,null,null,null,null,null,null,null,"000002348","PISAC","02","05","04","05","0205","000002348 - PISAC"]
[null,null,null,null,null,null,null,null,null,null,null,null,null,null,"000002349","CUYO CHICO","02","05","04","05","0205","000002349 - CUYO CHICO"]
[null,null,null,null,null,null,null,null,null,null,null,null,null,null,"000002350","CUYO GRANDE","02","05","04","05","0205","000002350 - CUYO GRANDE"]
[null,null,null,null,null,null,null,null,null,null,null,null,null,null,"000002351","QUELLO QUELLO","02","05","04","05","0205","000002351 - QUELLO QUELLO"]
[null,null,null,null,null,null,null,null,null,null,null,null,null,null,"000002352","SAN SALVADOR","02","05","04","06","0205","000002352 - SAN SALVADOR"]
[null,null,null,null,null,null,null,null,null,null,null,null,null,null,"000002353","TARAY","02","05","04","07","0205","000002353 - TARAY"]
[null,null,null,null,null,null,null,null,null,null,null,null,null,null,"000002354","HUANCALLE","02","05","04","07","0205","000002354 - HUANCALLE"]
[null,null,null,null,null,null,null,null,null,null,null,null,null,null,"000006970","TIRACANCHA","02","05","04","06","0205","000006970 - TIRACANCHA"]
[null,null,null,null,null,null,null,null,null,null,null,null,null,null,"000006975","SAYLLAFAYA","02","05","04","03","0205","000006975 - SAYLLAFAYA"]
[null,null,null,null,null,null,null,null,null,null,null,null,null,null,"000007145","HUAMA","02","05","04","03",{"$f":"CONCATENATE(Q150,R150)","v":"0205"},{"$f":"CONCATENATE(O150,\" - \",P150)","v":"000007145 - HUAMA"}]
[null,null,null,null,null,null,null,null,null,null,null,null,null,null,"000007146","POQUES","02","05","04","03","0205","000007146 - POQUES"]
[null,null,null,null,null,null,null,null,null,null,null,null,null,null,"000025368","HUARQUI","02","05","04","03","0205","000025368 - HUARQUI"]
[null,null,null,null,null,null,null,null,null,null,null,null,null,null,"000000000","(All)","02","06",null,null,"0206","000000000 - (All)"]
[null,null,null,null,null,null,null,null,null,null,null,null,null,null,"000002341","CALCA","02","06","04","01","0206","000002341 - CALCA"]
[null,null,null,null,null,null,null,null,null,null,null,null,null,null,"000002342","AMPARAES","02","06","04","04","0206","000002342 - AMPARAES"]
[null,null,null,null,null,null,null,null,null,null,null,null,null,null,"000002345","CCACHIN","02","06","04","04","0206","000002345 - CCACHIN"]
[null,null,null,null,null,null,null,null,null,null,null,null,null,null,"000002346","CHOQUECANCHA","02","06","04","04","0206","000002346 - CHOQUECANCHA"]
[null,null,null,null,null,null,null,null,null,null,null,null,null,null,"000002347","LARES","02","06","04","04","0206","000002347 - LARES"]
[null,null,null,null,null,null,null,null,null,null,null,null,null,null,"000002361","SUYO","02","06","04","04","0206","000002361 - SUYO"]
[null,null,null,null,null,null,null,null,null,null,null,null,null,null,"000002515","PAROBAMBA","02","06","11","03","0206","000002515 - PAROBAMBA"]
[null,null,null,null,null,null,null,null,null,null,null,null,null,null,"000007143","OTOCANI","02","06","11","03","0206","000007143 - OTOCANI"]
[null,null,null,null,null,null,null,null,null,null,null,null,null,null,"000007144","PATABAMBA","02","06","04","07","0206","000007144 - PATABAMBA"]
[null,null,null,null,null,null,null,null,null,null,null,null,null,null,"000010069","ESSALUD CALCA","02","06","04","01","0206","000010069 - ESSALUD CALCA"]
[null,null,null,null,null,null,null,null,null,null,null,null,null,null,"000010759","HUARAN","02","06","04","01","0206","000010759 - HUARAN"]
[null,null,null,null,null,null,null,null,null,null,null,null,null,null,"000010762","ACCHA ALTA - PAMPALLACTA","02","06","04","01","0206","000010762 - ACCHA ALTA - PAMPALLACTA"]
[null,null,null,null,null,null,null,null,null,null,null,null,null,null,"000026273","MENTAL COMUNITARIO VIRGEN ASUNTA DE CALCA","02","06","04","01","0206","000026273 - MENTAL COMUNITARIO VIRGEN ASUNTA DE CALCA"]
[null,null,null,null,null,null,null,null,null,null,null,null,null,null,"000000000","(All)","02","07",null,null,"0207","000000000 - (All)"]
[null,null,null,null,null,null,null,null,null,null,null,null,null,null,"000002540","URUBAMBA","02","07","13","01","0207","000002540 - URUBAMBA"]
[null,null,null,null,null,null,null,null,null,null,null,null,null,null,"000002541","YANAHUARA","02","07","13","01","0207","000002541 - YANAHUARA"]
[null,null,null,null,null,null,null,null,null,null,null,null,null,null,"000002543","CHINCHERO","02","07","13","02","0207","000002543 - CHINCHERO"]
[null,null,null,null,null,null,null,null,null,null,null,null,null,null,"000002544","OCCOTUAN","02","07","13","02","0207","000002544 - OCCOTUAN"]
[null,null,null,null,null,null,null,null,null,null,null,null,null,null,"000002545","HUAYLLABAMBA","02","07","13","03","0207","000002545 - HUAYLLABAMBA"]
[null,null,null,null,null,null,null,null,null,null,null,null,null,null,"000002546","MACHUPICCHU","02","07","13","04","0207","000002546 - MACHUPICCHU"]
[null,null,null,null,null,null,null,null,null,null,null,null,null,null,"000002547","COLLPANI","02","07","13","04","0207","000002547 - COLLPANI"]
[null,null,null,null,null,null,null,null,null,null,null,null,null,null,"000002548","MARAS","02","07","13","05","0207","000002548 - MARAS"]
[null,null,null,null,null,null,null,null,null,null,null,null,null,null,"000002549","OLLANTAYTAMBO","02","07","13","06","0207","000002549 - OLLANTAYTAMBO"]
[null,null,null,null,null,null,null,null,null,null,null,null,null,null,"000002550","CHILLCA","02","07","13","06","0207","000002550 - CHILLCA"]
[null,null,null,null,null,null,null,null,null,null,null,null,null,null,"000002551","YUCAY","02","07","13","07","0207","000002551 - YUCAY"]
[null,null,null,null,null,null,null,null,null,null,null,null,null,null,"000006974","CAMINO INCA HUAYLLABAMBA","02","07","13","04","0207","000006974 - CAMINO INCA HUAYLLABAMBA"]
[null,null,null,null,null,null,null,null,null,null,null,null,null,null,"000010060","CAS URUBAMBA -ESSALUD","02","07","13","01","0207","000010060 - CAS URUBAMBA -ESSALUD"]
[null,null,null,null,null,null,null,null,null,null,null,null,null,null,"000010073","MACHU PICCHU - ESSALUD","02","07","13","04","0207","000010073 - MACHU PICCHU - ESSALUD"]
[null,null,null,null,null,null,null,null,null,null,null,null,null,null,"000010758","CRUZPATA","02","07","13","05","0207","000010758 - CRUZPATA"]
[null,null,null,null,null,null,null,null,null,null,null,null,null,null,"000010760","PATACANCHA","02","07","13","06","0207","000010760 - PATACANCHA"]
[null,null,null,null,null,null,null,null,null,null,null,null,null,null,"000030666","MENTAL COMUNITARIO URUBAMBA","02","07","13","01","0207","000030666 - MENTAL COMUNITARIO URUBAMBA"]
[null,null,null,null,null,null,null,null,null,null,null,null,null,null,"000000000","(All)","02","08",null,null,"0208","000000000 - (All)"]
[null,null,null,null,null,null,null,null,null,null,null,null,null,null,"000002355","LA QUEBRADA","02","08","04","08","0208","000002355 - LA QUEBRADA"]
[null,null,null,null,null,null,null,null,null,null,null,null,null,null,"000002356","CCORIMAYO","02","08","04","08","0208","000002356 - CCORIMAYO"]
[null,null,null,null,null,null,null,null,null,null,null,null,null,null,"000002357","COLCCA YANATILE","02","08","04","08","0208","000002357 - COLCCA YANATILE"]
[null,null,null,null,null,null,null,null,null,null,null,null,null,null,"000002358","MUYUPAY","02","08","04","08","0208","000002358 - MUYUPAY"]
[null,null,null,null,null,null,null,null,null,null,null,null,null,null,"000002359","PUTUCUSI","02","08","04","08","0208","000002359 - PUTUCUSI"]
[null,null,null,null,null,null,null,null,null,null,null,null,null,null,"000002360","QUESQUENTO","02","08","04","08","0208","000002360 - QUESQUENTO"]
[null,null,null,null,null,null,null,null,null,null,null,null,null,null,"000002362","HUACHIBAMBA","02","08","04","08","0208","000002362 - HUACHIBAMBA"]
[null,null,null,null,null,null,null,null,null,null,null,null,null,null,"000002464","VERSALLES","02","08","09","05","0208","000002464 - VERSALLES"]
[null,null,null,null,null,null,null,null,null,null,null,null,null,null,"000002467","PUENTE SANTIAGO","02","08","09","06","0208","000002467 - PUENTE SANTIAGO"]
[null,null,null,null,null,null,null,null,null,null,null,null,null,null,"000006971","COMBAPATA YANATILE","02","08","04","08","0208","000006971 - COMBAPATA YANATILE"]
[null,null,null,null,null,null,null,null,null,null,null,null,null,null,"000006973","BELLAVISTA","02","08","04","08","0208","000006973 - BELLAVISTA"]
[null,null,null,null,null,null,null,null,null,null,null,null,null,null,"000007142","CHANCAMAYO","02","08","04","08","0208","000007142 - CHANCAMAYO"]
[null,null,null,null,null,null,null,null,null,null,null,null,null,null,"000000000","(All)","02","09",null,null,"0209","000000000 - (All)"]
[null,null,null,null,null,null,null,null,null,null,null,null,null,null,"000002290","SAN PEDRO CUSCO","02","09","01","01","0209","000002290 - SAN PEDRO CUSCO"]
[null,null,null,null,null,null,null,null,null,null,null,null,null,null,"000002291","SIETE CUARTONES","02","09","01","01","0209","000002291 - SIETE CUARTONES"]
[null,null,null,null,null,null,null,null,null,null,null,null,null,null,"000002293","MIRAFLORES","02","09","01","01","0209","000002293 - MIRAFLORES"]
[null,null,null,null,null,null,null,null,null,null,null,null,null,null,"000002294","PICCHU LA RINCONADA","02","09","01","01","0209","000002294 - PICCHU LA RINCONADA"]
[null,null,null,null,null,null,null,null,null,null,null,null,null,null,"000002295","BUENA VISTA","02","09","01","01","0209","000002295 - BUENA VISTA"]
[null,null,null,null,null,null,null,null,null,null,null,null,null,null,"000002299","POROY","02","09","01","03","0209","000002299 - POROY"]
[null,null,null,null,null,null,null,null,null,null,null,null,null,null,"999999999","(All)","02","99",null,null,"0299","999999999 - (All)"]
[null,null,null,null,null,null,null,null,null,null,null,null,null,null,"000002421","QUILLABAMBA","03","00","09","01","0300","000002421 - QUILLABAMBA"]
[null,null,null,null,null,null,null,null,null,null,null,null,null,null,"000000000","(All)","03","01",null,null,"0301","000000000 - (All)"]
[null,null,null,null,null,null,null,null,null,null,null,null,null,null,"000002422","HUAYANAY","03","01","09","01","0301","000002422 - HUAYANAY"]
[null,null,null,null,null,null,null,null,null,null,null,null,null,null,"000002423","IDMA","03","01","09","01","0301","000002423 - IDMA"]
[null,null,null,null,null,null,null,null,null,null,null,null,null,null,"000002424","POTRERO","03","01","09","01","0301","000002424 - POTRERO"]
[null,null,null,null,null,null,null,null,null,null,null,null,null,null,"000002425","ECHARATE","03","01","09","02","0301","000002425 - ECHARATE"]
[null,null,null,null,null,null,null,null,null,null,null,null,null,null,"000002430","PAMPA CONCEPCION","03","01","09","02","0301","000002430 - PAMPA CONCEPCION"]
[null,null,null,null,null,null,null,null,null,null,null,null,null,null,"000002446","CHACCO","03","01","09","02","0301","000002446 - CHACCO"]
[null,null,null,null,null,null,null,null,null,null,null,null,null,null,"000002451","CHAHUARES","03","01","09","02","0301","000002451 - CHAHUARES"]
[null,null,null,null,null,null,null,null,null,null,null,null,null,null,"000008910","SANTA ANA","03","01","09","01","0301","000008910 - SANTA ANA"]
[null,null,null,null,null,null,null,null,null,null,null,null,null,null,"000010062","QUILLABAMBA - ESSALUD","03","01","09","01","0301","000010062 - QUILLABAMBA - ESSALUD"]
[null,null,null,null,null,null,null,null,null,null,null,null,null,null,"000011744","POSTA MEDICO POLICIAL LA CONVENCION - QUILLABAMBA","03","01","09","01","0301","000011744 - POSTA MEDICO POLICIAL LA CONVENCION - QUILLABAMBA"]
[null,null,null,null,null,null,null,null,null,null,null,null,null,null,"000015842","PAVAYOC","03","01","09","01",{"$f":"CONCATENATE(Q218,R218)","v":"0301"},{"$f":"CONCATENATE(O218,\" - \",P218)","v":"000015842 - PAVAYOC"}]
[null,null,null,null,null,null,null,null,null,null,null,null,null,null,"000024653","INPE QUILLABAMBA","03","01","09","01","0301","000024653 - INPE QUILLABAMBA"]
[null,null,null,null,null,null,null,null,null,null,null,null,null,null,"000026386","MENTAL QUILLABAMBA","03","01","09","01","0301","000026386 - MENTAL QUILLABAMBA"]
[null,null,null,null,null,null,null,null,null,null,null,null,null,null,"000033273","SAN ISIDRO LABRADOR - ECHARATI","03","01","09","02","0301","000033273 - SAN ISIDRO LABRADOR - ECHARATI"]
[null,null,null,null,null,null,null,null,null,null,null,null,null,null,"000000000","(All)","03","02",null,null,"0302","000000000 - (All)"]
[null,null,null,null,null,null,null,null,null,null,null,null,null,null,"000002453","HUYRO","03","02","09","03","0302","000002453 - HUYRO"]
[null,null,null,null,null,null,null,null,null,null,null,null,null,null,"000002454","ALFAMAYO","03","02","09","03","0302","000002454 - ALFAMAYO"]
[null,null,null,null,null,null,null,null,null,null,null,null,null,null,"000002455","HUAYOPATA","03","02","09","03","0302","000002455 - HUAYOPATA"]
[null,null,null,null,null,null,null,null,null,null,null,null,null,null,"000002456","AMAYBAMBA","03","02","09","03","0302","000002456 - AMAYBAMBA"]
[null,null,null,null,null,null,null,null,null,null,null,null,null,null,"000002457","SAN PABLO HUAYOPATA","03","02","09","03","0302","000002457 - SAN PABLO HUAYOPATA"]
[null,null,null,null,null,null,null,null,null,null,null,null,null,null,"000002458","MARANURA","03","02","09","04","0302","000002458 - MARANURA"]
[null,null,null,null,null,null,null,null,null,null,null,null,null,null,"000002460","SANTA MARIA","03","02","09","04","0302","000002460 - SANTA MARIA"]
[null,null,null,null,null,null,null,null,null,null,null,null,null,null,"000002461","UCHUMAYO","03","02","09","04","0302","000002461 - UCHUMAYO"]
[null,null,null,null,null,null,null,null,null,null,null,null,null,null,"000002476","SANTA TERESA","03","02","09","08","0302","000002476 - SANTA TERESA"]
[null,null,null,null,null,null,null,null,null,null,null,null,null,null,"000002477","SULLUCUYOC","03","02","09","08","0302","000002477 - SULLUCUYOC"]
[null,null,null,null,null,null,null,null,null,null,null,null,null,null,"000002478","TOTORA","03","02","09","08","0302","000002478 - TOTORA"]
[null,null,null,null,null,null,null,null,null,null,null,null,null,null,"000010075","CAP HUYRO - ESSALUD","03","02","09","03","0302","000010075 - CAP HUYRO - ESSALUD"]
[null,null,null,null,null,null,null,null,null,null,null,null,null,null,"000000000","(All)","03","03",null,null,"0303","000000000 - (All)"]
[null,null,null,null,null,null,null,null,null,null,null,null,null,null,"000002363","TUPAC AMARU QUELLOUNO","03","03","04","08","0303","000002363 - TUPAC AMARU QUELLOUNO"]
[null,null,null,null,null,null,null,null,null,null,null,null,null,null,"000002462","OCCOBAMBA LACONVENCION","03","03","09","05","0303","000002462 - OCCOBAMBA LACONVENCION"]
[null,null,null,null,null,null,null,null,null,null,null,null,null,null,"000002463","CHINGANILLA","03","03","09","05","0303","000002463 - CHINGANILLA"]
[null,null,null,null,null,null,null,null,null,null,null,null,null,null,"000002465","QUELLOUNO","03","03","09","06","0303","000002465 - QUELLOUNO"]
[null,null,null,null,null,null,null,null,null,null,null,null,null,null,"000002466","HUILLCAPAMPA","03","03","09","06","0303","000002466 - HUILLCAPAMPA"]
[null,null,null,null,null,null,null,null,null,null,null,null,null,null,"000002468","SAN MARTIN","03","03","09","06","0303","000002468 - SAN MARTIN"]
[null,null,null,null,null,null,null,null,null,null,null,null,null,null,"000008906","ESTRELLA","03","03","09","06","0303","000008906 - ESTRELLA"]
[null,null,null,null,null,null,null,null,null,null,null,null,null,null,"000008907","MATORIATO","03","03","09","06","0303","000008907 - MATORIATO"]
[null,null,null,null,null,null,null,null,null,null,null,null,null,null,"000008908","CHIRUMBIA","03","03","09","06","0303","000008908 - CHIRUMBIA"]
[null,null,null,null,null,null,null,null,null,null,null,null,null,null,"000008909","CHAPO BOYERO","03","03","09","06","0303","000008909 - CHAPO BOYERO"]
[null,null,null,null,null,null,null,null,null,null,null,null,null,null,"000000000","(All)","03","04",null,null,"0304","000000000 - (All)"]
[null,null,null,null,null,null,null,null,null,null,null,null,null,null,"000002427","KITENI","03","04","09","02","0304","000002427 - KITENI"]
[null,null,null,null,null,null,null,null,null,null,null,null,null,null,"000002431","IVOCHOTE","03","04","09","02","0304","000002431 - IVOCHOTE"]
[null,null,null,null,null,null,null,null,null,null,null,null,null,null,"000002432","KEPASHIATO","03","04","09","02","0304","000002432 - KEPASHIATO"]
[null,null,null,null,null,null,null,null,null,null,null,null,null,null,"000002434","MATERIATO","03","04","09","02","0304","000002434 - MATERIATO"]
[null,null,null,null,null,null,null,null,null,null,null,null,null,null,"000002438","PACHIRI","03","04","09","02","0304","000002438 - PACHIRI"]
[null,null,null,null,null,null,null,null,null,null,null,null,null,null,"000002440","PANGOA","03","04","09","02","0304","000002440 - PANGOA"]
[null,null,null,null,null,null,null,null,null,null,null,null,null,null,"000002443","SANIRIATO","03","04","09","02","0304","000002443 - SANIRIATO"]
[null,null,null,null,null,null,null,null,null,null,null,null,null,null,"000002447","KAMANQUIRIATO","03","04","09","02","0304","000002447 - KAMANQUIRIATO"]
[null,null,null,null,null,null,null,null,null,null,null,null,null,null,"000002489","YUVENI","03","04","09","09","0304","000002489 - YUVENI"]
[null,null,null,null,null,null,null,null,null,null,null,null,null,null,"000002493","SELVA ALEGRE","03","04","09","09","0304","000002493 - SELVA ALEGRE"]
[null,null,null,null,null,null,null,null,null,null,null,null,null,null,"000006976","CHONTABAMBA","03","04","09","09","0304","000006976 - CHONTABAMBA"]
[null,null,null,null,null,null,null,null,null,null,null,null,null,null,"000013068","TRIO RIO","03","04","09","02","0304","000013068 - TRIO RIO"]
[null,null,null,null,null,null,null,null,null,null,null,null,null,null,"000013069","PUGUIENTIMARI","03","04","09","02","0304","000013069 - PUGUIENTIMARI"]
[null,null,null,null,null,null,null,null,null,null,null,null,null,null,"000014531","CENTRO DE ATENCIÓN PRIMARIA I ECHARATE - KITENI","03","04","09","02","0304","000014531 - CENTRO DE ATENCIÓN PRIMARIA I ECHARATE - KITENI"]
[null,null,null,null,null,null,null,null,null,null,null,null,null,null,"000024583","BCT N° 314 - KEPASHIATO","03","04","09","02","0304","000024583 - BCT N° 314 - KEPASHIATO"]
[null,null,null,null,null,null,null,null,null,null,null,null,null,null,"000000000","(All)","03","05",null,null,"0305","000000000 - (All)"]
[null,null,null,null,null,null,null,null,null,null,null,null,null,null,"000002426","KIRIGUETI","03","05","09","14","0305","000002426 - KIRIGUETI"]
[null,null,null,null,null,null,null,null,null,null,null,null,null,null,"000002428","CHOCORIARI","03","05","09","14","0305","000002428 - CHOCORIARI"]
[null,null,null,null,null,null,null,null,null,null,null,null,null,null,"000002435","MIARIA","03","05","09","14","0305","000002435 - MIARIA"]
[null,null,null,null,null,null,null,null,null,null,null,null,null,null,"000002436","NUEVA LUZ","03","05","09","14","0305","000002436 - NUEVA LUZ"]
[null,null,null,null,null,null,null,null,null,null,null,null,null,null,"000002437","NUEVO MUNDO","03","05","09","14","0305","000002437 - NUEVO MUNDO"]
[null,null,null,null,null,null,null,null,null,null,null,null,null,null,"000002441","PUERTO HUALLANA","03","05","09","14","0305","000002441 - PUERTO HUALLANA"]
[null,null,null,null,null,null,null,null,null,null,null,null,null,null,"000002442","PUERTO RICO","03","05","09","14","0305","000002442 - PUERTO RICO"]
[null,null,null,null,null,null,null,null,null,null,null,null,null,null,"000002444","SENSA","03","05","09","14","0305","000002444 - SENSA"]
[null,null,null,null,null,null,null,null,null,null,null,null,null,null,"000002445","TIMPIA","03","05","09","14","0305","000002445 - TIMPIA"]
[null,null,null,null,null,null,null,null,null,null,null,null,null,null,"000002448","KAMISEA","03","05","09","14","0305","000002448 - KAMISEA"]
[null,null,null,null,null,null,null,null,null,null,null,null,null,null,"000002452","SHIVANKORENI","03","05","09","14","0305","000002452 - SHIVANKORENI"]
[null,null,null,null,null,null,null,null,null,null,null,null,null,null,"000013066","MONTETONI","03","05","09","14","0305","000013066 - MONTETONI"]
[null,null,null,null,null,null,null,null,null,null,null,null,null,null,"000013067","TANGOSHIARI","03","05","09","14","0305","000013067 - TANGOSHIARI"]
[null,null,null,null,null,null,null,null,null,null,null,null,null,null,"000015235","NUEVA VIDA","03","05","09","14","0305","000015235 - NUEVA VIDA"]
[null,null,null,null,null,null,null,null,null,null,null,null,null,null,"000015843","CASHIRIARI","03","05","09","14","0305","000015843 - CASHIRIARI"]
[null,null,null,null,null,null,null,null,null,null,null,null,null,null,"000015844","CAMANA","03","05","09","14","0305","000015844 - CAMANA"]
[null,null,null,null,null,null,null,null,null,null,null,null,null,null,"000033274","BCT  NUEVO MUNDO","03","05","09","14","0305","000033274 - BCT  NUEVO MUNDO"]
[null,null,null,null,null,null,null,null,null,null,null,null,null,null,"000000000","(All)","03","06",null,null,"0306","000000000 - (All)"]
[null,null,null,null,null,null,null,null,null,null,null,null,null,null,"000002480","PUCYURA","03","06","09","09","0306","000002480 - PUCYURA"]
[null,null,null,null,null,null,null,null,null,null,null,null,null,null,"000002481","CCARCCO","03","06","09","11",{"$f":"CONCATENATE(Q282,R282)","v":"0306"},{"$f":"CONCATENATE(O282,\" - \",P282)","v":"000002481 - CCARCCO"}]
[null,null,null,null,null,null,null,null,null,null,null,null,null,null,"000002482","INCAHUASI","03","06","09","11","0306","000002482 - INCAHUASI"]
[null,null,null,null,null,null,null,null,null,null,null,null,null,null,"000002484","OYARA","03","06","09","09","0306","000002484 - OYARA"]
[null,null,null,null,null,null,null,null,null,null,null,null,null,null,"000002485","PACCAYBAMBA","03","06","09","11","0306","000002485 - PACCAYBAMBA"]
[null,null,null,null,null,null,null,null,null,null,null,null,null,null,"000002486","PAMPACONAS","03","06","09","09","0306","000002486 - PAMPACONAS"]
[null,null,null,null,null,null,null,null,null,null,null,null,null,null,"000002487","CHOQUETIRA","03","06","09","11","0306","000002487 - CHOQUETIRA"]
[null,null,null,null,null,null,null,null,null,null,null,null,null,null,"000002490","ARMA","03","06","09","09","0306","000002490 - ARMA"]
[null,null,null,null,null,null,null,null,null,null,null,null,null,null,"000002491","LUCMAHUAYCO","03","06","09","11","0306","000002491 - LUCMAHUAYCO"]
[null,null,null,null,null,null,null,null,null,null,null,null,null,null,"000002492","PALTAYBAMBA","03","06","09","09","0306","000002492 - PALTAYBAMBA"]
[null,null,null,null,null,null,null,null,null,null,null,null,null,null,"000013070","CHANCAVINE","03","06","09","12","0306","000013070 - CHANCAVINE"]
[null,null,null,null,null,null,null,null,null,null,null,null,null,null,"000000000","(All)","03","07",null,null,"0307","000000000 - (All)"]
[null,null,null,null,null,null,null,null,null,null,null,null,null,null,"000002429","CIRIALO                                                                                             ","03","07","09","02","0307","000002429 - CIRIALO                                                                                             "]
[null,null,null,null,null,null,null,null,null,null,null,null,null,null,"000002433","KORIBENI                                                                                            ","03","07","09","02","0307","000002433 - KORIBENI                                                                                            "]
[null,null,null,null,null,null,null,null,null,null,null,null,null,null,"000002439","PALMA REAL                                                                                          ","03","07","09","02","0307","000002439 - PALMA REAL                                                                                          "]
[null,null,null,null,null,null,null,null,null,null,null,null,null,null,"000002449","ICHIQUIATO                                                                                          ","03","07","09","02","0307","000002449 - ICHIQUIATO                                                                                          "]
[null,null,null,null,null,null,null,null,null,null,null,null,null,null,"000002450","SAN ANTONIO                                                                                         ","03","07","09","02","0307","000002450 - SAN ANTONIO                                                                                         "]
[null,null,null,null,null,null,null,null,null,null,null,null,null,null,"999999999","(All)","03","99",null,null,"0399","999999999 - (All)"]
[null,null,null,null,null,null,null,null,null,null,null,null,null,null,"000000000","(All)","04","00",null,null,"0400","000000000 - (All)"]
[null,null,null,null,null,null,null,null,null,null,null,null,null,null,"000002378","SICUANI","04","00","06","01","0400","000002378 - SICUANI"]
[null,null,null,null,null,null,null,null,null,null,null,null,null,null,"000007135","ESPINAR","04","00","08","01","0400","000007135 - ESPINAR"]
[null,null,null,null,null,null,null,null,null,null,null,null,null,null,"000000000","(All)","04","01",null,null,"0401","000000000 - (All)"]
[null,null,null,null,null,null,null,null,null,null,null,null,null,null,"000002364","YANAOCA","04","01","05","01","0401","000002364 - YANAOCA"]
[null,null,null,null,null,null,null,null,null,null,null,null,null,null,"000002365","PONGOÑA","04","01","05","01","0401","000002365 - PONGOÑA"]
[null,null,null,null,null,null,null,null,null,null,null,null,null,null,"000002372","PAMPAMARCA","04","01","05","06","0401","000002372 - PAMPAMARCA"]
[null,null,null,null,null,null,null,null,null,null,null,null,null,null,"000002373","QUEHUE","04","01","05","07","0401","000002373 - QUEHUE"]
[null,null,null,null,null,null,null,null,null,null,null,null,null,null,"000002374","HUINCHIRI","04","01","05","07","0401","000002374 - HUINCHIRI"]
[null,null,null,null,null,null,null,null,null,null,null,null,null,null,"000002375","SURIMANA","04","01","05","08","0401","000002375 - SURIMANA"]
[null,null,null,null,null,null,null,null,null,null,null,null,null,null,"000002376","TUNGASUCA","04","01","05","08","0401","000002376 - TUNGASUCA"]
[null,null,null,null,null,null,null,null,null,null,null,null,null,null,"000002377","TOCCOCCORI","04","01","05","08","0401","000002377 - TOCCOCCORI"]
[null,null,null,null,null,null,null,null,null,null,null,null,null,null,"000018241","HAMPATURA","04","01","05","01","0401","000018241 - HAMPATURA"]
[null,null,null,null,null,null,null,null,null,null,null,null,null,null,"000032339","CCOCHAPATA","04","01","05","08","0401","000032339 - CCOCHAPATA"]
[null,null,null,null,null,null,null,null,null,null,null,null,null,null,"000000000","(All)","04","02",null,null,"0402","000000000 - (All)"]
[null,null,null,null,null,null,null,null,null,null,null,null,null,null,"000002366","CHECCA","04","02","05","02","0402","000002366 - CHECCA"]
[null,null,null,null,null,null,null,null,null,null,null,null,null,null,"000002367","CHITIBAMBA","04","01","05","02","0401","000002367 - CHITIBAMBA"]
[null,null,null,null,null,null,null,null,null,null,null,null,null,null,"000007700","EL DESCANSO","04","02","05","03","0402","000007700 - EL DESCANSO"]
[null,null,null,null,null,null,null,null,null,null,null,null,null,null,"000000000","(All)","04","03",null,null,"0403","000000000 - (All)"]
[null,null,null,null,null,null,null,null,null,null,null,null,null,null,"000002320","MOSOCLLACTA","04","03","02","04","0403","000002320 - MOSOCLLACTA"]
[null,null,null,null,null,null,null,null,null,null,null,null,null,null,"000002385","CHECACUPE","04","03","06","02","0403","000002385 - CHECACUPE"]
[null,null,null,null,null,null,null,null,null,null,null,null,null,null,"000002386","COMBAPATA CANCHIS","04","03","06","03","0403","000002386 - COMBAPATA CANCHIS"]
[null,null,null,null,null,null,null,null,null,null,null,null,null,null,"000002387","CHIARA","04","03","06","03","0403","000002387 - CHIARA"]
[null,null,null,null,null,null,null,null,null,null,null,null,null,null,"000002392","PITUMARCA","04","03","06","05","0403","000002392 - PITUMARCA"]
[null,null,null,null,null,null,null,null,null,null,null,null,null,null,"000002397","TINTA","04","03","06","08","0403","000002397 - TINTA"]
[null,null,null,null,null,null,null,null,null,null,null,null,null,null,"000000000","(All)","04","04",null,null,"0404","000000000 - (All)"]
[null,null,null,null,null,null,null,null,null,null,null,null,null,null,"000002369","LANGUI","04","04","05","04","0404","000002369 - LANGUI"]
[null,null,null,null,null,null,null,null,null,null,null,null,null,null,"000002370","CONDEVILUYO","04","04","05","04","0404","000002370 - CONDEVILUYO"]
[null,null,null,null,null,null,null,null,null,null,null,null,null,null,"000002371","LAYO","04","04","05","05","0404","000002371 - LAYO"]
[null,null,null,null,null,null,null,null,null,null,null,null,null,null,"000002379","HERCCA","04","04","06","01","0404","000002379 - HERCCA"]
[null,null,null,null,null,null,null,null,null,null,null,null,null,null,"000002380","TECHO OBRERO","04","04","06","01","0404","000002380 - TECHO OBRERO"]
[null,null,null,null,null,null,null,null,null,null,null,null,null,null,"000002388","MARANGANI","04","04","06","04","0404","000002388 - MARANGANI"]
[null,null,null,null,null,null,null,null,null,null,null,null,null,null,"000002389","CHECTUYOC","04","04","06","04","0404","000002389 - CHECTUYOC"]
[null,null,null,null,null,null,null,null,null,null,null,null,null,null,"000002390","CCUYO","04","04","06","04","0404","000002390 - CCUYO"]
[null,null,null,null,null,null,null,null,null,null,null,null,null,null,"000002391","OCCOBAMBA MARANGANI","04","04","06","04","0404","000002391 - OCCOBAMBA MARANGANI"]
[null,null,null,null,null,null,null,null,null,null,null,null,null,null,"000010063","ESSALUD SICUANI","04","04","06","01","0404","000010063 - ESSALUD SICUANI"]
[null,null,null,null,null,null,null,null,null,null,null,null,null,null,"000024639","INPE SICUANI","04","04","06","01","0404","000024639 - INPE SICUANI"]
[null,null,null,null,null,null,null,null,null,null,null,null,null,null,"000024663","SANIDAD PNP  SICUANI","04","04","06","01","0404","000024663 - SANIDAD PNP  SICUANI"]
[null,null,null,null,null,null,null,null,null,null,null,null,null,null,"000000000","(All)","04","05",null,null,"0405","000000000 - (All)"]
[null,null,null,null,null,null,null,null,null,null,null,null,null,null,"000002381","QUEHUAR","04","05","06","01","0405","000002381 - QUEHUAR"]
[null,null,null,null,null,null,null,null,null,null,null,null,null,null,"000002382","UZCUPATA","04","05","06","01","0405","000002382 - UZCUPATA"]
[null,null,null,null,null,null,null,null,null,null,null,null,null,null,"000002383","LA FLORIDA","04","05","06","01","0405","000002383 - LA FLORIDA"]
[null,null,null,null,null,null,null,null,null,null,null,null,null,null,"000002384","PAMPAPHALLA","04","05","06","01","0405","000002384 - PAMPAPHALLA"]
[null,null,null,null,null,null,null,null,null,null,null,null,null,null,"000002393","PHINAYA","04","05","06","05","0405","000002393 - PHINAYA"]
[null,null,null,null,null,null,null,null,null,null,null,null,null,null,"000002394","SAN PABLO CANCHIS","04","05","06","06","0405","000002394 - SAN PABLO CANCHIS"]
[null,null,null,null,null,null,null,null,null,null,null,null,null,null,"000002395","SANTA BARBARA","04","05","06","06","0405","000002395 - SANTA BARBARA"]
[null,null,null,null,null,null,null,null,null,null,null,null,null,null,"000002396","SAN PEDRO CANCHIS","04","05","06","07","0405","000002396 - SAN PEDRO CANCHIS"]
[null,null,null,null,null,null,null,null,null,null,null,null,null,null,"000026387","MENTAL COMUNITARIO SICUANI","04","05","06","01","0405","000026387 - MENTAL COMUNITARIO SICUANI"]
[null,null,null,null,null,null,null,null,null,null,null,null,null,null,"000032923","SR DE PAMPACUCHO-SICUANI","04","05","06","01","0405","000032923 - SR DE PAMPACUCHO-SICUANI"]
[null,null,null,null,null,null,null,null,null,null,null,null,null,null,"000000000","(All)","04","06",null,null,"0406","000000000 - (All)"]
[null,null,null,null,null,null,null,null,null,null,null,null,null,null,"000002410","YAURI","04","06","08","01",{"$f":"CONCATENATE(Q349,R349)","v":"0406"},{"$f":"CONCATENATE(O349,\" - \",P349)","v":"000002410 - YAURI"}]
[null,null,null,null,null,null,null,null,null,null,null,null,null,null,"000002411","CONDOROMA","04","06","08","02","0406","000002411 - CONDOROMA"]
[null,null,null,null,null,null,null,null,null,null,null,null,null,null,"000002412","COPORAQUE","04","06","08","03","0406","000002412 - COPORAQUE"]
[null,null,null,null,null,null,null,null,null,null,null,null,null,null,"000002413","URINSAYA","04","06","08","03","0406","000002413 - URINSAYA"]
[null,null,null,null,null,null,null,null,null,null,null,null,null,null,"000002414","HUAYHUAHUASI","04","06","08","03","0406","000002414 - HUAYHUAHUASI"]
[null,null,null,null,null,null,null,null,null,null,null,null,null,null,"000002415","OCCORURO","04","06","08","04","0406","000002415 - OCCORURO"]
[null,null,null,null,null,null,null,null,null,null,null,null,null,null,"000002416","PALLPATA","04","06","08","05","0406","000002416 - PALLPATA"]
[null,null,null,null,null,null,null,null,null,null,null,null,null,null,"000002417","PICHIGUA ESPINAR","04","06","08","06","0406","000002417 - PICHIGUA ESPINAR"]
[null,null,null,null,null,null,null,null,null,null,null,null,null,null,"000002418","SAN MIGUEL","04","06","08","06","0406","000002418 - SAN MIGUEL"]
[null,null,null,null,null,null,null,null,null,null,null,null,null,null,"000002419","SUYKUTAMBO","04","06","08","07","0406","000002419 - SUYKUTAMBO"]
[null,null,null,null,null,null,null,null,null,null,null,null,null,null,"000002420","ACCOCUNCA","04","06","08","08","0406","000002420 - ACCOCUNCA"]
[null,null,null,null,null,null,null,null,null,null,null,null,null,null,"000006745","TINTAYA MARQUIRI","04","06","08","01","0406","000006745 - TINTAYA MARQUIRI"]
[null,null,null,null,null,null,null,null,null,null,null,null,null,null,"000010061","ESPINAR - ESSALUD","04","06","08","01","0406","000010061 - ESPINAR - ESSALUD"]
[null,null,null,null,null,null,null,null,null,null,null,null,null,null,"000030366","MENTAL COMUNITARIO ESPINAR \"MUSUQ KAWSAY\"","04","06","08","01","0406","000030366 - MENTAL COMUNITARIO ESPINAR \"MUSUQ KAWSAY\""]
[null,null,null,null,null,null,null,null,null,null,null,null,null,null,"999999999","(All)","04","99",null,null,"0499","999999999 - (All)"]
[null,null,null,null,null,null,null,null,null,null,null,null,null,null,"000002469","SAN JUAN DE KIMBIRI-VRAEM","05","00","09","07","0500","000002469 - SAN JUAN DE KIMBIRI-VRAEM"]
[null,null,null,null,null,null,null,null,null,null,null,null,null,null,"000000000","(All)","05","01",null,null,"0501","000000000 - (All)"]
[null,null,null,null,null,null,null,null,null,null,null,null,null,null,"000002470","CHIRUMPIARI","05","01","09","07","0501","000002470 - CHIRUMPIARI"]
[null,null,null,null,null,null,null,null,null,null,null,null,null,null,"000002471","LOBO TAHUANTINSUYO","05","01","09","07","0501","000002471 - LOBO TAHUANTINSUYO"]
[null,null,null,null,null,null,null,null,null,null,null,null,null,null,"000002472","MAPITUNARI","05","01","09","07","0501","000002472 - MAPITUNARI"]
[null,null,null,null,null,null,null,null,null,null,null,null,null,null,"000002473","UNION ROSALES","05","01","09","07","0501","000002473 - UNION ROSALES"]
[null,null,null,null,null,null,null,null,null,null,null,null,null,null,"000002474","SAMANIATO","05","01","09","07","0501","000002474 - SAMANIATO"]
[null,null,null,null,null,null,null,null,null,null,null,null,null,null,"000002475","KIMBIRI ALTO","05","01","09","07","0501","000002475 - KIMBIRI ALTO"]
[null,null,null,null,null,null,null,null,null,null,null,null,null,null,"000002479","VILLA VIRGEN","05","01","09","12","0501","000002479 - VILLA VIRGEN"]
[null,null,null,null,null,null,null,null,null,null,null,null,null,null,"000002488","VILLA KINTIARINA","05","01","09","13","0501","000002488 - VILLA KINTIARINA"]
[null,null,null,null,null,null,null,null,null,null,null,null,null,null,"000008283","PUEBLO LIBRE","05","01","09","13","0501","000008283 - PUEBLO LIBRE"]
[null,null,null,null,null,null,null,null,null,null,null,null,null,null,"000008284","MANITEA ALTA","05","01","09","07","0501","000008284 - MANITEA ALTA"]
[null,null,null,null,null,null,null,null,null,null,null,null,null,null,"000008285","ANGELES","05","01","09","07","0501","000008285 - ANGELES"]
[null,null,null,null,null,null,null,null,null,null,null,null,null,null,"000024957","BTC LA OROYA  N°34 VILLA VIRGEN","05","01","09","12","0501","000024957 - BTC LA OROYA  N°34 VILLA VIRGEN"]
[null,null,null,null,null,null,null,null,null,null,null,null,null,null,"000000000","(All)","05","02",null,null,"0502","000000000 - (All)"]
[null,null,null,null,null,null,null,null,null,null,null,null,null,null,"000002494","PICHARI","05","02","09","10","0502","000002494 - PICHARI"]
[null,null,null,null,null,null,null,null,null,null,null,null,null,null,"000002495","MANTARO","05","02","09","10","0502","000002495 - MANTARO"]
[null,null,null,null,null,null,null,null,null,null,null,null,null,null,"000002496","OMAYA","05","02","09","10","0502","000002496 - OMAYA"]
[null,null,null,null,null,null,null,null,null,null,null,null,null,null,"000002497","OTARI","05","02","09","10","0502","000002497 - OTARI"]
[null,null,null,null,null,null,null,null,null,null,null,null,null,null,"000002498","PUERTO MAYO","05","02","09","10","0502","000002498 - PUERTO MAYO"]
[null,null,null,null,null,null,null,null,null,null,null,null,null,null,"000007113","NATIVIDAD","05","02","09","10","0502","000007113 - NATIVIDAD"]
[null,null,null,null,null,null,null,null,null,null,null,null,null,null,"000007114","QUISTO CENTRAL","05","02","09","10","0502","000007114 - QUISTO CENTRAL"]
[null,null,null,null,null,null,null,null,null,null,null,null,null,null,"000015104","TAMBO DEL ENE","05","02","09","10","0502","000015104 - TAMBO DEL ENE"]
[null,null,null,null,null,null,null,null,null,null,null,null,null,null,"000015169","PITIRINQUINI","05","02","09","10","0502","000015169 - PITIRINQUINI"]
[null,null,null,null,null,null,null,null,null,null,null,null,null,null,"000015170","PICHARI BAJA","05","02","09","10","0502","000015170 - PICHARI BAJA"]
[null,null,null,null,null,null,null,null,null,null,null,null,null,null,"000024638","MILITAR PICHARI","05","02","09","10","0502","000024638 - MILITAR PICHARI"]
[null,null,null,null,null,null,null,null,null,null,null,null,null,null,"000027230","MEDICA POLICIAL PICHARI","05","02","09","10","0502","000027230 - MEDICA POLICIAL PICHARI"]
[null,null,null,null,null,null,null,null,null,null,null,null,null,null,"000027948","ESSALUD PICHARI","05","02","09","10","0502","000027948 - ESSALUD PICHARI"]
[null,null,null,null,null,null,null,null,null,null,null,null,null,null,"000032211","NUEVO PROGRESO","05","02","09","10","0502","000032211 - NUEVO PROGRESO"]
[null,null,null,null,null,null,null,null,null,null,null,null,null,null,"000033988","MENTAL COMUNITARIO PICHARI","05","02","09","10","0502","000033988 - MENTAL COMUNITARIO PICHARI"]
[null,null,null,null,null,null,null,null,null,null,null,null,null,null,"999999999","(All)","05","99",null,null,"0599","999999999 - (All)"]
[null,null,null,null,null,null,null,null,null,null,null,null,null,null,"000002398","SANTO TOMAS","06","00","07","01","0600","000002398 - SANTO TOMAS"]
[null,null,null,null,null,null,null,null,null,null,null,null,null,null,"000033097","SAMUE CHUMBIVILCAS","06","00","07","01","0600","000033097 - SAMUE CHUMBIVILCAS"]
[null,null,null,null,null,null,null,null,null,null,null,null,null,null,"000000000","(All)","06","01",null,null,"0601","000000000 - (All)"]
[null,null,null,null,null,null,null,null,null,null,null,null,null,null,"000002402","CHAMACA","06","01","07","03","0601","000002402 - CHAMACA"]
[null,null,null,null,null,null,null,null,null,null,null,null,null,null,"000002403","AÑAHUICHI","06","01","07","03","0601","000002403 - AÑAHUICHI"]
[null,null,null,null,null,null,null,null,null,null,null,null,null,null,"000002406","LIVITACA","06","01","07","05","0601","000002406 - LIVITACA"]
[null,null,null,null,null,null,null,null,null,null,null,null,null,null,"000016325","CHILLOROYA - LIVITACA","06","01","07","05","0601","000016325 - CHILLOROYA - LIVITACA"]
[null,null,null,null,null,null,null,null,null,null,null,null,null,null,"000016327","AUSANTA","06","01","07","05","0601","000016327 - AUSANTA"]
[null,null,null,null,null,null,null,null,null,null,null,null,null,null,"000016328","UCCHUCCARCCO","06","01","07","03","0601","000016328 - UCCHUCCARCCO"]
[null,null,null,null,null,null,null,null,null,null,null,null,null,null,"000016329","INGATA","06","01","07","03","0601","000016329 - INGATA"]
[null,null,null,null,null,null,null,null,null,null,null,null,null,null,"000016330","CCONCHACCOLLO","06","01","07","03","0601","000016330 - CCONCHACCOLLO"]
[null,null,null,null,null,null,null,null,null,null,null,null,null,null,"000016332","PATAQUEÑA - LIVITACA","06","01","07","05","0601","000016332 - PATAQUEÑA - LIVITACA"]
[null,null,null,null,null,null,null,null,null,null,null,null,null,null,"000016334","KISIO","06","01","07","05","0601","000016334 - KISIO"]
[null,null,null,null,null,null,null,null,null,null,null,null,null,null,"000025739","PISQUICOCHA","06","01","07","05","0601","000025739 - PISQUICOCHA"]
[null,null,null,null,null,null,null,null,null,null,null,null,null,null,"000025740","TOTORA - REYNA DE LOS ANGELES","06","01","07","05","0601","000025740 - TOTORA - REYNA DE LOS ANGELES"]
[null,null,null,null,null,null,null,null,null,null,null,null,null,null,"000000000","(All)","06","09",null,null,"0609","000000000 - (All)"]
[null,null,null,null,null,null,null,null,null,null,null,null,null,null,"000002399","PULPERA","06","09","07","01","0609","000002399 - PULPERA"]
[null,null,null,null,null,null,null,null,null,null,null,null,null,null,"000002400","ALHUACCHULLO","06","09","07","01","0609","000002400 - ALHUACCHULLO"]
[null,null,null,null,null,null,null,null,null,null,null,null,null,null,"000002401","CCAPACMARCA","06","09","07","02","0609","000002401 - CCAPACMARCA"]
[null,null,null,null,null,null,null,null,null,null,null,null,null,null,"000002404","COLQUEMARCA","06","09","07","04","0609","000002404 - COLQUEMARCA"]
[null,null,null,null,null,null,null,null,null,null,null,null,null,null,"000002405","CHARAMURAY","06","09","07","04","0609","000002405 - CHARAMURAY"]
[null,null,null,null,null,null,null,null,null,null,null,null,null,null,"000002407","LLUSCO","06","09","07","06","0609","000002407 - LLUSCO"]
[null,null,null,null,null,null,null,null,null,null,null,null,null,null,"000002408","QUIÑOTA","06","09","07","07","0609","000002408 - QUIÑOTA"]
[null,null,null,null,null,null,null,null,null,null,null,null,null,null,"000002409","VELILLE","06","09","07","08","0609","000002409 - VELILLE"]
[null,null,null,null,null,null,null,null,null,null,null,null,null,null,"000006746","LLIQUE","06","09","07","01","0609","000006746 - LLIQUE"]
[null,null,null,null,null,null,null,null,null,null,null,null,null,null,"000006747","LUTTO","06","09","07","06","0609","000006747 - LUTTO"]
[null,null,null,null,null,null,null,null,null,null,null,null,null,null,"000006748","COLLPA","06","09","07","06","0609","000006748 - COLLPA"]
[null,null,null,null,null,null,null,null,null,null,null,null,null,null,"000006981","CCOYO","06","09","07","01",{"$f":"CONCATENATE(Q422,R422)","v":"0609"},{"$f":"CONCATENATE(O422,\" - \",P422)","v":"000006981 - CCOYO"}]
[null,null,null,null,null,null,null,null,null,null,null,null,null,null,"000006982","MELLOTOTORA","06","09","07","01","0609","000006982 - MELLOTOTORA"]
[null,null,null,null,null,null,null,null,null,null,null,null,null,null,"000006983","ORCCOMA","06","09","07","01","0609","000006983 - ORCCOMA"]
[null,null,null,null,null,null,null,null,null,null,null,null,null,null,"000006984","CCOLLANA","06","09","07","07","0609","000006984 - CCOLLANA"]
[null,null,null,null,null,null,null,null,null,null,null,null,null,null,"000006985","TOTORAPALLCA","06","09","07","06","0609","000006985 - TOTORAPALLCA"]
[null,null,null,null,null,null,null,null,null,null,null,null,null,null,"000007111","YAVINA","06","09","07","01","0609","000007111 - YAVINA"]
[null,null,null,null,null,null,null,null,null,null,null,null,null,null,"000007112","YORENCCA","06","09","07","07","0609","000007112 - YORENCCA"]
[null,null,null,null,null,null,null,null,null,null,null,null,null,null,"000008912","ALCCA VICTORIA","06","09","07","08","0609","000008912 - ALCCA VICTORIA"]
[null,null,null,null,null,null,null,null,null,null,null,null,null,null,"000008913","HUARACO","06","09","07","04","0609","000008913 - HUARACO"]
[null,null,null,null,null,null,null,null,null,null,null,null,null,null,"000008914","HUAYLLANI","06","09","07","04","0609","000008914 - HUAYLLANI"]
[null,null,null,null,null,null,null,null,null,null,null,null,null,null,"000008915","PFULLPURI CONDEPAMPA","06","09","07","01","0609","000008915 - PFULLPURI CONDEPAMPA"]
[null,null,null,null,null,null,null,null,null,null,null,null,null,null,"000009963","CANCAHUANI","06","09","07","02","0609","000009963 - CANCAHUANI"]
[null,null,null,null,null,null,null,null,null,null,null,null,null,null,"000012932","YANQUE","06","09","07","04","0609","000012932 - YANQUE"]
[null,null,null,null,null,null,null,null,null,null,null,null,null,null,"000013185","CAP I SANTO TOMÁS  ESSALUD","06","09","07","01","0609","000013185 - CAP I SANTO TOMÁS  ESSALUD"]
[null,null,null,null,null,null,null,null,null,null,null,null,null,null,"000025369","PUMALLACTA","06","09","07","07","0609","000025369 - PUMALLACTA"]
[null,null,null,null,null,null,null,null,null,null,null,null,null,null,"000025371","TUNTUMA","06","09","07","08","0609","000025371 - TUNTUMA"]
[null,null,null,null,null,null,null,null,null,null,null,null,null,null,"000027008","ANTUYO","06","09","07","06","0609","000027008 - ANTUYO"]
[null,null,null,null,null,null,null,null,null,null,null,null,null,null,"000027009","TAHUAY","06","09","07","02","0609","000027009 - TAHUAY"]
[null,null,null,null,null,null,null,null,null,null,null,null,null,null,"000027011","AYACCASI","06","09","07","08","0609","000027011 - AYACCASI"]
[null,null,null,null,null,null,null,null,null,null,null,null,null,null,"000027016","HUAYCUÑUTA - URCURUTA","06","09","07","08","0609","000027016 - HUAYCUÑUTA - URCURUTA"]
[null,null,null,null,null,null,null,null,null,null,null,null,null,null,"000030940","ARCANGEL SAN MIGUEL DE ESQUINA CONGUNYA","06","09","07","01","0609","000030940 - ARCANGEL SAN MIGUEL DE ESQUINA CONGUNYA"]
[null,null,null,null,null,null,null,null,null,null,null,null,null,null,"999999999","(All)","06","99",null,null,"0699","999999999 - (All)"]
[null,null,null,null,null,null,null,null,null,null,null,null,null,null,"999999999","(All)","99","99",null,null,"9999","999999999 - (All)"]