{"text_format":"1","workbook":"xlsx","n_sheets":4,"sheets":["MENU","TABLAS","INFORME","Datos"],"not_rendered":{"charts":0,"images":30,"macros":1,"external_links":0,"defined_names":3,"comments":1,"pivot_tables":2},"unopened":[],"bounds":{"document_bytes":16777216,"sheet_cells":100000,"rows_first":2000,"rows_last":500,"rows_between":2000,"halvings":0,"cell_chars":16384,"cell_head_chars":4096},"cells_cut":0,"cells_raw":0,"read":"whole","date_system":"1900"}

{"sheet":"MENU","index":0,"n_rows":29,"n_cols":12,"rows_kept":29,"cut":false,"hidden":false,"merged":[[28,7,29,10],[26,7,27,10]]}
[]
[]
[]
[null,null,null,null,null,null,null,null,null,null,null,{"$f":"+TABLAS!A81","v":"1-3-5-6-2-8-7-4-11-9-10-Total general"}]
[null,null,null,null,null,null,null,null,null,null,null,{"$f":"+TABLAS!A118","v":"1-8-2-7-4-5-6-3-11-9-10-Total general"}]
[]
[]
[]
[]
[]
[]
[]
[]
[]
[]
[]
[]
[]
[]
[]
[]
[]
[]
[]
[]
[]
[null,null,null,null,null,null,null,"CONTROL DE MESES"]
[]
[null,null,null,null,null,null,null,{"$f":"+TABLAS!A81","v":"1-3-5-6-2-8-7-4-11-9-10-Total general"}]

{"sheet":"TABLAS","index":1,"n_rows":120,"n_cols":232,"rows_kept":120,"cut":false,"hidden":true,"merged":[[12,3,12,6],[13,3,13,6],[80,0,80,1],[117,0,117,1],[7,2,7,6],[8,3,8,6],[9,3,9,6],[10,3,10,6],[11,3,11,6]]}
[]
[]
[]
[]
[]
[]
[]
[null,null,"Valores",null,null,null,null,null,"Tabla",{"$f":"IF(I9=\"(Todas)\",\"CUSCO \",\"\")","v":""}]
[null,null,"RED","03 - LA CONVENCION",null,null,null,null,{"$f":"IF(MID(D9,1,2)=\"99\",\"(All)\",MID(D9,1,2))","v":"03"},{"$f":"IF(I9=\"(All)\",\" \",I9)","v":"03"},null,null,{"$f":"LEN(MID(D9,5,90))","v":14},null,{"$f":"IF(MID(D9,6,5)=\"(All)\",\"\",D9)","v":"03 - LA CONVENCION"}]
[null,null,"Micro RED","0399 - (All)",null,null,null,null,{"$f":"IF(MID(D10,3,2)=\"99\",\"(All)\",MID(D10,1,4))","v":"(All)"}," ",null,null,{"$f":"LEN(MID(D10,7,90))","v":6},null,{"$f":"IF(MID(D10,8,5)=\"(All)\",\"\",D10)","v":""}]
[null,null,"Establecimiento","999999999 - (All)",null,null,null,null,{"$f":"IF(OR(MID(D11,1,9)=\"999999999\",MID(D11,1,9)=\"000000000\"),\"(All)\",MID(D11,1,9))","v":"(All)"}," ",null,null,{"$f":"LEN(MID(D11,12,90))","v":6},null,{"$f":"IF(MID(D11,13,5)=\"(All)\",\"\",D11)","v":""}]
[null,null,"Provincia","00 - (All)",null,null,null,null,{"$f":"IF(MID(D12,1,2)=\"00\",\"(All)\",MID(D12,1,2))","v":"(All)"}," ",null,null,{"$f":"LEN(MID(D12,6,90))","v":5},null,{"$f":"IF(MID(D12,6,5)=\"(All)\",\"\",D12)","v":""}]
[null,null,"Distrito","0000 - (All)",null,null,null,null,{"$f":"IF(OR(MID(D13,1,4)=\"0000\",MID(D13,3,2)=\"00\"),\"(All)\",MID(D13,1,4))","v":"(All)"}," ",null,null,{"$f":"LEN(MID(D13,8,90))","v":5},null,{"$f":"IF(MID(D13,8,5)=\"(All)\",\"\",D13)","v":""}]
[null,null,"Ejecutira","99 - (ALL)",null,null,null,null,{"$f":"IF(MID(D14,1,2)=\"99\",\"(All)\",MID(D14,1,2))","v":"(All)"}," ",null,null,{"$f":"LEN(MID(D14,5,90))","v":6},null,{"$f":"IF(MID(D14,6,5)=\"(All)\",\"\",D14)","v":""}]
[]
[null,null,"Año","2024",null,null,null,null,{"$f":"+D16","v":"2024"},{"$f":"IF(I16=\"(Todas)\",\" \",I16)","v":"2024"}]
[]
[]
[]
[null,1,1,1,1,1,1,1,1,1,1,1,0,{"$f":"SUM(B20:M20)","v":11}]
[null,{"$f":"IF(B20=1,\"ENERO\",\"\")","v":"ENERO"},{"$f":"IF(C20=1,\"FEBRERO\",\"\")","v":"FEBRERO"},{"$f":"IF(D20=1,\"MARZO\",\"\")","v":"MARZO"},{"$f":"IF(E20=1,\"ABRIL\",\"\")","v":"ABRIL"},{"$f":"IF(F20=1,\"MAYO\",\"\")","v":"MAYO"},{"$f":"IF(G20=1,\"JUNIO\",\"\")","v":"JUNIO"},{"$f":"IF(H20=1,\"JULIO\",\"\")","v":"JULIO"},{"$f":"IF(I20=1,\"AGOSTO\",\"\")","v":"AGOSTO"},{"$f":"IF(J20=1,\"SETIEMBRE\",\"\")","v":"SETIEMBRE"},{"$f":"IF(K20=1,\"OCTUBRE\",\"\")","v":"OCTUBRE"},{"$f":"IF(L20=1,\"NOVIEMBRE\",\"\")","v":"NOVIEMBRE"},{"$f":"IF(M20=1,\"DICIEMBRE\",\"\")","v":""},{"$f":"IF(B20=1,B21,IF(C20=1,C21,IF(D20=1,D21,IF(E20=1,E21,IF(F20=1,F21,IF(G20=1,G21,IF(H20=1,H21,IF(I20=1,I21,IF(J20=1,J21,IF(K20=1,K21,IF(L20=1,L21,IF(M20=1,M21,\"\"))))))))))))","v":"ENERO"}]
[null,null,null,null,null,null,null,null,null,null,null,null,null,{"$f":"IF(N20=1,N21,\"\")","v":""}]
[null,2,4,6,8,10,12,14,16,18,20,22,null,{"$f":"MIN(B23:M23)","v":2},{"$f":"MAX(B23:M23)","v":22},{"$f":"MAX(C23:N23)","v":22}]
[null,{"$f":"IF(B23=2,\"ENE\",\"\")","v":"ENE"},{"$f":"IF(C23=4,\"FEB\",\"\")","v":"FEB"},{"$f":"IF(D23=6,\"MAR\",\"\")","v":"MAR"},{"$f":"IF(E23=8,\"ABR\",\"\")","v":"ABR"},{"$f":"IF(F23=10,\"MAY\",\"\")","v":"MAY"},{"$f":"IF(G23=12,\"JUN\",\"\")","v":"JUN"},{"$f":"IF(H23=14,\"JUL\",\"\")","v":"JUL"},{"$f":"IF(I23=16,\"AGO\",\"\")","v":"AGO"},{"$f":"IF(J23=18,\"SET\",\"\")","v":"SET"},{"$f":"IF(K23=20,\"OCT\",\"\")","v":"OCT"},{"$f":"IF(L23=22,\"NOV\",\"\")","v":"NOV"},{"$f":"IF(M23=24,\"DIC\",\"\")","v":""},{"$f":"IF(N23=B23,B24,IF(N23=C23,C24,IF(N23=D23,D24,IF(N23=E23,E24,IF(N23=F23,F24,IF(N23=G23,G24,IF(N23=H23,#REF!,IF(N23=I23,I24,IF(N23=J23,J24,IF(N23=K23,K24,IF(N23=L23,L24,IF(N23=M23,M24,\"\"))))))))))))","v":"ENE"},{"$f":"IF(O23=C23,C24,IF(O23=D23,D24,IF(O23=E23,E24,IF(O23=F23,F24,IF(O23=G23,G24,IF(O23=H23,H24,IF(O23=I23,I24,IF(O23=J23,J24,IF(O23=K23,K24,IF(O23=L23,L24,IF(O23=M23,M24,\"\")))))))))))","v":"NOV"},{"$f":"IF(P23=D23,D24,IF(P23=E23,E24,IF(P23=F23,F24,IF(P23=G23,G24,IF(P23=H23,H24,IF(P23=I23,I24,IF(P23=J23,J24,IF(P23=K23,K24,IF(P23=L23,L24,IF(P23=M23,M24,IF(P23=N23,N24,\"\")))))))))))","v":"NOV"}]
[null,null,null,null,null,null,null,null,null,null,null,null,null,{"$f":"CONCATENATE(N24,\" - \",O24)","v":"ENE - NOV"}]
[null,null,null,null,null,null,null,null,null,null,null,null,null,{"$f":"IF(N23=O23,N22,N25)","v":"ENE - NOV"}]
[]
[]
[]
[]
[]
[]
[]
[]
[]
[]
[]
[]
[]
[]
[]
[]
[]
[]
[]
[]
[]
[]
[]
["ADULTO_01"]
["anno",2024]
["cod_red","03"]
["codmic","(Todas)"]
["cod_prov","(Todas)"]
["coddist","(Todas)"]
["cod_estab","(Todas)"]
["cod_eje","(Todas)"]
[]
[null,"Valores"]
["Etiquetas de fila"," BAS001"," BAS002"," BAS003"," BAS004"," BAS005"," BAS006"," BAS007"," BAS008"," BAS009"," BAS010"," BAS011"," BAS012"," BAS013"," BAS014"," BAS015"," BAS016"," BAS017"," BAS018"," BAS019"," BAS020"," BAS021"," BAS022"," BAS023"," BAS024"," BAS025"," BAS026"," BAS027"," BAS028"," BAS029"," BAS030"," BAS031"," BAS032"," BAS033"," BAS034"," BAS035"," BAS036"," BAS037"," BAS038"," BAS039"," BAS040"," BAS041"," BAS042"," BAS043"," BAS044"," BAS045"," BAS046"," BAS047"," BAS048"," BAS049"," BAS050"," BAS051"," BAS052"," BAS053"," BAS054"," BAS055"," BAS056"," BAS057"," BAS058"," BAS059"," BAS060"," BAS061"," BAS062"," BAS063"," BAS064"," BAS065"," BAS066"," BAS067"," BAS068"," BAS069"," BAS070"," BAS071"," BAS072"," BAS073"," BAS074"," BAS075"," BAS076"," BAS077"," BAS078"," BAS079"," BAS080"," BAS081"," BAS082"," BAS083"," BAS084"," BAS085"," BAS086"," BAS087"," BAS088"," BAS089"," BAS090"," BAS091"," BAS092"," BAS093"," BAS094"," BAS095"," BAS096"," BAS097"," BAS098"," BAS099"," BAS100"," BAS101"," BAS102"," BAS103"," BAS104"," BAS105"," BAS106"," BAS107"," BAS108"," BAS109"," BAS110"," BAS111"," BAS112"," BAS113"," BAS114"," BAS115"," BAS116"," BAS117"," BAS118"," BAS119"," BAS120"," BAS121"," BAS122"," BAS123"," BAS124"," BAS125"," BAS126"," BAS127"," BAS128"," BAS129"," BAS130"," BAS131"," BAS132"," BAS133"," BAS134"," BAS135"," BAS136"," BAS137"," BAS138"," BAS139"," BAS140"," BAS141"," BAS142"," BAS143"," BAS144"," BAS145"," BAS146"," BAS147"," BAS148"," BAS149"," BAS150"," BAS151"," BAS152"," BAS153"," BAS154"," BAS155"," BAS156"," BAS157"," BAS158"," BAS159"," BAS160"," BAS161"," BAS162"," BAS163"," BAS164"," BAS165"," BAS166"," BAS167"," BAS168"," BAS169"," BAS170"," BAS171"," BAS172"," BAS173"," BAS174"," BAS175"," BAS176"," BAS177"," BAS178"," BAS179"," BAS180"," BAS181"," BAS182"," BAS183"," BAS184"," BAS185"," BAS186"," BAS187"," BAS188"," BAS189"," BAS190"," BAS191"," BAS192"," BAS193"," BAS194"," BAS195"," BAS196"," BAS197"," BAS198"," BAS199"," BAS200"," BAS201"," BAS202"," BAS203"," BAS204"," BAS205"," BAS206"," BAS207"," BAS208"," BAS209"," BAS210"," BAS211"," BAS212"," BAS213"," BAS214"," BAS215"," BAS216"," BAS217"," BAS218"," BAS219"," BAS220"," BAS221"," BAS222"," BAS223"," BAS224"," BAS225"," BAS226"," BAS227"," BAS228"," BAS229"," BAS230"]
[1,0,168,58,276,71,125,195,313,29,44,103,316,64,162,104,229,220,348,79,508,4,7,0,0,0,0,0,0,0,0,12,56,11,50,5,43,0,0,0,0,15,10,7,23,6,0,0,0,0,0,4,2,36,131,0,0,16,17,0,0,0,0,0,0,7,17,0,0,0,3,0,0,0,0,64,1252,0,23,0,54,0,27,0,0,0,0,1,2,1,0,51,176,90,704,190,435,190,436,131,144,129,142,28,24,24,7,25,26,790,3222,1,0,10,0,3,0,0,0,2,0,0,0,4,0,0,0,1,0,4,0,174,1234,2,105,0,1,0,0,0,0,0,0,0,0,0,0,95,243,0,8,64,2,86,224,0,15,60,1,9,21,1,0,1,0,13,25,0,0,53,1,0,6,0,0,4,0,0,0,0,0,0,0,0,0,0,0,6,37,0,0,16,0,0,0,0,0,0,0,76,131,84,151,0,0,0,0,0,0,0,0,0,0,0,0,0,0,0,0,0,0,0,0,0,0,0,0,0,0,0,0]
[3,1,170,108,320,67,98,180,272,24,33,74,237,64,132,85,189,203,302,95,465,4,3,0,0,0,0,0,0,0,0,8,39,14,55,4,31,0,3,0,2,4,15,8,20,8,0,0,0,0,0,1,7,87,174,0,0,6,4,1,0,0,0,1,2,6,8,0,3,0,4,0,0,0,0,53,898,4,178,0,33,0,51,0,0,0,0,3,5,3,0,38,163,65,649,143,394,141,398,87,236,86,236,19,29,19,13,16,35,1140,3600,4,0,50,0,0,1,0,0,1,0,1,0,3,2,0,0,0,0,8,0,306,1129,52,437,0,0,0,0,0,0,0,0,0,0,0,0,80,187,4,5,43,20,69,174,6,16,41,23,9,18,1,0,1,0,11,32,0,3,37,20,0,3,0,0,0,0,0,0,0,0,0,0,0,0,0,0,7,35,0,0,19,1,0,0,0,0,0,0,112,141,114,146,0,0,0,0,0,0,0,0,0,0,0,0,0,0,0,0,0,0,0,0,0,0,0,0,0,0,0,0]
[5,1,145,64,266,91,157,298,444,42,69,58,166,54,82,76,151,214,316,94,429,9,29,0,0,0,0,0,0,0,0,9,45,7,32,6,38,1,2,0,3,6,13,6,10,7,0,0,3,0,0,2,7,44,155,0,0,6,7,2,1,0,0,0,0,4,7,0,1,0,2,0,0,0,0,57,365,18,553,0,49,0,42,0,1,0,0,2,2,1,0,47,184,63,739,87,522,79,564,61,282,59,311,25,23,24,6,33,44,850,3690,3,0,20,0,0,0,0,0,0,0,1,0,1,0,0,0,0,0,15,0,162,733,82,444,0,0,0,0,0,0,0,0,0,0,0,0,60,117,7,18,29,29,57,109,11,20,30,28,8,10,0,0,0,0,4,18,4,6,30,27,3,11,0,1,4,0,0,0,0,0,0,0,0,0,0,0,1,25,0,0,8,1,0,0,0,0,0,0,114,144,121,149,0,0,0,0,0,0,0,0,0,0,0,0,0,0,0,0,0,0,0,0,0,0,0,0,0,0,0,0]
[6,1,155,71,284,94,166,266,420,38,46,75,229,52,130,87,172,190,319,71,333,17,54,0,0,0,0,0,0,0,0,5,56,5,37,7,40,1,1,0,1,6,4,2,8,3,0,0,0,0,0,2,3,55,178,0,0,5,4,0,0,0,0,0,0,5,7,0,4,0,2,0,0,0,1,59,337,32,515,1,73,0,47,0,0,0,0,2,2,2,0,40,161,51,644,86,460,84,459,67,287,64,286,22,35,21,15,26,58,820,4280,6,1,50,30,0,0,0,0,0,0,0,0,5,0,0,0,0,0,16,0,169,702,171,1002,0,0,0,0,0,0,0,0,0,0,0,0,69,180,5,29,54,21,73,175,5,30,47,21,4,14,0,0,1,0,11,42,2,13,43,18,1,2,0,1,1,0,1,0,0,0,0,0,0,0,0,0,2,32,0,0,5,1,0,0,0,0,0,0,132,200,133,219,0,0,0,0,0,0,0,0,0,0,0,0,0,0,0,0,0,0,0,0,0,0,0,0,0,0,0,0]
[2,3,132,55,259,30,89,134,210,14,22,66,208,50,111,88,163,199,306,79,419,2,5,0,0,0,0,0,0,0,0,4,36,10,28,2,17,0,0,0,1,3,7,3,10,5,0,0,0,0,0,2,6,42,180,0,0,6,8,0,0,0,0,1,0,4,5,0,0,0,3,0,0,0,0,90,1092,5,174,0,50,0,34,0,0,0,0,11,2,10,1,62,180,107,717,150,446,149,454,94,218,93,218,30,31,29,13,41,48,1530,3720,1,0,10,0,0,0,0,0,0,0,1,0,5,0,0,0,0,0,4,0,173,1122,25,217,0,0,0,0,0,0,0,0,0,0,0,0,63,139,0,8,35,11,57,139,2,11,35,13,4,5,0,0,0,0,2,11,0,0,30,13,0,5,0,0,2,0,1,1,0,0,0,0,0,0,0,0,2,35,0,0,5,0,0,0,0,0,0,0,115,117,114,117,0,0,0,0,0,0,0,0,0,0,0,0,0,0,0,0,0,0,0,0,0,0,0,0,0,0,0,0]
[8,0,140,70,266,67,143,202,373,22,40,65,206,55,130,85,199,191,309,71,407,13,28,0,4,0,0,0,0,0,0,19,69,11,35,3,36,0,1,0,1,9,6,5,9,3,0,0,0,0,0,6,13,52,173,0,0,5,4,1,0,0,0,2,2,6,8,0,2,0,2,1,0,0,0,56,336,20,291,1,67,0,43,0,0,0,0,0,1,0,0,47,171,53,675,102,517,101,516,78,275,73,284,25,13,25,7,37,38,946,3481,2,0,11,0,0,0,0,0,0,0,1,0,4,0,0,0,3,0,58,0,150,545,67,407,0,0,0,0,0,0,0,0,0,0,0,0,61,142,6,27,48,28,56,140,12,34,45,26,5,19,0,0,0,0,8,27,0,5,34,24,1,0,0,0,0,0,0,0,0,0,0,0,0,0,0,0,6,43,0,0,7,0,0,0,0,0,0,0,23,16,20,17,0,0,0,0,0,0,0,0,0,0,0,0,0,0,0,0,0,0,0,0,0,0,0,0,0,0,0,0]
[7,1,137,116,290,132,172,322,502,35,71,89,226,80,126,78,149,213,269,67,372,26,31,0,0,0,0,0,0,0,1,12,53,11,37,6,37,1,1,0,0,5,7,8,6,6,0,0,0,0,0,4,2,90,185,0,0,7,4,0,0,0,0,0,0,4,7,0,2,0,3,0,0,0,0,40,293,19,359,1,45,0,45,0,1,0,0,3,1,2,0,35,158,70,632,100,519,100,521,69,278,64,279,23,20,22,4,18,36,690,3490,4,3,40,90,0,0,0,0,1,0,0,0,3,0,0,0,0,0,17,0,217,801,76,552,0,0,0,0,0,0,0,0,0,0,0,0,82,149,7,30,57,25,65,145,11,29,52,25,7,15,0,0,1,0,16,29,1,5,50,25,0,2,0,0,0,0,0,0,0,0,0,0,0,0,0,0,8,36,0,0,10,0,0,0,0,0,0,0,30,41,32,38,0,0,0,0,0,0,0,0,0,0,0,0,0,0,0,0,0,0,0,0,0,0,0,0,0,0,0,0]
[4,1,167,98,361,62,106,191,300,34,45,111,233,76,131,92,206,222,345,86,563,6,6,0,0,0,1,0,0,0,0,12,56,16,41,8,39,0,6,0,3,7,17,7,5,6,0,0,0,0,0,4,11,71,225,0,0,9,13,0,0,0,0,0,0,4,11,0,3,0,4,0,0,0,0,64,564,9,489,0,68,0,55,0,0,0,1,2,2,2,0,39,167,53,665,127,512,124,511,99,264,95,264,38,29,38,10,36,28,1082,3200,4,0,50,0,0,0,0,0,0,0,0,0,0,1,0,0,1,0,13,0,231,1075,128,430,0,0,0,0,0,0,0,0,0,0,0,0,107,187,8,23,46,37,94,169,9,25,43,34,12,13,0,0,0,0,27,50,1,9,34,33,1,6,0,1,2,0,0,0,0,0,0,0,0,0,0,0,5,39,0,0,19,1,0,0,0,0,0,0,109,159,117,170,0,0,0,0,0,0,0,0,0,0,0,0,0,0,0,0,0,0,0,0,0,0,0,0,0,0,0,0]
[11,1,164,62,224,57,86,157,270,11,31,52,179,54,133,95,212,219,385,56,500,0,3,0,1,0,0,0,0,0,0,8,37,2,34,6,21,0,0,0,1,0,1,2,5,4,0,0,0,0,0,3,6,51,153,0,0,4,8,0,0,0,0,0,0,4,8,0,0,0,0,0,1,0,0,55,250,18,175,3,44,0,47,0,0,0,0,1,1,1,0,35,150,53,592,52,518,49,514,64,295,59,294,22,11,22,34,43,50,1050,3370,1,0,10,0,0,0,0,0,0,0,1,0,3,0,0,0,0,0,3,0,156,553,167,405,0,0,0,0,1,0,0,0,0,0,0,0,48,138,15,33,43,24,46,130,14,40,41,23,4,9,0,1,0,1,5,19,4,8,41,23,1,1,0,0,0,0,0,1,0,0,0,0,0,0,0,0,2,22,0,0,17,1,0,0,0,0,0,0,4,19,3,20,0,0,0,0,0,0,0,0,0,0,0,0,0,0,0,0,0,0,0,0,0,0,0,0,0,0,0,0]
[9,1,115,87,263,55,126,165,358,21,46,97,190,63,111,95,208,228,293,74,429,5,9,2,4,0,0,0,0,0,0,11,39,8,34,3,27,0,2,0,0,7,6,1,7,3,0,0,0,0,0,4,11,64,164,0,0,3,7,1,0,0,0,1,0,6,12,0,0,0,2,0,0,0,0,43,297,23,238,0,72,0,52,0,0,0,0,0,0,0,0,30,193,59,776,76,476,76,483,100,289,72,289,27,28,25,10,19,57,690,4180,2,1,20,13,0,0,0,0,0,0,0,0,1,2,0,0,0,0,50,2,137,557,56,404,0,0,0,0,0,0,0,0,0,0,0,0,79,141,9,28,38,27,66,130,15,38,38,26,7,12,0,0,0,0,3,11,2,13,34,26,1,1,0,0,0,0,0,0,0,0,0,0,0,0,0,0,5,42,0,0,15,3,0,0,0,0,0,0,7,14,7,10,0,0,0,0,0,0,0,0,0,0,0,0,0,0,0,0,0,0,0,0,0,0,0,0,0,0,0,0]
[10,0,141,69,245,56,123,155,312,31,39,80,201,66,147,94,173,246,351,63,471,6,16,8,3,0,0,0,0,1,0,12,44,8,35,3,31,0,0,0,2,5,3,7,4,3,0,0,0,0,0,4,5,55,153,0,0,2,7,0,1,0,0,0,0,2,5,0,3,0,4,0,0,0,0,53,355,18,232,0,46,1,47,0,0,0,0,2,0,2,0,36,163,44,671,68,541,65,529,64,293,62,290,30,15,28,9,19,42,770,4450,0,0,0,0,0,0,0,0,4,0,0,0,1,0,1,0,0,0,1,0,218,736,190,858,0,0,0,0,0,0,0,0,0,0,0,0,71,141,9,36,33,16,62,140,7,40,31,17,10,18,0,0,0,0,13,21,0,4,27,15,1,3,0,2,0,0,0,1,0,0,0,0,0,0,0,0,5,30,0,0,6,1,0,0,0,0,0,0,14,13,13,12,0,0,0,0,0,0,0,0,0,0,0,0,0,0,0,0,0,0,0,0,0,0,0,0,0,0,0,0]
["Total general",10,1634,858,3054,782,1391,2265,3774,301,486,870,2391,678,1395,979,2051,2345,3543,835,4896,92,191,10,12,0,1,0,0,1,1,112,530,103,418,53,360,3,16,0,14,67,89,56,107,54,0,0,3,0,0,36,73,647,1871,0,0,69,83,5,2,0,0,5,4,52,95,0,18,0,29,1,1,0,1,634,6039,166,3227,6,601,1,490,0,2,0,1,27,18,24,1,460,1866,708,7464,1181,5340,1158,5385,914,2861,856,2893,289,258,277,128,313,462,10358,40683,28,5,271,133,3,1,0,0,8,0,5,0,30,5,1,0,5,0,189,2,2093,9187,1016,5261,0,1,0,0,1,0,0,0,0,0,0,0,815,1764,70,245,490,240,731,1675,92,298,463,237,79,154,2,1,4,1,113,285,14,66,413,225,9,40,0,5,13,0,2,3,0,0,0,0,0,0,0,0,49,376,0,0,127,9,0,0,0,0,0,0,736,995,758,1049,0,0,0,0,0,0,0,0,0,0,0,0,0,0,0,0,0,0,0,0,0,0,0,0,0,0,0,0]
[]
[]
[]
[]
[]
[]
["TOTAL"]
[{"$f":"COUNT(A61:A77)","v":11},{"$f":"SUM(B61:B77)","v":20},{"$f":"SUM(C61:C77)","v":3268},1716,6108,1564,2782,4530,7548,602,972,1740,4782,1356,2790,1958,4102,4690,7086,1670,9792,184,382,20,24,0,2,0,0,2,2,224,1060,206,836,106,720,6,32,0,28,134,178,112,214,108,0,0,6,0,0,72,146,1294,3742,0,0,138,166,10,4,0,0,10,8,104,{"$f":"SUM(BO61:BO77)","v":190},0,36,0,58,2,2,0,2,1268,12078,332,6454,12,1202,2,980,0,4,0,2,54,36,48,2,920,3732,1416,14928,2362,10680,2316,10770,1828,5722,1712,5786,578,516,554,256,626,924,20716,81366,56,10,542,266,6,2,0,0,16,0,10,0,60,10,2,0,10,0,378,{"$f":"SUM(EA61:EA77)","v":4},4186,18374,2032,10522,0,2,0,0,2,0,0,0,0,0,0,0,1630,3528,140,490,980,480,1462,3350,184,596,926,474,158,308,4,2,8,2,226,570,28,132,826,450,18,80,0,10,26,0,4,6,0,0,0,0,0,0,0,0,98,752,0,0,254,18,0,{"$f":"SUM(GM61:GM77)","v":0},0,0,0,0,1472,1990,1516,2098,0,0,0,0,0,0,0,0,0,0,0,0,0,0,0,0,0,0,0,0,0,0,0,0,0,0,0,0,0]
[{"$f":"CONCATENATE(A61,\"-\",A62,\"-\",A63,\"-\",A64,\"-\",A65,\"-\",A66,\"-\",A67,\"-\",A68,\"-\",A69,\"-\",A70,\"-\",A71,\"-\",A72)","v":"1-3-5-6-2-8-7-4-11-9-10-Total general"}]
[null," BAS001"," BAS002"," BAS003"," BAS004"," BAS005"," BAS006"," BAS007"," BAS008"," BAS009"," BAS010"," BAS011"," BAS012"," BAS013"," BAS014"," BAS015"," BAS016"," BAS017"," BAS018"," BAS019"," BAS020"," BAS021"," BAS022"," BAS023"," BAS024"," BAS025"," BAS026"," BAS027"," BAS028"," BAS029"," BAS030"," BAS031"," BAS032"," BAS033"," BAS034"," BAS035"," BAS036"," BAS037"," BAS038"," BAS039"," BAS040"," BAS041"," BAS042"," BAS043"," BAS044"," BAS045"," BAS046"," BAS047"," BAS048"," BAS049"," BAS050"," BAS051"," BAS052"," BAS053"," BAS054"," BAS055"," BAS056"," BAS057"," BAS058"," BAS059"," BAS060"," BAS061"," BAS062"," BAS063"," BAS064"," BAS065"," BAS066"," BAS067"," BAS068"," BAS069"," BAS070"," BAS071"," BAS072"," BAS073"," BAS074"," BAS075"," BAS076"," BAS077"," BAS078"," BAS079"," BAS080"," BAS081"," BAS082"," BAS083"," BAS084"," BAS085"," BAS086"," BAS087"," BAS088"," BAS089"," BAS090"," BAS091"," BAS092"," BAS093"," BAS094"," BAS095"," BAS096"," BAS097"," BAS098"," BAS099"," BAS100"," BAS101"," BAS102"," BAS103"," BAS104"," BAS105"," BAS106"," BAS107"," BAS108"," BAS109"," BAS110"," BAS111"," BAS112"," BAS113"," BAS114"," BAS115"," BAS116"," BAS117"," BAS118"," BAS119"," BAS120"," BAS121"," BAS122"," BAS123"," BAS124"," BAS125"," BAS126"," BAS127"," BAS128"," BAS129"," BAS130"," BAS131"," BAS132"," BAS133"," BAS134"," BAS135"," BAS136"," BAS137"," BAS138"," BAS139"," BAS140"," BAS141"," BAS142"," BAS143"," BAS144"," BAS145"," BAS146"," BAS147"," BAS148"," BAS149"," BAS150"," BAS151"," BAS152"," BAS153"," BAS154"," BAS155"," BAS156"," BAS157"," BAS158"," BAS159"," BAS160"," BAS161"," BAS162"," BAS163"," BAS164"," BAS165"," BAS166"," BAS167"," BAS168"," BAS169"," BAS170"," BAS171"," BAS172"," BAS173"," BAS174"," BAS175"," BAS176"," BAS177"," BAS178"," BAS179"," BAS180"," BAS181"," BAS182"," BAS183"," BAS184"," BAS185"," BAS186"," BAS187"," BAS188"," BAS189"," BAS190"," BAS191"," BAS192"," BAS193"," BAS194"," BAS195"," BAS196"," BAS197"," BAS198"," BAS199"," BAS200"," BAS201"," BAS202"," BAS203"," BAS204"," BAS205"," BAS206"," BAS207"," BAS208"," BAS209"," BAS210"," BAS211"," BAS212"," BAS213"," BAS214"," BAS215"," BAS216"," BAS217"," BAS218"," BAS219"," BAS220"," BAS221"," BAS222"," BAS223"," BAS224"," BAS225"," BAS226"," BAS227"," BAS228"," BAS229"," BAS230"]
[null,{"$f":"IF(B82=B60,\"SI\",\"NO\")","v":"SI"},{"$f":"IF(C82=C60,\"SI\",\"NO\")","v":"SI"},"SI","SI","SI","SI","SI","SI","SI","SI","SI","SI","SI","SI","SI","SI","SI","SI","SI","SI","SI","SI","SI","SI","SI","SI","SI","SI","SI","SI","SI","SI","SI","SI","SI","SI","SI","SI","SI","SI","SI","SI","SI","SI","SI","SI","SI","SI","SI","SI","SI","SI","SI","SI","SI","SI","SI","SI","SI","SI","SI","SI","SI","SI","SI",{"$f":"IF(BO82=BO60,\"SI\",\"NO\")","v":"SI"},"SI","SI","SI","SI","SI","SI","SI","SI","SI","SI","SI","SI","SI","SI","SI","SI","SI","SI","SI","SI","SI","SI","SI","SI","SI","SI","SI","SI","SI","SI","SI","SI","SI","SI","SI","SI","SI","SI","SI","SI","SI","SI","SI","SI","SI","SI","SI","SI","SI","SI","SI","SI","SI","SI","SI","SI","SI","SI","SI","SI","SI","SI","SI",{"$f":"IF(EA82=EA60,\"SI\",\"NO\")","v":"SI"},"SI","SI","SI","SI","SI","SI","SI","SI","SI","SI","SI","SI","SI","SI","SI","SI","SI","SI","SI","SI","SI","SI","SI","SI","SI","SI","SI","SI","SI","SI","SI","SI","SI","SI","SI","SI","SI","SI","SI","SI","SI","SI","SI","SI","SI","SI","SI","SI","SI","SI","SI","SI","SI","SI","SI","SI","SI","SI","SI","SI","SI","SI","SI",{"$f":"IF(GM82=GM60,\"SI\",\"NO\")","v":"SI"},"SI","SI","SI","SI","SI","SI","SI","SI","SI","SI","SI","SI","SI","SI","SI","SI","SI","SI","SI","SI","SI","SI","SI","SI","SI","SI","SI","SI","SI","SI","SI","SI","SI","SI","SI","SI"]
[]
[]
[]
[]
["ADULTO_02"]
["anno",2024]
["cod_red","03"]
["codmic","(Todas)"]
["cod_prov","(Todas)"]
["coddist","(Todas)"]
["cod_estab","(Todas)"]
["cod_eje","(Todas)"]
[]
[null,"Valores"]
["Etiquetas de fila"," BAS001"," BAS002"," BAS003"," BAS004"," BAS005"," BAS006"," BAS007"," BAS008"," BAS009"," BAS010"," BAS011"," BAS012"," BAS013"," BAS014"," BAS015"," BAS016"," BAS017"," BAS018"," BAS019"," BAS020"," BAS021"," BAS022"," BAS023"," BAS024"," BAS025"," BAS026"," BAS027"," BAS028"," BAS029"," BAS030"," BAS032"," BAS033"," BAS034"," BAS035"," BAS036"," BAS037"," BAS038"," BAS039"," BAS040"," BAS041"," BAS042"," BAS043"," BAS044"," BAS045"," BAS046"," BAS047"," BAS048"," BAS049"," BAS050"," BAS051"," BAS052"," BAS053"," BAS054"," BAS055"," BAS056"," BAS057"," BAS058"," BAS059"," BAS060"," BAS061"," BAS062"," BAS063"," BAS064"," BAS065"," BAS066"," BAS067"," BAS068"," BAS069"," BAS070"," BAS071"," BAS072"," BAS073"," BAS074"," BAS075"," BAS076"," BAS077"," BAS078"," BAS079"," BAS080"," BAS081"," BAS082"," BAS083"," BAS084"," BAS085"," BAS086"," BAS087"," BAS088"," BAS089"," BAS090"," BAS091"," BAS092"," BAS093"," BAS094"," BAS095"," BAS096"," BAS097"," BAS098"," BAS099"," BAS100"," BAS101"," BAS102"," BAS103"," BAS104"," BAS105"," BAS106"," BAS107"," BAS108"," BAS109"," BAS110"," BAS111"," BAS112"," BAS113"," BAS114"," BAS115"," BAS116"," BAS117"," BAS118"," BAS119"," BAS120"," BAS121"," BAS122"," BAS123"," BAS124"," BAS125"," BAS126"," BAS127"," BAS128"," BAS129"," BAS130"," BAS131"," BAS132"," BAS133"," BAS134"," BAS135"," BAS136"," BAS137"," BAS138"," BAS139"," BAS140"," BAS141"," BAS142"," BAS143"," BAS144"," BAS145"," BAS146"," BAS147"," BAS148"," BAS149"," BAS150"," BAS151"," BAS152"," BAS153"," BAS154"," BAS155"," BAS156"," BAS157"," BAS158"," BAS159"," BAS160"," BAS161"," BAS162"," BAS163"," BAS164"," BAS165"," BAS166"," BAS167"," BAS168"," BAS169"," BAS170"," BAS171"," BAS172"," BAS173"," BAS174"," BAS175"," BAS176"," BAS177"," BAS178"," BAS179"," BAS180"," BAS181"," BAS182"," BAS183"," BAS184"," BAS185"," BAS186"," BAS187"," BAS188"," BAS189"," BAS190"," BAS191"," BAS192"," BAS193"," BAS194"," BAS195"," BAS196"," BAS197"," BAS198"," BAS199"," BAS200"," BAS201"," BAS202"," BAS203"," BAS204"," BAS205"," BAS206"," BAS207"," BAS208"," BAS209"," BAS210"," BAS211"," BAS212"," BAS213"," BAS214"," BAS215"," BAS216"," BAS217"," BAS218"," BAS219"," BAS220"," BAS221"," BAS222"," BAS223"," BAS224"," BAS225"," BAS226"," BAS227"," BAS228"," BAS229"," BAS230"]
[1,1,0,0,0,41,15,3,47,14,0,0,24,0,0,0,0,0,252,777,276,699,1,13,272,689,0,0,0,0,24,56,92,0,0,0,1,23,113,12,20,8,7,0,0,0,0,1,1,0,0,0,0,0,0,0,0,0,0,0,0,0,0,0,0,0,0,0,0,0,0,0,0,0,0,0,0,613,1546,0,964,148,0,0,0,0,0,0,0,0,0,0,0,0,0,0,0,0,0,0,0,0,0,0,0,0,0,0,0,0,0,0,0,0,0,0,0,0,0,0,0,0,0,0,0,0,0,0,0,0,0,0,0,0,0,0,0,0,0,0,0,0,0,0,0,0,0,0,0,0,0,0,0,0,0,0,0,0,0,0,0,0,0,0,0,0,0,0,0,0,0,0,0,0,0,0,0,0,0,0,0,0,0,0,0,0,0,0,0,0,0,0,0,0,0,0,0,0,0,0,0,0,0,0,0,0,0,0,0,0,0,0,0,0,0,0,0,0,0,0,0,0,0,0,0,0,0,0,0,0]
[8,1,0,0,0,41,18,2,41,19,0,0,13,2,0,0,0,0,456,650,456,575,3,0,454,569,0,0,0,0,13,31,78,0,0,0,0,32,128,1,4,1,2,1,1,1,2,0,0,0,0,0,0,0,0,0,0,0,0,0,0,0,0,0,0,0,0,0,0,0,0,0,0,0,0,0,0,628,1188,0,322,109,0,0,0,0,0,0,0,0,0,0,0,0,0,0,0,0,0,0,0,0,0,0,0,0,0,0,0,0,0,0,0,0,0,0,0,0,0,0,0,0,0,0,0,0,0,0,0,0,0,0,0,0,0,0,0,0,0,0,0,0,0,0,0,0,0,0,0,0,0,0,0,0,0,0,0,0,0,0,0,0,0,0,0,0,0,0,0,0,0,0,0,0,0,0,0,0,0,0,0,0,0,0,0,0,0,0,0,0,0,0,0,0,0,0,0,0,0,0,0,0,0,0,0,0,0,0,0,0,0,0,0,0,0,0,0,0,0,0,0,0,0,0,0,0,0,0,0,0]
[2,1,2,0,0,32,4,2,36,17,0,0,15,1,1,0,0,0,300,744,475,674,1,4,472,674,0,0,0,0,15,31,77,0,0,0,0,11,92,9,11,2,5,0,0,3,2,0,0,0,0,0,0,0,0,0,0,0,0,0,0,0,0,0,0,0,0,0,0,0,0,0,0,0,0,0,0,470,1569,0,688,108,0,0,0,0,0,0,0,0,0,0,0,0,0,0,0,0,0,0,0,0,0,0,0,0,0,0,0,0,0,0,0,0,0,0,0,0,0,0,0,0,0,0,0,0,0,0,0,0,0,0,0,0,0,0,0,0,0,0,0,0,0,0,0,0,0,0,0,0,0,0,0,0,0,0,0,0,0,0,0,0,0,0,0,0,0,0,0,0,0,0,0,0,0,0,0,0,0,0,0,0,0,0,0,0,0,0,0,0,0,0,0,0,0,0,0,0,0,0,0,0,0,0,0,0,0,0,0,0,0,0,0,0,0,0,0,0,0,0,0,0,0,0,0,0,0,0,0,0]
[7,0,3,0,0,50,17,2,46,22,0,0,18,0,0,0,0,0,397,704,395,651,0,2,396,652,0,0,0,0,16,33,60,0,0,0,0,19,120,3,8,1,2,0,0,0,0,0,1,0,0,0,0,0,0,0,0,0,0,0,0,0,0,0,0,0,0,0,0,0,0,0,0,0,0,0,0,553,1666,0,405,93,0,0,0,0,0,0,0,0,0,0,0,0,0,0,0,0,0,0,0,0,0,0,0,0,0,0,0,0,0,0,0,0,0,0,0,0,0,0,0,0,0,0,0,0,0,0,0,0,0,0,0,0,0,0,0,0,0,0,0,0,0,0,0,0,0,0,0,0,0,0,0,0,0,0,0,0,0,0,0,0,0,0,0,0,0,0,0,0,0,0,0,0,0,0,0,0,0,0,0,0,0,0,0,0,0,0,0,0,0,0,0,0,0,0,0,0,0,0,0,0,0,0,0,0,0,0,0,0,0,0,0,0,0,0,0,0,0,0,0,0,0,0,0,0,0,0,0,0]
[4,0,1,0,0,52,17,2,52,38,0,0,18,1,0,0,0,0,667,755,666,674,0,7,666,667,0,0,0,0,20,48,95,0,0,0,1,25,134,0,2,1,1,0,0,0,0,0,0,0,0,0,0,0,0,0,0,0,0,0,0,0,0,0,0,0,0,0,0,0,0,0,0,0,0,0,0,626,1901,0,411,143,0,0,0,0,0,0,0,0,0,0,0,0,0,0,0,0,0,0,0,0,0,0,0,0,0,0,0,0,0,0,0,0,0,0,0,0,0,0,0,0,0,0,0,0,0,0,0,0,0,0,0,0,0,0,0,0,0,0,0,0,0,0,0,0,0,0,0,0,0,0,0,0,0,0,0,0,0,0,0,0,0,0,0,0,0,0,0,0,0,0,0,0,0,0,0,0,0,0,0,0,0,0,0,0,0,0,0,0,0,0,0,0,0,0,0,0,0,0,0,0,0,0,0,0,0,0,0,0,0,0,0,0,0,0,0,0,0,0,0,0,0,0,0,0,0,0,0,0]
[5,3,1,0,1,37,15,2,49,22,0,0,26,0,0,0,0,0,524,756,571,665,1,5,564,657,0,0,0,0,32,41,59,0,0,0,0,19,108,4,2,0,0,1,1,0,0,0,0,0,0,0,0,0,0,0,0,0,0,0,0,0,0,0,0,0,0,0,0,0,0,0,0,0,0,0,0,570,1444,0,324,100,0,0,0,0,0,0,0,0,0,0,0,0,0,0,0,0,0,0,0,0,0,0,0,0,0,0,0,0,0,0,0,0,0,0,0,0,0,0,0,0,0,0,0,0,0,0,0,0,0,0,0,0,0,0,0,0,0,0,0,0,0,0,0,0,0,0,0,0,0,0,0,0,0,0,0,0,0,0,0,0,0,0,0,0,0,0,0,0,0,0,0,0,0,0,0,0,0,0,0,0,0,0,0,0,0,0,0,0,0,0,0,0,0,0,0,0,0,0,0,0,0,0,0,0,0,0,0,0,0,0,0,0,0,0,0,0,0,0,0,0,0,0,0,0,0,0,0,0]
[6,3,0,0,0,54,18,3,49,18,0,0,20,3,0,0,0,0,503,738,510,663,5,9,504,658,0,0,0,0,11,22,45,0,0,0,1,13,112,8,7,2,7,0,2,1,2,0,1,0,0,0,0,0,0,0,0,0,0,0,0,0,0,0,0,0,0,0,0,0,0,0,0,0,0,0,0,565,2075,0,441,67,0,0,0,0,0,0,0,0,0,0,0,0,0,0,0,0,0,0,0,0,0,0,0,0,0,0,0,0,0,0,0,0,0,0,0,0,0,0,0,0,0,0,0,0,0,0,0,0,0,0,0,0,0,0,0,0,0,0,0,0,0,0,0,0,0,0,0,0,0,0,0,0,0,0,0,0,0,0,0,0,0,0,0,0,0,0,0,0,0,0,0,0,0,0,0,0,0,0,0,0,0,0,0,0,0,0,0,0,0,0,0,0,0,0,0,0,0,0,0,0,0,0,0,0,0,0,0,0,0,0,0,0,0,0,0,0,0,0,0,0,0,0,0,0,0,0,0,0]
[3,0,0,0,0,37,12,2,47,14,0,0,16,0,1,0,0,0,466,941,481,835,0,2,480,837,0,0,0,0,8,72,71,0,0,0,1,15,90,2,14,3,5,0,0,0,0,0,0,0,0,0,0,0,0,0,0,0,0,0,0,0,0,0,0,0,0,0,0,0,0,0,0,0,0,0,0,580,1952,0,629,143,0,0,0,0,0,0,0,0,0,0,0,0,0,0,0,0,0,0,0,0,0,0,0,0,0,0,0,0,0,0,0,0,0,0,0,0,0,0,0,0,0,0,0,0,0,0,0,0,0,0,0,0,0,0,0,0,0,0,0,0,0,0,0,0,0,0,0,0,0,0,0,0,0,0,0,0,0,0,0,0,0,0,0,0,0,0,0,0,0,0,0,0,0,0,0,0,0,0,0,0,0,0,0,0,0,0,0,0,0,0,0,0,0,0,0,0,0,0,0,0,0,0,0,0,0,0,0,0,0,0,0,0,0,0,0,0,0,0,0,0,0,0,0,0,0,0,0,0]
[11,0,1,0,0,31,15,2,49,13,0,0,14,0,0,0,0,0,368,682,376,572,0,2,368,547,0,0,0,0,3,24,48,0,0,0,0,13,87,0,6,0,0,0,1,30,78,0,0,0,0,0,0,0,0,0,0,0,0,0,0,0,0,0,0,0,0,0,0,0,0,0,0,0,0,0,0,447,1303,0,448,72,0,0,0,0,0,0,0,0,0,0,0,0,0,0,0,0,0,0,0,0,0,0,0,0,0,0,0,0,0,0,0,0,0,0,0,0,0,0,0,0,0,0,0,0,0,0,0,0,0,0,0,0,0,0,0,0,0,0,0,0,0,0,0,0,0,0,0,0,0,0,0,0,0,0,0,0,0,0,0,0,0,0,0,0,0,0,0,0,0,0,0,0,0,0,0,0,0,0,0,0,0,0,0,0,0,0,0,0,0,0,0,0,0,0,0,0,0,0,0,0,0,0,0,0,0,0,0,0,0,0,0,0,0,0,0,0,0,0,0,0,0,0,0,0,0,0,0,0]
[9,0,2,0,0,38,9,5,39,17,0,0,13,1,0,0,0,0,382,548,591,526,0,2,591,526,0,0,0,0,11,46,86,0,0,0,0,21,109,3,2,0,3,2,3,0,2,0,0,0,0,0,0,0,0,0,0,0,0,0,0,0,0,0,0,0,0,0,0,0,0,0,0,0,0,0,0,547,1177,0,347,132,0,0,0,0,0,0,0,0,0,0,0,0,0,0,0,0,0,0,0,0,0,0,0,0,0,0,0,0,0,0,0,0,0,0,0,0,0,0,0,0,0,0,0,0,0,0,0,0,0,0,0,0,0,0,0,0,0,0,0,0,0,0,0,0,0,0,0,0,0,0,0,0,0,0,0,0,0,0,0,0,0,0,0,0,0,0,0,0,0,0,0,0,0,0,0,0,0,0,0,0,0,0,0,0,0,0,0,0,0,0,0,0,0,0,0,0,0,0,0,0,0,0,0,0,0,0,0,0,0,0,0,0,0,0,0,0,0,0,0,0,0,0,0,0,0,0,0,0]
[10,2,4,0,0,36,9,2,36,14,0,0,14,1,1,0,0,0,421,715,441,662,0,1,443,660,0,0,0,0,6,43,81,0,0,0,0,21,116,1,1,3,4,1,0,0,0,0,0,0,0,0,0,0,0,0,0,0,0,0,0,0,0,0,0,0,0,0,0,0,0,0,0,0,0,0,0,534,2223,1,293,124,0,0,0,0,0,0,0,0,0,0,0,0,0,0,0,0,0,0,0,0,0,0,0,0,0,0,0,0,0,0,0,0,0,0,0,0,0,0,0,0,0,0,0,0,0,0,0,0,0,0,0,0,0,0,0,0,0,0,0,0,0,0,0,0,0,0,0,0,0,0,0,0,0,0,0,0,0,0,0,0,0,0,0,0,0,0,0,0,0,0,0,0,0,0,0,0,0,0,0,0,0,0,0,0,0,0,0,0,0,0,0,0,0,0,0,0,0,0,0,0,0,0,0,0,0,0,0,0,0,0,0,0,0,0,0,0,0,0,0,0,0,0,0,0,0,0,0,0]
["Total general",11,14,0,1,449,149,27,491,208,0,0,191,9,3,0,0,0,4736,8010,5238,7196,11,47,5210,7136,0,0,0,0,159,447,792,0,0,0,4,212,1209,43,77,21,36,5,8,35,86,1,3,0,0,0,0,0,0,0,0,0,0,0,0,0,0,0,0,0,0,0,0,0,0,0,0,0,0,0,0,6133,18044,1,5272,1239,0,0,0,0,0,0,0,0,0,0,0,0,0,0,0,0,0,0,0,0,0,0,0,0,0,0,0,0,0,0,0,0,0,0,0,0,0,0,0,0,0,0,0,0,0,0,0,0,0,0,0,0,0,0,0,0,0,0,0,0,0,0,0,0,0,0,0,0,0,0,0,0,0,0,0,0,0,0,0,0,0,0,0,0,0,0,0,0,0,0,0,0,0,0,0,0,0,0,0,0,0,0,0,0,0,0,0,0,0,0,0,0,0,0,0,0,0,0,0,0,0,0,0,0,0,0,0,0,0,0,0,0,0,0,0,0,0,0,0,0,0,0,0,0,0,0,0,0]
[]
[]
[]
[]
[]
["TOTAL"]
[{"$f":"COUNT(A96:A114)","v":11},{"$f":"SUM(B96:B114)","v":22},{"$f":"SUM(C96:C114)","v":28},0,2,898,298,54,982,416,0,0,382,18,6,0,0,0,9472,16020,10476,14392,22,94,10420,14272,0,0,0,0,318,894,1584,0,0,0,8,424,2418,86,154,42,72,10,16,70,172,2,6,0,0,0,0,0,0,0,0,0,0,0,0,0,0,0,0,0,{"$f":"SUM(BO96:BO114)","v":0},0,0,0,0,0,0,0,0,0,0,12266,36088,2,10544,2478,0,0,0,0,0,0,0,0,0,0,0,0,0,0,0,0,0,0,0,0,0,0,0,0,0,0,0,0,0,0,0,0,0,0,0,0,0,0,0,0,0,0,0,0,0,0,0,0,{"$f":"SUM(EA96:EA114)","v":0},0,0,0,0,0,0,0,0,0,0,0,0,0,0,0,0,0,0,0,0,0,0,0,0,0,0,0,0,0,0,0,0,0,0,0,0,0,0,0,0,0,0,0,0,0,0,0,0,0,0,0,0,0,0,0,0,0,0,0,0,0,0,0,{"$f":"SUM(GM96:GM114)","v":0},0,0,0,0,0,0,0,0,0,0,0,0,0,0,0,0,0,0,0,0,0,0,0,0,0,0,0,0,0,0,0,0,0,0,0,0,0]
[{"$f":"CONCATENATE(A99,\"-\",A100,\"-\",A101,\"-\",A102,\"-\",A103,\"-\",A104,\"-\",A105,\"-\",A106,\"-\",A107,\"-\",A108,\"-\",A109,\"-\",A110)","v":"1-8-2-7-4-5-6-3-11-9-10-Total general"}]
[null," BAS001"," BAS002"," BAS003"," BAS004"," BAS005"," BAS006"," BAS007"," BAS008"," BAS009"," BAS010"," BAS011"," BAS012"," BAS013"," BAS014"," BAS015"," BAS016"," BAS017"," BAS018"," BAS019"," BAS020"," BAS021"," BAS022"," BAS023"," BAS024"," BAS025"," BAS026"," BAS027"," BAS028"," BAS029"," BAS030"," BAS031"," BAS032"," BAS033"," BAS034"," BAS035"," BAS036"," BAS037"," BAS038"," BAS039"," BAS040"," BAS041"," BAS042"," BAS043"," BAS044"," BAS045"," BAS046"," BAS047"," BAS048"," BAS049"," BAS050"," BAS051"," BAS052"," BAS053"," BAS054"," BAS055"," BAS056"," BAS057"," BAS058"," BAS059"," BAS060"," BAS061"," BAS062"," BAS063"," BAS064"," BAS065"," BAS066"," BAS067"," BAS068"," BAS069"," BAS070"," BAS071"," BAS072"," BAS073"," BAS074"," BAS075"," BAS076"," BAS077"," BAS078"," BAS079"," BAS080"," BAS081"," BAS082"," BAS083"," BAS084"," BAS085"," BAS086"," BAS087"," BAS088"," BAS089"," BAS090"," BAS091"," BAS092"," BAS093"," BAS094"," BAS095"," BAS096"," BAS097"," BAS098"," BAS099"," BAS100"," BAS101"," BAS102"," BAS103"," BAS104"," BAS105"," BAS106"," BAS107"," BAS108"," BAS109"," BAS110"," BAS111"," BAS112"," BAS113"," BAS114"," BAS115"," BAS116"," BAS117"," BAS118"," BAS119"," BAS120"," BAS121"," BAS122"," BAS123"," BAS124"," BAS125"," BAS126"," BAS127"," BAS128"," BAS129"," BAS130"," BAS131"," BAS132"," BAS133"," BAS134"," BAS135"," BAS136"," BAS137"," BAS138"," BAS139"," BAS140"," BAS141"," BAS142"," BAS143"," BAS144"," BAS145"," BAS146"," BAS147"," BAS148"," BAS149"," BAS150"," BAS151"," BAS152"," BAS153"," BAS154"," BAS155"," BAS156"," BAS157"," BAS158"," BAS159"," BAS160"," BAS161"," BAS162"," BAS163"," BAS164"," BAS165"," BAS166"," BAS167"," BAS168"," BAS169"," BAS170"," BAS171"," BAS172"," BAS173"," BAS174"," BAS175"," BAS176"," BAS177"," BAS178"," BAS179"," BAS180"," BAS181"," BAS182"," BAS183"," BAS184"," BAS185"," BAS186"," BAS187"," BAS188"," BAS189"," BAS190"," BAS191"," BAS192"," BAS193"," BAS194"," BAS195"," BAS196"," BAS197"," BAS198"," BAS199"," BAS200"," BAS201"," BAS202"," BAS203"," BAS204"," BAS205"," BAS206"," BAS207"," BAS208"," BAS209"," BAS210"," BAS211"," BAS212"," BAS213"," BAS214"," BAS215"," BAS216"," BAS217"," BAS218"," BAS219"," BAS220"," BAS221"," BAS222"," BAS223"," BAS224"," BAS225"," BAS226"," BAS227"," BAS228"," BAS229"," BAS230"]
[null,{"$f":"IF(B119=B98,\"SI\",\"NO\")","v":"SI"},{"$f":"IF(C119=C98,\"SI\",\"NO\")","v":"SI"},"SI","SI","SI","SI","SI","SI","SI","SI","SI","SI","SI","SI","SI","SI","SI","SI","SI","SI","SI","SI","SI","SI","SI","SI","SI","SI","SI","SI","NO","NO","NO","NO","NO","NO","NO","NO","NO","NO","NO","NO","NO","NO","NO","NO","NO","NO","NO","NO","NO","NO","NO","NO","NO","NO","NO","NO","NO","NO","NO","NO","NO","NO","NO",{"$f":"IF(BO119=BO98,\"SI\",\"NO\")","v":"NO"},"NO","NO","NO","NO","NO","NO","NO","NO","NO","NO","NO","NO","NO","NO","NO","NO","NO","NO","NO","NO","NO","NO","NO","NO","NO","NO","NO","NO","NO","NO","NO","NO","NO","NO","NO","NO","NO","NO","NO","NO","NO","NO","NO","NO","NO","NO","NO","NO","NO","NO","NO","NO","NO","NO","NO","NO","NO","NO","NO","NO","NO","NO","NO",{"$f":"IF(EA119=EA98,\"SI\",\"NO\")","v":"NO"},"NO","NO","NO","NO","NO","NO","NO","NO","NO","NO","NO","NO","NO","NO","NO","NO","NO","NO","NO","NO","NO","NO","NO","NO","NO","NO","NO","NO","NO","NO","NO","NO","NO","NO","NO","NO","NO","NO","NO","NO","NO","NO","NO","NO","NO","NO","NO","NO","NO","NO","NO","NO","NO","NO","NO","NO","NO","NO","NO","NO","NO","NO","NO",{"$f":"IF(GM119=GM98,\"SI\",\"NO\")","v":"NO"},"NO","NO","NO","NO","NO","NO","NO","NO","NO","NO","NO","NO","NO","NO","NO","NO","NO","NO","NO","NO","NO","NO","NO","NO","NO","NO","NO","NO","NO","NO","NO","NO","NO","NO","NO","NO"]

{"sheet":"INFORME","index":2,"n_rows":241,"n_cols":32,"rows_kept":241,"cut":false,"hidden":false,"merged":[[11,5,11,6],[9,5,9,6],[7,5,7,6],[5,5,5,6],[3,0,3,10],[15,1,16,1],[15,2,16,6],[15,7,15,9],[0,0,0,10],[1,0,1,10],[37,2,37,6],[38,2,38,6],[39,2,39,6],[40,2,40,6],[41,2,41,6],[30,1,31,1],[30,2,30,6],[31,2,31,6],[35,1,35,6],[36,2,36,6],[49,2,49,6],[51,1,51,6],[52,2,52,6],[53,2,53,6],[56,1,56,6],[42,2,42,6],[43,2,43,6],[46,1,46,6],[47,2,47,6],[48,2,48,6],[64,2,64,6],[65,2,65,6],[68,1,68,6],[69,2,69,6],[70,2,70,6],[57,2,57,6],[58,2,58,6],[59,2,59,6],[62,1,62,6],[63,2,63,6],[78,1,79,1],[78,2,79,5],[80,1,81,1],[80,2,81,5],[82,1,83,1],[82,2,83,5],[71,2,71,6],[72,2,72,6],[73,2,73,6],[74,2,74,6],[77,1,77,6],[86,7,86,8],[88,1,89,1],[88,2,89,5],[90,1,97,1],[90,2,97,2],[90,3,91,5],[92,3,93,5],[94,3,95,5],[96,3,97,5],[98,1,101,1],[98,2,101,2],[98,3,99,5],[100,3,101,5],[102,1,104,1],[102,2,102,5],[103,2,103,5],[104,2,104,5],[86,1,87,5],[110,1,111,1],[110,2,111,5],[112,1,113,1],[112,2,113,5],[116,1,116,6],[105,1,107,1],[105,2,107,2],[105,3,105,5],[106,3,106,5],[107,3,107,5],[126,1,129,1],[126,2,129,3],[126,4,127,5],[128,4,129,5],[130,1,133,1],[130,2,133,3],[130,4,131,5],[132,4,133,5],[117,1,118,1],[117,2,118,5],[121,1,121,6],[122,1,125,1],[122,2,125,3],[122,4,123,5],[124,4,125,5],[142,1,145,1],[142,2,145,3],[142,4,143,5],[144,4,145,5],[146,1,149,1],[146,2,149,3],[146,4,147,5],[148,4,149,5],[134,1,137,1],[134,2,137,3],[134,4,135,5],[136,4,137,5],[138,1,141,1],[138,2,141,3],[138,4,139,5],[140,4,141,5],[158,2,163,2],[158,3,158,6],[159,3,159,6],[160,3,160,6],[161,3,161,6],[162,3,162,6],[163,3,163,6],[152,1,152,6],[153,2,157,2],[153,3,153,6],[154,3,154,6],[155,3,155,6],[156,3,156,6],[157,3,157,6],[174,1,177,1],[174,2,177,2],[174,3,174,6],[175,3,175,6],[176,3,176,6],[177,3,177,6],[166,1,166,6],[167,2,167,6],[168,2,168,6],[171,1,171,6],[173,2,173,6],[189,1,190,1],[189,2,190,5],[189,11,189,12],[191,2,191,6],[192,2,192,6],[179,2,179,6],[181,2,181,6],[183,2,183,6],[185,2,185,6],[188,1,188,6],[210,2,210,6],[211,2,211,6],[200,2,200,6],[201,2,201,6],[202,2,202,6],[203,2,203,6],[207,1,209,1],[207,2,209,5],[193,2,193,6],[194,1,195,1],[194,2,195,5],[198,1,198,6],[199,2,199,6],[221,3,221,6],[222,3,222,6],[223,3,223,6],[218,1,220,1],[218,2,220,2],[218,3,218,6],[219,3,219,6],[220,3,220,6],[214,1,214,6],[215,1,217,1],[215,2,217,2],[215,3,215,6],[216,3,216,6],[217,3,217,6],[221,1,223,1],[221,2,223,2],[236,2,236,6],[237,2,237,6],[238,2,238,6],[239,2,239,6],[240,2,240,6],[231,1,231,3],[231,6,231,7],[231,8,231,9],[234,1,234,6],[235,2,235,6],[229,2,229,3],[229,6,229,7],[229,8,229,9],[230,1,230,3],[230,6,230,7],[230,8,230,9],[224,3,224,6],[227,1,227,3],[227,6,227,7],[227,8,227,9],[228,2,228,3]]}
["GERENCIA REGIONAL DE SALUD CUSCO"]
["DIRECCION DE ESTADISTICA, INFORMATICA Y TELECOMUNICACIONES"]
[]
["Reporte de Actividades de la Etapa de Vida Adulto"]
[]
[null,"DIRESA:","CUSCO",null,"RED DE SALUD",{"$f":"+TABLAS!O9","v":"03 - LA CONVENCION"},null,null,null,null,{"$f":"+TABLAS!N26","v":"ENE - NOV"}]
[]
[null,null,null,null,"MICRO RED",{"$f":"+TABLAS!O10","v":""},null,null,"MES:",{"$f":"+TABLAS!N26","v":"ENE - NOV"},{"$f":"+TABLAS!J16","v":"2024"},null,null,null,null,null,null,"=+IMPORTARDATOSDINAMICOS(\" BAS"]
[]
[null,null,null,null,"PROVINCIA",{"$f":"+TABLAS!O12","v":""},null,null,"AÑO:",{"$f":"+TABLAS!J16","v":"2024"},null,null,null,null,null,null,null,"\";TABLAS!$A$59)"]
[]
[null,"EE.SS.:",{"$f":"+TABLAS!O11","v":""},null,"DISTRITO",{"$f":"+TABLAS!O13","v":""}]
[]
[]
[null,"MORBILIDAD DEL ADULTO",null,null,"usp_TRAMA_BASE_ADULTO_RPT_01_MORBILIDAD"]
[null,"CIE10","DIAGNÓSTICOS",null,null,null,null,"30a-59a"]
[null,null,null,null,null,null,null,"Masculino","Femenino","TOTAL"]
[null,"A64","ENFERMEDAD DE TRANSMISION SEXUAL NO ESPECIFICADA",null,null,null,null,{"$f":"+GETPIVOTDATA(\" BAS001\",TABLAS!$A$59)","v":10},{"$f":"+GETPIVOTDATA(\" BAS002\",TABLAS!$A$59)","v":1634},{"$f":"SUM(H18:I18)","v":1644},"A64 / D + EDAD >=30 Y <=59",null,null,null,null,null,null,{"$f":"CONCATENATE($R$8,AE18,$R$10)","v":"=+IMPORTARDATOSDINAMICOS(\" BAS001\";TABLAS!$A$59)"},{"$f":"CONCATENATE($R$8,AF18,$R$10)","v":"=+IMPORTARDATOSDINAMICOS(\" BAS002\";TABLAS!$A$59)"},null,null,null,null,null,null,null,null,1,2,null,{"$f":"IF(AB18<10,CONCATENATE(\"00\",AB18),IF(AB18<100,CONCATENATE(\"0\",AB18),AB18))","v":"001"},{"$f":"IF(AC18<10,CONCATENATE(\"00\",AC18),IF(AC18<100,CONCATENATE(\"0\",AC18),AC18))","v":"002"}]
[null,"E66","OBESIDAD",null,null,null,null,{"$f":"+GETPIVOTDATA(\" BAS003\",TABLAS!$A$59)","v":858},{"$f":"+GETPIVOTDATA(\" BAS004\",TABLAS!$A$59)","v":3054},{"$f":"SUM(H19:I19)","v":3912},"E66 /D + EDAD >=30 Y <=59",null,null,null,null,null,null,{"$f":"CONCATENATE($R$8,AE19,$R$10)","v":"=+IMPORTARDATOSDINAMICOS(\" BAS003\";TABLAS!$A$59)"},{"$f":"CONCATENATE($R$8,AF19,$R$10)","v":"=+IMPORTARDATOSDINAMICOS(\" BAS004\";TABLAS!$A$59)"},null,null,null,null,null,null,null,null,{"$f":"+AC18+1","v":3},{"$f":"+AB19+1","v":4},null,{"$f":"IF(AB19<10,CONCATENATE(\"00\",AB19),IF(AB19<100,CONCATENATE(\"0\",AB19),AB19))","v":"003"},{"$f":"IF(AC19<10,CONCATENATE(\"00\",AC19),IF(AC19<100,CONCATENATE(\"0\",AC19),AC19))","v":"004"}]
[null,"J00","RINOFARINGITIS AGUDA [RESFRIADO COMUN]",null,null,null,null,{"$f":"+GETPIVOTDATA(\" BAS005\",TABLAS!$A$59)","v":782},{"$f":"+GETPIVOTDATA(\" BAS006\",TABLAS!$A$59)","v":1391},2173,"J00 /D + EDAD >=30 Y <=59",null,null,null,null,null,null,"=+IMPORTARDATOSDINAMICOS(\" BAS005\";TABLAS!$A$59)","=+IMPORTARDATOSDINAMICOS(\" BAS006\";TABLAS!$A$59)",null,null,null,null,null,null,null,null,{"$f":"+AC19+1","v":5},{"$f":"+AB20+1","v":6},null,"005","006"]
[null,"J02","FARINGITIS AGUDA",null,null,null,null,{"$f":"+GETPIVOTDATA(\" BAS007\",TABLAS!$A$59)","v":2265},{"$f":"+GETPIVOTDATA(\" BAS008\",TABLAS!$A$59)","v":3774},6039,"J02 /D + EDAD >=30 Y <=59",null,null,null,null,null,null,"=+IMPORTARDATOSDINAMICOS(\" BAS007\";TABLAS!$A$59)","=+IMPORTARDATOSDINAMICOS(\" BAS008\";TABLAS!$A$59)",null,null,null,null,null,null,null,null,7,8,null,"007","008"]
[null,"J06","INFECCIONES AGUDAS DE LAS VIAS RESPIRATORIAS SUPERIORES, DE SITIOS MUL",null,null,null,null,{"$f":"+GETPIVOTDATA(\" BAS009\",TABLAS!$A$59)","v":301},{"$f":"+GETPIVOTDATA(\" BAS010\",TABLAS!$A$59)","v":486},787,"J06 /D + EDAD >=30 Y <=59",null,null,null,null,null,null,"=+IMPORTARDATOSDINAMICOS(\" BAS009\";TABLAS!$A$59)","=+IMPORTARDATOSDINAMICOS(\" BAS010\";TABLAS!$A$59)",null,null,null,null,null,null,null,null,9,10,null,"009","010"]
[null,"K02","CARIES DENTAL",null,null,null,null,{"$f":"+GETPIVOTDATA(\" BAS011\",TABLAS!$A$59)","v":870},{"$f":"+GETPIVOTDATA(\" BAS012\",TABLAS!$A$59)","v":2391},3261,"K02 /D + EDAD >=30 Y <=59",null,null,null,null,null,null,"=+IMPORTARDATOSDINAMICOS(\" BAS011\";TABLAS!$A$59)","=+IMPORTARDATOSDINAMICOS(\" BAS012\";TABLAS!$A$59)",null,null,null,null,null,null,null,null,11,12,null,"011","012"]
[null,"K04","ENFERMEDADES DE LA PULPA Y DE LOS TEJIDOS PERIAPICALES",null,null,null,null,{"$f":"+GETPIVOTDATA(\" BAS013\",TABLAS!$A$59)","v":678},{"$f":"+GETPIVOTDATA(\" BAS014\",TABLAS!$A$59)","v":1395},2073,"K04 /D + EDAD >=30 Y <=59",null,null,null,null,null,null,"=+IMPORTARDATOSDINAMICOS(\" BAS013\";TABLAS!$A$59)","=+IMPORTARDATOSDINAMICOS(\" BAS014\";TABLAS!$A$59)",null,null,null,null,null,null,null,null,13,14,null,"013","014"]
[null,"K29","GASTRITIS Y DUODENITIS",null,null,null,null,{"$f":"+GETPIVOTDATA(\" BAS015\",TABLAS!$A$59)","v":979},{"$f":"+GETPIVOTDATA(\" BAS016\",TABLAS!$A$59)","v":2051},3030,"K29 /D + EDAD >=30 Y <=59",null,null,null,null,null,null,"=+IMPORTARDATOSDINAMICOS(\" BAS015\";TABLAS!$A$59)","=+IMPORTARDATOSDINAMICOS(\" BAS016\";TABLAS!$A$59)",null,null,null,null,null,null,null,null,15,16,null,"015","016"]
[null,"M54","DORSALGIA",null,null,null,null,{"$f":"+GETPIVOTDATA(\" BAS017\",TABLAS!$A$59)","v":2345},{"$f":"+GETPIVOTDATA(\" BAS018\",TABLAS!$A$59)","v":3543},5888,"M54 /D + EDAD >=30 Y <=59",null,null,null,null,null,null,"=+IMPORTARDATOSDINAMICOS(\" BAS017\";TABLAS!$A$59)","=+IMPORTARDATOSDINAMICOS(\" BAS018\";TABLAS!$A$59)",null,null,null,null,null,null,null,null,17,18,null,"017","018"]
[null,"N39","OTROS TRASTORNOS DEL SISTEMA URINARIO",null,null,null,null,{"$f":"+GETPIVOTDATA(\" BAS019\",TABLAS!$A$59)","v":835},{"$f":"+GETPIVOTDATA(\" BAS020\",TABLAS!$A$59)","v":4896},5731,"N39 /D + EDAD >=30 Y <=59",null,null,null,null,null,null,"=+IMPORTARDATOSDINAMICOS(\" BAS019\";TABLAS!$A$59)","=+IMPORTARDATOSDINAMICOS(\" BAS020\";TABLAS!$A$59)",null,null,null,null,null,null,null,null,19,20,null,"019","020"]
[]
[null,"PLAN DE ATENCION INTEGRAL DEL ADULTO",null,null,null,"usp_TRAMA_BASE_ADULTO_RPT_02_PAI"]
[null,null,null,null,null,null,null,"Masculino","Femenino","TOTAL"]
[null,"Plan de Atención Integral","Elaborado",null,null,null,null,{"$f":"+GETPIVOTDATA(\" BAS021\",TABLAS!$A$59)","v":92},{"$f":"+GETPIVOTDATA(\" BAS022\",TABLAS!$A$59)","v":191},{"$f":"SUM(H31:I31)","v":283},"C8002 + LAB=1 + EDAD >=30 Y <=59",null,null,null,null,null,null,{"$f":"CONCATENATE($R$8,AE31,$R$10)","v":"=+IMPORTARDATOSDINAMICOS(\" BAS021\";TABLAS!$A$59)"},{"$f":"CONCATENATE($R$8,AF31,$R$10)","v":"=+IMPORTARDATOSDINAMICOS(\" BAS022\";TABLAS!$A$59)"},null,null,null,null,null,null,null,null,{"$f":"+AC27+1","v":21},22,null,{"$f":"IF(AB31<10,CONCATENATE(\"00\",AB31),IF(AB31<100,CONCATENATE(\"0\",AB31),AB31))","v":"021"},{"$f":"IF(AC31<10,CONCATENATE(\"00\",AC31),IF(AC31<100,CONCATENATE(\"0\",AC31),AC31))","v":"022"}]
[null,null,"Ejecutado",null,null,null,null,{"$f":"+GETPIVOTDATA(\" BAS023\",TABLAS!$A$59)","v":10},{"$f":"+GETPIVOTDATA(\" BAS024\",TABLAS!$A$59)","v":12},{"$f":"SUM(H32:I32)","v":22},"C8002 + LAB=TA + EDAD >=30 Y <=59",null,null,null,null,null,null,"=+IMPORTARDATOSDINAMICOS(\" BAS023\";TABLAS!$A$59)","=+IMPORTARDATOSDINAMICOS(\" BAS024\";TABLAS!$A$59)",null,null,null,null,null,null,null,null,23,24,null,"023","024"]
[]
[]
[null,"EVALUACIÓN ANTROPOMETRICA",null,null,"usp_TRAMA_BASE_ADULTO_RPT_03_EVAL_ANTROPOMETRICA"]
[null,"Índice de Masa Corporal (IMC)",null,null,null,null,null,"Masculino","Femenino","TOTAL"]
[null,"E46X3","Delgadez III",null,null,null,null,{"$f":"+GETPIVOTDATA(\" BAS025\",TABLAS!$A$59)","v":0},{"$f":"+GETPIVOTDATA(\" BAS026\",TABLAS!$A$59)","v":1},{"$f":"SUM(H37:I37)","v":1},"(Td=D + Dx=E46X3 + Lab=IMC)",null,null,null,null,null,null,"=+IMPORTARDATOSDINAMICOS(\" BAS025\";TABLAS!$A$59)","=+IMPORTARDATOSDINAMICOS(\" BAS026\";TABLAS!$A$59)",null,null,null,null,null,null,null,null,{"$f":"+AC32+1","v":25},26,null,"025","026"]
[null,"E46X2","Delgadez II",null,null,null,null,{"$f":"+GETPIVOTDATA(\" BAS027\",TABLAS!$A$59)","v":0},{"$f":"+GETPIVOTDATA(\" BAS028\",TABLAS!$A$59)","v":0},0,"(Td=D + Dx=E46X2 + Lab=IMC)",null,null,null,null,null,null,"=+IMPORTARDATOSDINAMICOS(\" BAS027\";TABLAS!$A$59)","=+IMPORTARDATOSDINAMICOS(\" BAS028\";TABLAS!$A$59)",null,null,null,null,null,null,null,null,27,28,null,"027","028"]
[null,"E46X1","Delgadez I",null,null,null,null,{"$f":"+GETPIVOTDATA(\" BAS029\",TABLAS!$A$59)","v":1},{"$f":"+GETPIVOTDATA(\" BAS030\",TABLAS!$A$59)","v":1},2,"(Td=D + Dx=E46X1 + Lab=IMC)",null,null,null,null,null,null,"=+IMPORTARDATOSDINAMICOS(\" BAS029\";TABLAS!$A$59)","=+IMPORTARDATOSDINAMICOS(\" BAS030\";TABLAS!$A$59)",null,null,null,null,null,null,null,null,29,30,null,"029","030"]
[null,"Z006","Normal",null,null,null,null,{"$f":"+GETPIVOTDATA(\" BAS031\",TABLAS!$A$59)","v":112},{"$f":"+GETPIVOTDATA(\" BAS032\",TABLAS!$A$59)","v":530},642,"(Td=D + Dx=Z006 + Lab=IMC)",null,null,null,null,null,null,"=+IMPORTARDATOSDINAMICOS(\" BAS031\";TABLAS!$A$59)","=+IMPORTARDATOSDINAMICOS(\" BAS032\";TABLAS!$A$59)",null,null,null,null,null,null,null,null,31,32,null,"031","032"]
[null,"E660","Sobrepeso",null,null,null,null,{"$f":"+GETPIVOTDATA(\" BAS033\",TABLAS!$A$59)","v":103},{"$f":"+GETPIVOTDATA(\" BAS034\",TABLAS!$A$59)","v":418},521,"(Td=D + Dx=E660 + Lab=IMC)",null,null,null,null,null,null,"=+IMPORTARDATOSDINAMICOS(\" BAS033\";TABLAS!$A$59)","=+IMPORTARDATOSDINAMICOS(\" BAS034\";TABLAS!$A$59)",null,null,null,null,null,null,null,null,33,34,null,"033","034"]
[null,"E669","Obesidad I",null,null,null,null,{"$f":"+GETPIVOTDATA(\" BAS035\",TABLAS!$A$59)","v":53},{"$f":"+GETPIVOTDATA(\" BAS036\",TABLAS!$A$59)","v":360},413,"(Td=D + Dx=E669 + Lab=IMC)",null,null,null,null,null,null,"=+IMPORTARDATOSDINAMICOS(\" BAS035\";TABLAS!$A$59)","=+IMPORTARDATOSDINAMICOS(\" BAS036\";TABLAS!$A$59)",null,null,null,null,null,null,null,null,35,36,null,"035","036"]
[null,"E6692","Obesidad II",null,null,null,null,{"$f":"+GETPIVOTDATA(\" BAS037\",TABLAS!$A$59)","v":3},{"$f":"+GETPIVOTDATA(\" BAS038\",TABLAS!$A$59)","v":16},19,"(Td=D + Dx=E6692 + Lab=IMC)",null,null,null,null,null,null,"=+IMPORTARDATOSDINAMICOS(\" BAS037\";TABLAS!$A$59)","=+IMPORTARDATOSDINAMICOS(\" BAS038\";TABLAS!$A$59)",null,null,null,null,null,null,null,null,37,38,null,"037","038"]
[null,"E6693","Obesidad III",null,null,null,null,{"$f":"+GETPIVOTDATA(\" BAS039\",TABLAS!$A$59)","v":0},{"$f":"+GETPIVOTDATA(\" BAS040\",TABLAS!$A$59)","v":14},14,"(Td=D + Dx=E6693 + Lab=IMC)",null,null,null,null,null,null,"=+IMPORTARDATOSDINAMICOS(\" BAS039\";TABLAS!$A$59)","=+IMPORTARDATOSDINAMICOS(\" BAS040\";TABLAS!$A$59)",null,null,null,null,null,null,null,null,39,40,null,"039","040"]
[]
[null,"RIESGO NUTRICIONAL",null,null,"usp_TRAMA_BASE_ADULTO_RPT_04_RIESGO_NUT"]
[null,"Evaluación del Perímetro Abdominal (PAB)",null,null,null,null,null,"Masculino","Femenino","TOTAL"]
[null,null,"Riesgo bajo",null,null,null,null,{"$f":"+GETPIVOTDATA(\" BAS041\",TABLAS!$A$59)","v":67},{"$f":"+GETPIVOTDATA(\" BAS042\",TABLAS!$A$59)","v":89},{"$f":"SUM(H48:I48)","v":156},"(Td=D + Dx=U8170 + Lab=RSM)",null,null,"NORMAL Y ANORMAL",null,null,null,"=+IMPORTARDATOSDINAMICOS(\" BAS041\";TABLAS!$A$59)","=+IMPORTARDATOSDINAMICOS(\" BAS042\";TABLAS!$A$59)",null,null,null,null,null,null,null,null,{"$f":"+AC44+1","v":41},42,null,"041","042"]
[null,null,"Riesgo Alto",null,null,null,null,{"$f":"+GETPIVOTDATA(\" BAS043\",TABLAS!$A$59)","v":56},{"$f":"+GETPIVOTDATA(\" BAS044\",TABLAS!$A$59)","v":107},163,"(Td=D + Dx=U8170 + Lab=RSA)",null,null,null,null,null,null,"=+IMPORTARDATOSDINAMICOS(\" BAS043\";TABLAS!$A$59)","=+IMPORTARDATOSDINAMICOS(\" BAS044\";TABLAS!$A$59)",null,null,null,null,null,null,null,null,43,44,null,"043","044"]
[null,null,"Riesgo Muy Alto",null,null,null,null,{"$f":"+GETPIVOTDATA(\" BAS045\",TABLAS!$A$59)","v":54},{"$f":"+GETPIVOTDATA(\" BAS046\",TABLAS!$A$59)","v":0},54,"(Td=D + Dx=U8170 + Lab=RMA)",null,null,null,null,null,null,"=+IMPORTARDATOSDINAMICOS(\" BAS045\";TABLAS!$A$59)","=+IMPORTARDATOSDINAMICOS(\" BAS046\";TABLAS!$A$59)",null,null,null,null,null,null,null,null,45,46,null,"045","046"]
[]
[null,"Evaluación del Perímetro Abdominal (PAB)",null,null,null,null,null,"Masculino","Femenino","TOTAL"]
[null,null,"Normal",null,null,null,null,{"$f":"+GETPIVOTDATA(\" BAS047\",TABLAS!$A$59)","v":0},{"$f":"+GETPIVOTDATA(\" BAS048\",TABLAS!$A$59)","v":3},{"$f":"SUM(H53:I53)","v":3},"(Td=D + Dx=U8170 + Lab=N)",null,null,"NORMAL Y ANORMAL",null,null,null,"=+IMPORTARDATOSDINAMICOS(\" BAS047\";TABLAS!$A$59)","=+IMPORTARDATOSDINAMICOS(\" BAS048\";TABLAS!$A$59)",null,null,null,null,null,null,null,null,{"$f":"+AC50+1","v":47},48,null,"047","048"]
[null,null,"Anormal",null,null,null,null,{"$f":"+GETPIVOTDATA(\" BAS049\",TABLAS!$A$59)","v":0},{"$f":"+GETPIVOTDATA(\" BAS050\",TABLAS!$A$59)","v":0},0,"(Td=D + Dx=U8170 + Lab=A)",null,null,null,null,null,null,"=+IMPORTARDATOSDINAMICOS(\" BAS049\";TABLAS!$A$59)","=+IMPORTARDATOSDINAMICOS(\" BAS050\";TABLAS!$A$59)",null,null,null,null,null,null,null,null,49,50,null,"049","050"]
[]
[null,"DAÑOS NO TRANSMISIBLES",null,null,"usp_TRAMA_BASE_ADULTO_RPT_05_1_DNT_VALORACION"]
[null,"Clasificación",null,null,null,null,null,"Masculino","Femenino","TOTAL"]
[null,null,"Valoración clínica sin factores de riesgo",null,null,null,null,{"$f":"+GETPIVOTDATA(\" BAS051\",TABLAS!$A$59)","v":36},{"$f":"+GETPIVOTDATA(\" BAS052\",TABLAS!$A$59)","v":73},{"$f":"SUM(H58:I58)","v":109},"Td=D + Dx=Z019 + Lab=DNT, Td=D+ Dx=Z006",null,null,null,null,null,null,"=+IMPORTARDATOSDINAMICOS(\" BAS051\";TABLAS!$A$59)","=+IMPORTARDATOSDINAMICOS(\" BAS052\";TABLAS!$A$59)",null,null,null,null,null,null,null,null,{"$f":"+AC54+1","v":51},52,null,"051","052"]
[null,null,"Valoración clínica con factores de riesgo",null,null,null,null,{"$f":"+GETPIVOTDATA(\" BAS053\",TABLAS!$A$59)","v":647},{"$f":"+GETPIVOTDATA(\" BAS054\",TABLAS!$A$59)","v":1871},2518,"Td=D + Dx=Z019 + Lab=DNT, Td=D+ Cualquier Dx=(E65X, E66.-, Z720,Z721,Z723, Z724, Z883,Z834) ",null,null,null,null,null,null,"=+IMPORTARDATOSDINAMICOS(\" BAS053\";TABLAS!$A$59)","=+IMPORTARDATOSDINAMICOS(\" BAS054\";TABLAS!$A$59)",null,null,null,null,null,null,null,null,53,54,null,"053","054"]
[null,null,"Valoración Clínica y tamizaje de laboratorio",null,null,null,null,{"$f":"+GETPIVOTDATA(\" BAS055\",TABLAS!$A$59)","v":0},{"$f":"+GETPIVOTDATA(\" BAS056\",TABLAS!$A$59)","v":0},0,"TD=D + Dx=(U262 + Lab=DNT)   ",null,null,null,null,null,null,"=+IMPORTARDATOSDINAMICOS(\" BAS055\";TABLAS!$A$59)","=+IMPORTARDATOSDINAMICOS(\" BAS056\";TABLAS!$A$59)",null,null,null,null,null,null,null,null,55,56,null,"055","056"]
[]
[null,null,null,null,"usp_TRAMA_BASE_ADULTO_RPT_05_2_DNT_HTA"]
[null,"Casos diagnosticados HTA",null,null,null,null,null,"Masculino","Femenino","TOTAL"]
[null,null,"Hipertensión esencial (primaria)",null,null,null,null,{"$f":"+GETPIVOTDATA(\" BAS057\",TABLAS!$A$59)","v":69},{"$f":"+GETPIVOTDATA(\" BAS058\",TABLAS!$A$59)","v":83},{"$f":"SUM(H64:I64)","v":152},"(Td=D + Dx= I10X)  ",null,null,null,null,null,null,"=+IMPORTARDATOSDINAMICOS(\" BAS057\";TABLAS!$A$59)","=+IMPORTARDATOSDINAMICOS(\" BAS058\";TABLAS!$A$59)",null,null,null,null,null,null,null,null,{"$f":"+AC60+1","v":57},58,null,"057","058"]
[null,null,"Retinopatía hipertensiva",null,null,null,null,{"$f":"+GETPIVOTDATA(\" BAS059\",TABLAS!$A$59)","v":5},{"$f":"+GETPIVOTDATA(\" BAS060\",TABLAS!$A$59)","v":2},7,"(Td=D + Dx= H350)  ",null,null,null,null,null,null,"=+IMPORTARDATOSDINAMICOS(\" BAS059\";TABLAS!$A$59)","=+IMPORTARDATOSDINAMICOS(\" BAS060\";TABLAS!$A$59)",null,null,null,null,null,null,null,null,59,60,null,"059","060"]
[null,null,"Nefropatía hipertensiva",null,null,null,null,{"$f":"+GETPIVOTDATA(\" BAS061\",TABLAS!$A$59)","v":0},{"$f":"+GETPIVOTDATA(\" BAS062\",TABLAS!$A$59)","v":0},0,"(Td=D + Dx= I120 + I129)  ",null,null,null,null,null,null,"=+IMPORTARDATOSDINAMICOS(\" BAS061\";TABLAS!$A$59)","=+IMPORTARDATOSDINAMICOS(\" BAS062\";TABLAS!$A$59)",null,null,null,null,null,null,null,null,61,62,null,"061","062"]
[]
[null,null,null,null,"usp_TRAMA_BASE_ADULTO_RPT_05_3_DNT_DM"]
[null,"Casos diagnosticados Diabetes Mellitus",null,null,null,null,null,"Masculino","Femenino","TOTAL"]
[null,null,"Diabetes mellitus tipo 1",null,null,null,null,{"$f":"+GETPIVOTDATA(\" BAS063\",TABLAS!$A$59)","v":5},{"$f":"+GETPIVOTDATA(\" BAS064\",TABLAS!$A$59)","v":4},{"$f":"SUM(H70:I70)","v":9},"(Td= D + Dx= (E100, E101, …E109) ",null,null,null,null,null,null,"=+IMPORTARDATOSDINAMICOS(\" BAS063\";TABLAS!$A$59)","=+IMPORTARDATOSDINAMICOS(\" BAS064\";TABLAS!$A$59)",null,null,null,null,null,null,null,null,{"$f":"+AC66+1","v":63},64,null,"063","064"]
[null,null,"Diabetes mellitus tipo 2",null,null,null,null,{"$f":"+GETPIVOTDATA(\" BAS065\",TABLAS!$A$59)","v":52},{"$f":"+GETPIVOTDATA(\" BAS066\",TABLAS!$A$59)","v":95},147,"(Td= D + Dx= (E110, E111, …E119) ",null,null,null,null,null,null,"=+IMPORTARDATOSDINAMICOS(\" BAS065\";TABLAS!$A$59)","=+IMPORTARDATOSDINAMICOS(\" BAS066\";TABLAS!$A$59)",null,null,null,null,null,null,null,null,65,66,null,"065","066"]
[null,null,"Diabetes mellitus en el embarazo",null,null,null,null,{"$f":"+GETPIVOTDATA(\" BAS067\",TABLAS!$A$59)","v":0},{"$f":"+GETPIVOTDATA(\" BAS068\",TABLAS!$A$59)","v":18},18,"(Td= D + Dx= (O240, O241, O242…O249) ",null,null,null,null,null,null,"=+IMPORTARDATOSDINAMICOS(\" BAS067\";TABLAS!$A$59)","=+IMPORTARDATOSDINAMICOS(\" BAS068\";TABLAS!$A$59)",null,null,null,null,null,null,null,null,67,68,null,"067","068"]
[null,null,"Otras diabetes mellitus",null,null,null,null,{"$f":"+GETPIVOTDATA(\" BAS069\",TABLAS!$A$59)","v":0},{"$f":"+GETPIVOTDATA(\" BAS070\",TABLAS!$A$59)","v":29},29,"(Td= D + Dx= (E12.-, E13.-, E14.-) ",null,null,null,null,null,null,"=+IMPORTARDATOSDINAMICOS(\" BAS069\";TABLAS!$A$59)","=+IMPORTARDATOSDINAMICOS(\" BAS070\";TABLAS!$A$59)",null,null,null,null,null,null,null,null,69,70,null,"069","070"]
[null,null,"Nefropatia diabética",null,null,null,null,{"$f":"+GETPIVOTDATA(\" BAS071\",TABLAS!$A$59)","v":1},{"$f":"+GETPIVOTDATA(\" BAS072\",TABLAS!$A$59)","v":1},2,"(Td= D + Dx= (E112, E112, E122, E132, E142) ",null,null,null,null,null,null,"=+IMPORTARDATOSDINAMICOS(\" BAS071\";TABLAS!$A$59)","=+IMPORTARDATOSDINAMICOS(\" BAS072\";TABLAS!$A$59)",null,null,null,null,null,null,null,null,71,72,null,"071","072"]
[null,null,"Retinopatía diabética",null,null,null,null,{"$f":"+GETPIVOTDATA(\" BAS073\",TABLAS!$A$59)","v":0},{"$f":"+GETPIVOTDATA(\" BAS074\",TABLAS!$A$59)","v":1},1,"(Td= D + Dx= (E103, E113, E123, E133, E143)",null,null,null,null,null,null,"=+IMPORTARDATOSDINAMICOS(\" BAS073\";TABLAS!$A$59)","=+IMPORTARDATOSDINAMICOS(\" BAS074\";TABLAS!$A$59)",null,null,null,null,null,null,null,null,73,74,null,"073","074"]
[]
[null,"PLANIFICACION FAMILIAR",null,null,"usp_TRAMA_BASE_ADULTO_RPT_06_1_PF_CLASIF"]
[null,"Clasificación",null,null,null,null,null,"Masculino","Femenino","TOTAL"]
[null,null,"Consejería/Orientación en Planificación Familiar",null,null,null,"1° Sesión",{"$f":"+GETPIVOTDATA(\" BAS075\",TABLAS!$A$59)","v":634},{"$f":"+GETPIVOTDATA(\" BAS076\",TABLAS!$A$59)","v":6039},{"$f":"SUM(H79:I79)","v":6673},"(Td=D + Dx=99402.04 + Lab=1)",null,null,null,null,null,null,"=+IMPORTARDATOSDINAMICOS(\" BAS075\";TABLAS!$A$59)","=+IMPORTARDATOSDINAMICOS(\" BAS076\";TABLAS!$A$59)",null,null,null,null,null,null,null,null,{"$f":"+AC75+1","v":75},{"$f":"+AB79+1","v":76},null,"075","076"]
[null,null,null,null,null,null,"2° Sesión",{"$f":"+GETPIVOTDATA(\" BAS077\",TABLAS!$A$59)","v":166},{"$f":"+GETPIVOTDATA(\" BAS078\",TABLAS!$A$59)","v":3227},3393,"(Td=D + Dx=99402.04 + Lab=2)",null,null,null,null,null,null,"=+IMPORTARDATOSDINAMICOS(\" BAS077\";TABLAS!$A$59)","=+IMPORTARDATOSDINAMICOS(\" BAS078\";TABLAS!$A$59)",null,null,null,null,null,null,null,null,{"$f":"+AC79+1","v":77},78,null,"077","078"]
[null,null,"Consejería/Orientación en Salud Sexual y Reproductiva",null,null,null,"1° Sesión",{"$f":"+GETPIVOTDATA(\" BAS079\",TABLAS!$A$59)","v":6},{"$f":"+GETPIVOTDATA(\" BAS080\",TABLAS!$A$59)","v":601},607,"(Td=D + Dx=99402.03 + Lab=1)",null,null,null,null,null,null,"=+IMPORTARDATOSDINAMICOS(\" BAS079\";TABLAS!$A$59)","=+IMPORTARDATOSDINAMICOS(\" BAS080\";TABLAS!$A$59)",null,null,null,null,null,null,null,null,79,80,null,"079","080"]
[null,null,null,null,null,null,"2° Sesión",{"$f":"+GETPIVOTDATA(\" BAS081\",TABLAS!$A$59)","v":1},{"$f":"+GETPIVOTDATA(\" BAS082\",TABLAS!$A$59)","v":490},491,"(Td=D + Dx=99402.03 + Lab=2)",null,null,null,null,null,null,"=+IMPORTARDATOSDINAMICOS(\" BAS081\";TABLAS!$A$59)","=+IMPORTARDATOSDINAMICOS(\" BAS082\";TABLAS!$A$59)",null,null,null,null,null,null,null,null,81,82,null,"081","082"]
[null,null,"Consejería/Orientación en perimenopausia, menopausia y Climaterio",null,null,null,"1° Sesión",{"$f":"+GETPIVOTDATA(\" BAS083\",TABLAS!$A$59)","v":0},{"$f":"+GETPIVOTDATA(\" BAS084\",TABLAS!$A$59)","v":2},2,"(Td=D + Dx=99402.06 + Lab=1)",null,null,null,null,null,null,"=+IMPORTARDATOSDINAMICOS(\" BAS083\";TABLAS!$A$59)","=+IMPORTARDATOSDINAMICOS(\" BAS084\";TABLAS!$A$59)",null,null,null,null,null,null,null,null,83,84,null,"083","084"]
[null,null,null,null,null,null,"2° Sesión",{"$f":"+GETPIVOTDATA(\" BAS085\",TABLAS!$A$59)","v":0},{"$f":"+GETPIVOTDATA(\" BAS086\",TABLAS!$A$59)","v":1},1,"(Td=D + Dx=99402.06 + Lab=2)",null,null,null,null,null,null,{"$f":"CONCATENATE($R$8,AE84,$R$10)","v":"=+IMPORTARDATOSDINAMICOS(\" BAS085\";TABLAS!$A$59)"},{"$f":"CONCATENATE($R$8,AF84,$R$10)","v":"=+IMPORTARDATOSDINAMICOS(\" BAS086\";TABLAS!$A$59)"},null,null,null,null,null,null,null,null,85,86,null,{"$f":"IF(AB84<10,CONCATENATE(\"00\",AB84),IF(AB84<100,CONCATENATE(\"0\",AB84),AB84))","v":"085"},{"$f":"IF(AC84<10,CONCATENATE(\"00\",AC84),IF(AC84<100,CONCATENATE(\"0\",AC84),AC84))","v":"086"}]
[]
[null,null,null,null,"usp_TRAMA_BASE_ADULTO_RPT_06_2_PF_METODOS"]
[null,"Método de planificación familiar en Adultos",null,null,null,null,"Activ. (A)","TIPO DE USUARIAS (30a-59a)"]
[null,null,null,null,null,null,"Insumo (I)","Nuevas","Continuadoras",null,"Nuevas","Continuadoras","Nuevas","Continuadoras"]
[null,null,"DIU",null,null,null,"A",{"$f":"+GETPIVOTDATA(\" BAS087\",TABLAS!$A$59)","v":27},{"$f":"+GETPIVOTDATA(\" BAS088\",TABLAS!$A$59)","v":18},null,"TD=D+DX=58300","TD=D+DX=Z305","TD=D+DX=58300",null,null,null,null,"=+IMPORTARDATOSDINAMICOS(\" BAS087\";TABLAS!$A$59)","=+IMPORTARDATOSDINAMICOS(\" BAS088\";TABLAS!$A$59)",null,null,null,null,null,null,null,null,{"$f":"+AC84+1","v":87},88,null,"087","088"]
[null,null,null,null,null,null,"I",{"$f":"+GETPIVOTDATA(\" BAS089\",TABLAS!$A$59)","v":24},{"$f":"+GETPIVOTDATA(\" BAS090\",TABLAS!$A$59)","v":1},null,"SUMAR 1º LAB DE TD=D+DX=58300","SUMAR 2º LAB DE  TD=D+DX=Z305","SUMAR 1º LAB DE TD=D+DX=58300",null,null,null,null,"=+IMPORTARDATOSDINAMICOS(\" BAS089\";TABLAS!$A$59)","=+IMPORTARDATOSDINAMICOS(\" BAS090\";TABLAS!$A$59)",null,null,null,null,null,null,null,null,89,90,null,"089","090"]
[null,null,"HORMONAL","ORAL COMBINADO",null,null,"A",{"$f":"+GETPIVOTDATA(\" BAS091\",TABLAS!$A$59)","v":460},{"$f":"+GETPIVOTDATA(\" BAS092\",TABLAS!$A$59)","v":1866},null,"TD=D+DX=Z3003","TD=D+DX=Z3043","TD=D+DX=99208.13",null,null,null,null,"=+IMPORTARDATOSDINAMICOS(\" BAS091\";TABLAS!$A$59)","=+IMPORTARDATOSDINAMICOS(\" BAS092\";TABLAS!$A$59)",null,null,null,null,null,null,null,null,91,92,null,"091","092"]
[null,null,null,null,null,null,"I",{"$f":"+GETPIVOTDATA(\" BAS093\",TABLAS!$A$59)","v":708},{"$f":"+GETPIVOTDATA(\" BAS094\",TABLAS!$A$59)","v":7464},null,"SUMAR 2º LAB DE TD=D+DX=Z3003","SUMAR 2º LAB DE TD=D+DX=Z3043","SUMAR 1º LAB DE TD=D+DX=99208.13",null,null,null,null,"=+IMPORTARDATOSDINAMICOS(\" BAS093\";TABLAS!$A$59)","=+IMPORTARDATOSDINAMICOS(\" BAS094\";TABLAS!$A$59)",null,null,null,null,null,null,null,null,93,94,null,"093","094"]
[null,null,null,"INYECTABLE TRIMESTRAL",null,null,"A",{"$f":"+GETPIVOTDATA(\" BAS095\",TABLAS!$A$59)","v":1181},{"$f":"+GETPIVOTDATA(\" BAS096\",TABLAS!$A$59)","v":5340},null,"TD=D+DX=Z30052","TD=D+DX=Z30452","TD=D+DX=99208.05",null,null,null,null,"=+IMPORTARDATOSDINAMICOS(\" BAS095\";TABLAS!$A$59)","=+IMPORTARDATOSDINAMICOS(\" BAS096\";TABLAS!$A$59)",null,null,null,null,null,null,null,null,95,96,null,"095","096"]
[null,null,null,null,null,null,"I",{"$f":"+GETPIVOTDATA(\" BAS097\",TABLAS!$A$59)","v":1158},{"$f":"+GETPIVOTDATA(\" BAS098\",TABLAS!$A$59)","v":5385},null,"SUMAR 2º LAB DE TD=D+DX=Z30052","SUMAR 2º LAB DE TD=D+DX=Z30452","SUMAR 1º LAB DE TD=D+DX=99208.05",null,null,null,null,"=+IMPORTARDATOSDINAMICOS(\" BAS097\";TABLAS!$A$59)","=+IMPORTARDATOSDINAMICOS(\" BAS098\";TABLAS!$A$59)",null,null,null,null,null,null,null,null,97,98,null,"097","098"]
[null,null,null,"INYECTABLE MENSUAL",null,null,"A",{"$f":"+GETPIVOTDATA(\" BAS099\",TABLAS!$A$59)","v":914},{"$f":"+GETPIVOTDATA(\" BAS100\",TABLAS!$A$59)","v":2861},null,"TD=D+DX=Z30051","TD=D+DX=Z30451","TD=D+DX=99208.04",null,null,null,null,"=+IMPORTARDATOSDINAMICOS(\" BAS099\";TABLAS!$A$59)","=+IMPORTARDATOSDINAMICOS(\" BAS100\";TABLAS!$A$59)",null,null,null,null,null,null,null,null,99,100,null,"099",100]
[null,null,null,null,null,null,"I",{"$f":"+GETPIVOTDATA(\" BAS101\",TABLAS!$A$59)","v":856},{"$f":"+GETPIVOTDATA(\" BAS102\",TABLAS!$A$59)","v":2893},null,"SUMAR 2º LAB DE TD=D+DX=Z30051","SUMAR 2º LAB DE TD=D+DX=Z30451","SUMAR 1º LAB DE TD=D+DX=99208.04",null,null,null,null,"=+IMPORTARDATOSDINAMICOS(\" BAS101\";TABLAS!$A$59)","=+IMPORTARDATOSDINAMICOS(\" BAS102\";TABLAS!$A$59)",null,null,null,null,null,null,null,null,101,102,null,101,102]
[null,null,null,"IMPLANTE",null,null,"A",{"$f":"+GETPIVOTDATA(\" BAS103\",TABLAS!$A$59)","v":289},{"$f":"+GETPIVOTDATA(\" BAS104\",TABLAS!$A$59)","v":258},null,"TD=D+DX=Z3006","TD=D+DX=Z3046","TD=D+DX=11975",null,null,null,null,"=+IMPORTARDATOSDINAMICOS(\" BAS103\";TABLAS!$A$59)","=+IMPORTARDATOSDINAMICOS(\" BAS104\";TABLAS!$A$59)",null,null,null,null,null,null,null,null,103,104,null,103,104]
[null,null,null,null,null,null,"I",{"$f":"+GETPIVOTDATA(\" BAS105\",TABLAS!$A$59)","v":277},{"$f":"+GETPIVOTDATA(\" BAS106\",TABLAS!$A$59)","v":128},null,"SUMAR 2º LAB DE TD=D+DX=Z3006","SUMAR 2º LAB DE TD=D+DX=Z3046","SUMAR 1º LAB DE TD=D+DX=11975",null,null,null,null,"=+IMPORTARDATOSDINAMICOS(\" BAS105\";TABLAS!$A$59)","=+IMPORTARDATOSDINAMICOS(\" BAS106\";TABLAS!$A$59)",null,null,null,null,null,null,null,null,105,106,null,105,106]
[null,null,"BARRERA","CONDON MASCULINO",null,null,"A",{"$f":"+GETPIVOTDATA(\" BAS107\",TABLAS!$A$59)","v":313},{"$f":"+GETPIVOTDATA(\" BAS108\",TABLAS!$A$59)","v":462},null,"TD=D+DX=Z3008","TD=D+DX=Z3048","TD=D+DX=99208.02",null,null,null,null,"=+IMPORTARDATOSDINAMICOS(\" BAS107\";TABLAS!$A$59)","=+IMPORTARDATOSDINAMICOS(\" BAS108\";TABLAS!$A$59)",null,null,null,null,null,null,null,null,107,108,null,107,108]
[null,null,null,null,null,null,"I",{"$f":"+GETPIVOTDATA(\" BAS109\",TABLAS!$A$59)","v":10358},{"$f":"+GETPIVOTDATA(\" BAS110\",TABLAS!$A$59)","v":40683},null,"SUMAR 2º LAB DE TD=D+DX=Z3008","SUMAR 2º LAB DE TD=D+DX=Z3048","SUMAR 1º LAB DE TD=D+DX=99208.02",null,null,null,null,"=+IMPORTARDATOSDINAMICOS(\" BAS109\";TABLAS!$A$59)","=+IMPORTARDATOSDINAMICOS(\" BAS110\";TABLAS!$A$59)",null,null,null,null,null,null,null,null,109,110,null,109,110]
[null,null,null,"CONDON FEMENINO",null,null,"A",{"$f":"+GETPIVOTDATA(\" BAS111\",TABLAS!$A$59)","v":28},{"$f":"+GETPIVOTDATA(\" BAS112\",TABLAS!$A$59)","v":5},null,"TD=D+DX=Z3009","TD=D+DX=Z3049","TD=D+DX=99208.06",null,null,null,null,"=+IMPORTARDATOSDINAMICOS(\" BAS111\";TABLAS!$A$59)","=+IMPORTARDATOSDINAMICOS(\" BAS112\";TABLAS!$A$59)",null,null,null,null,null,null,null,null,111,112,null,111,112]
[null,null,null,null,null,null,"I",{"$f":"+GETPIVOTDATA(\" BAS113\",TABLAS!$A$59)","v":271},{"$f":"+GETPIVOTDATA(\" BAS114\",TABLAS!$A$59)","v":133},null,"SUMAR 2º LAB DE TD=D+DX=Z3009","SUMAR 2º LAB DE TD=D+DX=Z3049","SUMAR 1º LAB DE TD=D+DX=99208.06",null,null,null,null,"=+IMPORTARDATOSDINAMICOS(\" BAS113\";TABLAS!$A$59)","=+IMPORTARDATOSDINAMICOS(\" BAS114\";TABLAS!$A$59)",null,null,null,null,null,null,null,null,113,114,null,113,114]
[null,null,"AQV FEMENINO",null,null,null,"A",{"$f":"+GETPIVOTDATA(\" BAS115\",TABLAS!$A$59)","v":3},{"$f":"+GETPIVOTDATA(\" BAS116\",TABLAS!$A$59)","v":1},null,"TD=D+DX=Z302+ LAB=\"\" + SEXO = F","TD=D+DX=Z302+ LAB=1 + SEXO = F","TD=D+DX=58600 + LAB=\"\" + SEXO = F",null,null,null,null,"=+IMPORTARDATOSDINAMICOS(\" BAS115\";TABLAS!$A$59)","=+IMPORTARDATOSDINAMICOS(\" BAS116\";TABLAS!$A$59)",null,null,null,null,null,null,null,null,115,116,null,115,116]
[null,null,"AQV MASCULINO",null,null,null,"A",{"$f":"+GETPIVOTDATA(\" BAS117\",TABLAS!$A$59)","v":0},{"$f":"+GETPIVOTDATA(\" BAS118\",TABLAS!$A$59)","v":0},null,"TD=D+DX=Z302+ LAB=\"\" + SEXO = M","TD=D+DX=Z302+ LAB=1 + SEXO = M","TD=D+DX=55250 + LAB=\"\" + SEXO = M",null,null,null,null,"=+IMPORTARDATOSDINAMICOS(\" BAS117\";TABLAS!$A$59)","=+IMPORTARDATOSDINAMICOS(\" BAS118\";TABLAS!$A$59)",null,null,null,null,null,null,null,null,117,118,null,117,118]
[null,null,"MELA",null,null,null,"A",{"$f":"+GETPIVOTDATA(\" BAS119\",TABLAS!$A$59)","v":8},{"$f":"+GETPIVOTDATA(\" BAS120\",TABLAS!$A$59)","v":0},null,"TD=D+DX=Z30091","TD=D+DX=Z30491","TD=D+DX=99208.07",null,null,null,null,"=+IMPORTARDATOSDINAMICOS(\" BAS119\";TABLAS!$A$59)","=+IMPORTARDATOSDINAMICOS(\" BAS120\";TABLAS!$A$59)",null,null,null,null,null,null,null,null,119,120,null,119,120]
[null,null,"ABSTINENCIA PERIODICA","BILLINGS",null,null,"A",{"$f":"+GETPIVOTDATA(\" BAS121\",TABLAS!$A$59)","v":5},{"$f":"+GETPIVOTDATA(\" BAS122\",TABLAS!$A$59)","v":0},null,"TD=D+DX=Z30093","TD=D+DX=Z30493","TD=D+DX=99208.09",null,null,null,null,"=+IMPORTARDATOSDINAMICOS(\" BAS121\";TABLAS!$A$59)","=+IMPORTARDATOSDINAMICOS(\" BAS122\";TABLAS!$A$59)",null,null,null,null,null,null,null,null,121,122,null,121,122]
[null,null,null,"RITMO ",null,null,"A",{"$f":"+GETPIVOTDATA(\" BAS123\",TABLAS!$A$59)","v":30},{"$f":"+GETPIVOTDATA(\" BAS124\",TABLAS!$A$59)","v":5},null,"TD=D+DX=Z30092","TD=D+DX=Z30492","TD=D+DX=99208.08",null,null,null,null,"=+IMPORTARDATOSDINAMICOS(\" BAS123\";TABLAS!$A$59)","=+IMPORTARDATOSDINAMICOS(\" BAS124\";TABLAS!$A$59)",null,null,null,null,null,null,null,null,123,124,null,123,124]
[null,null,null,"DIAS FIJO",null,null,"A",{"$f":"+GETPIVOTDATA(\" BAS125\",TABLAS!$A$59)","v":1},{"$f":"+GETPIVOTDATA(\" BAS126\",TABLAS!$A$59)","v":0},null,"TD=D+DX=Z30094","TD=D+DX=Z30494","TD=D+DX=99208.10",null,null,null,null,"=+IMPORTARDATOSDINAMICOS(\" BAS125\";TABLAS!$A$59)","=+IMPORTARDATOSDINAMICOS(\" BAS126\";TABLAS!$A$59)",null,null,null,null,null,null,null,null,125,126,null,125,126]
[]
[null,null,null,null,"usp_TRAMA_BASE_ADULTO_RPT_06_3_PF_METODOS",null,null,"TOTAL"]
[null,null,"ANTICONCEPCIÓN ORAL DE EMERGENCIA/YUZPE",null,null,null,"A",{"$f":"+GETPIVOTDATA(\" BAS127\",TABLAS!$A$59)","v":5}]
[null,null,null,null,null,null,"I",{"$f":"+GETPIVOTDATA(\" BAS128\",TABLAS!$A$59)","v":0}]
[null,null,"ANTICONCEPCIÓN ORAL DE EMERGENCIA/PROGESTAGENO",null,null,null,"A",{"$f":"+GETPIVOTDATA(\" BAS129\",TABLAS!$A$59)","v":189}]
[null,null,null,null,null,null,"I",{"$f":"+GETPIVOTDATA(\" BAS130\",TABLAS!$A$59)","v":2}]
[]
[null,"PREVENCION DE CANCER",null,null,"usp_TRAMA_BASE_ADULTO_RPT_07_CANCER"]
[null,null,null,null,null,null,null,"Masculino","Femenino","TOTAL"]
[null,null,"Consejería Preventiva en factores de riesgo para el cáncer",null,null,null,"1° Sesión",{"$f":"+GETPIVOTDATA(\" BAS129\",TABLAS!$A$59)","v":189},{"$f":"+GETPIVOTDATA(\" BAS130\",TABLAS!$A$59)","v":2},{"$f":"SUM(H118:I118)","v":191},"(Td=D + Dx=99402.08 + Lab=1)",null,null,null,null,null,null,"=+IMPORTARDATOSDINAMICOS(\" BAS001\";TABLAS!$A$59)","=+IMPORTARDATOSDINAMICOS(\" BAS002\";TABLAS!$A$59)",null,null,null,null,null,null,null,null,{"$f":"+AC112+1","v":1},2,null,"001","002"]
[null,null,null,null,null,null,"2° Sesión",{"$f":"+GETPIVOTDATA(\" BAS131\",TABLAS!$A$59)","v":2093},{"$f":"+GETPIVOTDATA(\" BAS132\",TABLAS!$A$59)","v":9187},11280,"(Td=D + Dx=99402.08 + Lab=2)",null,null,null,null,null,null,"=+IMPORTARDATOSDINAMICOS(\" BAS003\";TABLAS!$A$59)","=+IMPORTARDATOSDINAMICOS(\" BAS004\";TABLAS!$A$59)",null,null,null,null,null,null,null,null,3,4,null,"003","004"]
[]
[null,"ATENCION EN SALUD BUCAL",null," ","usp_TRAMA_BASE_ADULTO_RPT_08_SALUD_BUCAL"]
[null,"Prestación",null,null,null,null,null,"Masculino","Femenino","TOTAL"]
[null,null,"Examen Estomatológico",null,"No gestantes",null,"Inician",{"$f":"+GETPIVOTDATA(\" BAS133\",TABLAS!$A$59)","v":1016},{"$f":"+GETPIVOTDATA(\" BAS134\",TABLAS!$A$59)","v":5261},{"$f":"SUM(H123:I123)","v":6277},"(Td=D + Dx=D0120 + Lab=1)+  Lab (Cualquiera)<>G",null,null,null,null,null,null,"=+IMPORTARDATOSDINAMICOS(\" BAS005\";TABLAS!$A$59)","=+IMPORTARDATOSDINAMICOS(\" BAS006\";TABLAS!$A$59)",null,null,null,null,null,null,null,null,{"$f":"+AC119+1","v":5},6,null,"005","006"]
[null,null,null,null,null,null,"Controlado",{"$f":"+GETPIVOTDATA(\" BAS135\",TABLAS!$A$59)","v":0},{"$f":"+GETPIVOTDATA(\" BAS136\",TABLAS!$A$59)","v":1},1,"(Td=D + Dx=D0120 + Lab=2)+  Lab (Cualquiera)<>G",null,null,null,null,null,null,{"$f":"CONCATENATE($R$8,AE124,$R$10)","v":"=+IMPORTARDATOSDINAMICOS(\" BAS007\";TABLAS!$A$59)"},"=+IMPORTARDATOSDINAMICOS(\" BAS008\";TABLAS!$A$59)",null,null,null,null,null,null,null,null,7,8,null,"007","008"]
[null,null,null,null,"Gestantes",null,"Inician",null,{"$f":"+GETPIVOTDATA(\" BAS137\",TABLAS!$A$59)","v":0},0,"(Td=D + Dx=D0120 + Lab=1)+  Lab (Cualquiera)=G",null,null,null,null,null,null,null,"=+IMPORTARDATOSDINAMICOS(\" BAS009\";TABLAS!$A$59)",null,null,null,null,null,null,null,null,null,{"$f":"+AC124+1","v":9},null,null,{"$f":"IF(AC125<10,CONCATENATE(\"00\",AC125),IF(AC125<100,CONCATENATE(\"0\",AC125),AC125))","v":"009"}]
[null,null,null,null,null,null,"Controlado",null,{"$f":"+GETPIVOTDATA(\" BAS138\",TABLAS!$A$59)","v":0},0,"(Td=D + Dx=D0120 + Lab=2)+  Lab (Cualquiera)=G",null,null,null,null,null,null,null,"=+IMPORTARDATOSDINAMICOS(\" BAS010\";TABLAS!$A$59)",null,null,null,null,null,null,null,null,null,{"$f":"+AC125+1","v":10},null,null,{"$f":"IF(AC126<10,CONCATENATE(\"00\",AC126),IF(AC126<100,CONCATENATE(\"0\",AC126),AC126))","v":"010"}]
[null,null,"Instrucción de Higiene Oral",null,"No gestantes",null,"Inician",{"$f":"+GETPIVOTDATA(\" BAS139\",TABLAS!$A$59)","v":1},{"$f":"+GETPIVOTDATA(\" BAS140\",TABLAS!$A$59)","v":0},1,"(Td=D + Dx=D0130 + Lab=1)+  Lab (Cualquiera)<>G",null,null,null,null,null,null,"=+IMPORTARDATOSDINAMICOS(\" BAS011\";TABLAS!$A$59)","=+IMPORTARDATOSDINAMICOS(\" BAS012\";TABLAS!$A$59)",null,null,null,null,null,null,null,null,{"$f":"+AC126+1","v":11},12,null,"011","012"]
[null,null,null,null,null,null,"Controlado",{"$f":"+GETPIVOTDATA(\" BAS141\",TABLAS!$A$59)","v":0},{"$f":"+GETPIVOTDATA(\" BAS142\",TABLAS!$A$59)","v":0},0,"(Td=D + Dx=D0130 + Lab=2)+  Lab (Cualquiera)<>G",null,null,null,null,null,null,"=+IMPORTARDATOSDINAMICOS(\" BAS013\";TABLAS!$A$59)","=+IMPORTARDATOSDINAMICOS(\" BAS014\";TABLAS!$A$59)",null,null,null,null,null,null,null,null,13,14,null,"013","014"]
[null,null,null,null,"Gestantes",null,"Inician",null,{"$f":"+GETPIVOTDATA(\" BAS143\",TABLAS!$A$59)","v":0},0,"(Td=D + Dx=D0130 + Lab=1)+  Lab (Cualquiera)=G",null,null,null,null,null,null,null,"=+IMPORTARDATOSDINAMICOS(\" BAS015\";TABLAS!$A$59)",null,null,null,null,null,null,null,null,null,{"$f":"+AC128+1","v":15},null,null,{"$f":"IF(AC129<10,CONCATENATE(\"00\",AC129),IF(AC129<100,CONCATENATE(\"0\",AC129),AC129))","v":"015"}]
[null,null,null,null,null,null,"Controlado",null,{"$f":"+GETPIVOTDATA(\" BAS144\",TABLAS!$A$59)","v":0},0,"(Td=D + Dx=D0130 + Lab=2)+  Lab (Cualquiera)=G",null,null,null,null,null,null,null,"=+IMPORTARDATOSDINAMICOS(\" BAS016\";TABLAS!$A$59)",null,null,null,null,null,null,null,null,null,{"$f":"+AC129+1","v":16},null,null,{"$f":"IF(AC130<10,CONCATENATE(\"00\",AC130),IF(AC130<100,CONCATENATE(\"0\",AC130),AC130))","v":"016"}]
[null,null,"Asesoría nutricional para el control de enfermedades dentales",null,"No gestantes",null,"Inician",{"$f":"+GETPIVOTDATA(\" BAS145\",TABLAS!$A$59)","v":0},{"$f":"+GETPIVOTDATA(\" BAS146\",TABLAS!$A$59)","v":0},0,"(Td=D + Dx=D1310 + Lab=1)+  Lab (Cualquiera)<>G",null,null,null,null,null,null,"=+IMPORTARDATOSDINAMICOS(\" BAS017\";TABLAS!$A$59)","=+IMPORTARDATOSDINAMICOS(\" BAS018\";TABLAS!$A$59)",null,null,null,null,null,null,null,null,{"$f":"+AC130+1","v":17},18,null,"017","018"]
[null,null,null,null,null,null,"Tratado",{"$f":"+GETPIVOTDATA(\" BAS147\",TABLAS!$A$59)","v":815},{"$f":"+GETPIVOTDATA(\" BAS148\",TABLAS!$A$59)","v":1764},2579,"(Td=D + Dx=D1310 + Lab=2)+  Lab (Cualquiera)<>G",null,null,null,null,null,null,"=+IMPORTARDATOSDINAMICOS(\" BAS019\";TABLAS!$A$59)","=+IMPORTARDATOSDINAMICOS(\" BAS020\";TABLAS!$A$59)",null,null,null,null,null,null,null,null,19,20,null,"019","020"]
[null,null,null,null,"Gestantes",null,"Inician",null,{"$f":"+GETPIVOTDATA(\" BAS149\",TABLAS!$A$59)","v":70},70,"(Td=D + Dx=D1310 + Lab=1)+  Lab (Cualquiera)=G",null,null,null,null,null,null,null,"=+IMPORTARDATOSDINAMICOS(\" BAS021\";TABLAS!$A$59)",null,null,null,null,null,null,null,null,null,{"$f":"+AC132+1","v":21},null,null,{"$f":"IF(AC133<10,CONCATENATE(\"00\",AC133),IF(AC133<100,CONCATENATE(\"0\",AC133),AC133))","v":"021"}]
[null,null,null,null,null,null,"Tratado",null,{"$f":"+GETPIVOTDATA(\" BAS150\",TABLAS!$A$59)","v":245},245,"(Td=D + Dx=D1310 + Lab=2)+  Lab (Cualquiera)=G",null,null,null,null,null,null,null,"=+IMPORTARDATOSDINAMICOS(\" BAS022\";TABLAS!$A$59)",null,null,null,null,null,null,null,null,null,{"$f":"+AC133+1","v":22},null,null,{"$f":"IF(AC134<10,CONCATENATE(\"00\",AC134),IF(AC134<100,CONCATENATE(\"0\",AC134),AC134))","v":"022"}]
[null,null,"Profilaxis Dental",null,"No gestantes",null,"Inician",{"$f":"+GETPIVOTDATA(\" BAS151\",TABLAS!$A$59)","v":490},{"$f":"+GETPIVOTDATA(\" BAS152\",TABLAS!$A$59)","v":240},730,"(Td=D + Dx=D1110 + Lab=1)+  Lab (Cualquiera)<>G",null,null,null,null,null,null,"=+IMPORTARDATOSDINAMICOS(\" BAS023\";TABLAS!$A$59)","=+IMPORTARDATOSDINAMICOS(\" BAS024\";TABLAS!$A$59)",null,null,null,null,null,null,null,null,{"$f":"+AC134+1","v":23},24,null,"023","024"]
[null,null,null,null,null,null,"Controlado",{"$f":"+GETPIVOTDATA(\" BAS153\",TABLAS!$A$59)","v":731},{"$f":"+GETPIVOTDATA(\" BAS154\",TABLAS!$A$59)","v":1675},2406,"(Td=D + Dx=D1110 + Lab=2)+  Lab (Cualquiera)<>G",null,null,null,null,null,null,"=+IMPORTARDATOSDINAMICOS(\" BAS025\";TABLAS!$A$59)","=+IMPORTARDATOSDINAMICOS(\" BAS026\";TABLAS!$A$59)",null,null,null,null,null,null,null,null,{"$f":"+AC135+1","v":25},{"$f":"+AB136+1","v":26},null,"025","026"]
[null,null,null,null,"Gestantes",null,"Inician",null,{"$f":"+GETPIVOTDATA(\" BAS155\",TABLAS!$A$59)","v":92},92,"(Td=D + Dx=D1110 + Lab=1)+  Lab (Cualquiera)=G",null,null,null,null,null,null,null,"=+IMPORTARDATOSDINAMICOS(\" BAS027\";TABLAS!$A$59)",null,null,null,null,null,null,null,null,null,{"$f":"+AC136+1","v":27},null,null,{"$f":"IF(AC137<10,CONCATENATE(\"00\",AC137),IF(AC137<100,CONCATENATE(\"0\",AC137),AC137))","v":"027"}]
[null,null,null,null,null,null,"Controlado",null,{"$f":"+GETPIVOTDATA(\" BAS156\",TABLAS!$A$59)","v":298},298,"(Td=D + Dx=D1110 + Lab=2)+  Lab (Cualquiera)=G",null,null,null,null,null,null,null,"=+IMPORTARDATOSDINAMICOS(\" BAS028\";TABLAS!$A$59)",null,null,null,null,null,null,null,null,null,{"$f":"+AC137+1","v":28},null,null,{"$f":"IF(AC138<10,CONCATENATE(\"00\",AC138),IF(AC138<100,CONCATENATE(\"0\",AC138),AC138))","v":"028"}]
[null,null,"Consulta Estomatológica no especializada",null,"No gestantes",null,"Inician",{"$f":"+GETPIVOTDATA(\" BAS157\",TABLAS!$A$59)","v":463},{"$f":"+GETPIVOTDATA(\" BAS158\",TABLAS!$A$59)","v":237},700,"(Td=D + Dx=D0140 + Lab=1)+  Lab (Cualquiera)<>G",null,null,null,null,null,null,"=+IMPORTARDATOSDINAMICOS(\" BAS029\";TABLAS!$A$59)","=+IMPORTARDATOSDINAMICOS(\" BAS030\";TABLAS!$A$59)",null,null,null,null,null,null,null,null,{"$f":"+AC138+1","v":29},30,null,"029","030"]
[null,null,null,null,null,null,"Controlado",{"$f":"+GETPIVOTDATA(\" BAS159\",TABLAS!$A$59)","v":79},{"$f":"+GETPIVOTDATA(\" BAS160\",TABLAS!$A$59)","v":154},233,"(Td=D + Dx=D0140 + Lab=2)+  Lab (Cualquiera)<>G",null,null,null,null,null,null,"=+IMPORTARDATOSDINAMICOS(\" BAS031\";TABLAS!$A$59)","=+IMPORTARDATOSDINAMICOS(\" BAS032\";TABLAS!$A$59)",null,null,null,null,null,null,null,null,31,32,null,"031","032"]
[null,null,null,null,"Gestantes",null,"Inician",null,{"$f":"+GETPIVOTDATA(\" BAS161\",TABLAS!$A$59)","v":2},2,"(Td=D + Dx=D0140 + Lab=1)+  Lab (Cualquiera)=G",null,null,null,null,null,null,null,"=+IMPORTARDATOSDINAMICOS(\" BAS033\";TABLAS!$A$59)",null,null,null,null,null,null,null,null,null,{"$f":"+AC140+1","v":33},null,null,{"$f":"IF(AC141<10,CONCATENATE(\"00\",AC141),IF(AC141<100,CONCATENATE(\"0\",AC141),AC141))","v":"033"}]
[null,null,null,null,null,null,"Controlado",null,{"$f":"+GETPIVOTDATA(\" BAS162\",TABLAS!$A$59)","v":1},1,"(Td=D + Dx=D0140 + Lab=2)+  Lab (Cualquiera)=G",null,null,null,null,null,null,null,"=+IMPORTARDATOSDINAMICOS(\" BAS034\";TABLAS!$A$59)",null,null,null,null,null,null,null,null,null,{"$f":"+AC141+1","v":34},null,null,{"$f":"IF(AC142<10,CONCATENATE(\"00\",AC142),IF(AC142<100,CONCATENATE(\"0\",AC142),AC142))","v":"034"}]
[null,null,"Aplicación Flúor Barniz",null,"No gestantes",null,"Inician",{"$f":"+GETPIVOTDATA(\" BAS163\",TABLAS!$A$59)","v":4},{"$f":"+GETPIVOTDATA(\" BAS164\",TABLAS!$A$59)","v":1},5,"(Td=D + Dx=D1206 + Lab=1)+  Lab (Cualquiera)<>G",null,null,null,null,null,null,"=+IMPORTARDATOSDINAMICOS(\" BAS035\";TABLAS!$A$59)","=+IMPORTARDATOSDINAMICOS(\" BAS036\";TABLAS!$A$59)",null,null,null,null,null,null,null,null,{"$f":"+AC142+1","v":35},36,null,"035","036"]
[null,null,null,null,null,null,"Controlado",{"$f":"+GETPIVOTDATA(\" BAS165\",TABLAS!$A$59)","v":113},{"$f":"+GETPIVOTDATA(\" BAS166\",TABLAS!$A$59)","v":285},398,"(Td=D + Dx=D1206 + Lab=2)+  Lab (Cualquiera)<>G",null,null,null,null,null,null,"=+IMPORTARDATOSDINAMICOS(\" BAS037\";TABLAS!$A$59)","=+IMPORTARDATOSDINAMICOS(\" BAS038\";TABLAS!$A$59)",null,null,null,null,null,null,null,null,37,38,null,{"$f":"IF(AB144<10,CONCATENATE(\"00\",AB144),IF(AB144<100,CONCATENATE(\"0\",AB144),AB144))","v":"037"},{"$f":"IF(AC144<10,CONCATENATE(\"00\",AC144),IF(AC144<100,CONCATENATE(\"0\",AC144),AC144))","v":"038"}]
[null,null,null,null,"Gestantes",null,"Inician",null,{"$f":"+GETPIVOTDATA(\" BAS167\",TABLAS!$A$59)","v":14},14,"(Td=D + Dx=D1206 + Lab=1)+  Lab (Cualquiera)=G",null,null,null,null,null,null,null,"=+IMPORTARDATOSDINAMICOS(\" BAS039\";TABLAS!$A$59)",null,null,null,null,null,null,null,null,null,{"$f":"+AC144+1","v":39},null,null,{"$f":"IF(AC145<10,CONCATENATE(\"00\",AC145),IF(AC145<100,CONCATENATE(\"0\",AC145),AC145))","v":"039"}]
[null,null,null,null,null,null,"Controlado",null,{"$f":"+GETPIVOTDATA(\" BAS168\",TABLAS!$A$59)","v":66},66,"(Td=D + Dx=D1206 + Lab=2)+  Lab (Cualquiera)=G",null,null,null,null,null,null,null,"=+IMPORTARDATOSDINAMICOS(\" BAS040\";TABLAS!$A$59)",null,null,null,null,null,null,null,null,null,{"$f":"+AC145+1","v":40},null,null,{"$f":"IF(AC146<10,CONCATENATE(\"00\",AC146),IF(AC146<100,CONCATENATE(\"0\",AC146),AC146))","v":"040"}]
[null,null,"Raspaje Dental",null,"No gestantes",null,"Inician",{"$f":"+GETPIVOTDATA(\" BAS169\",TABLAS!$A$59)","v":413},{"$f":"+GETPIVOTDATA(\" BAS170\",TABLAS!$A$59)","v":225},638,"(Td=D + Dx=E1311 + Lab=1) ",null,null,null,null,null,null,"=+IMPORTARDATOSDINAMICOS(\" BAS041\";TABLAS!$A$59)","=+IMPORTARDATOSDINAMICOS(\" BAS042\";TABLAS!$A$59)",null,null,null,null,null,null,null,null,{"$f":"+AC146+1","v":41},42,null,"041","042"]
[null,null,null,null,null,null,"Tratado",{"$f":"+GETPIVOTDATA(\" BAS171\",TABLAS!$A$59)","v":9},{"$f":"+GETPIVOTDATA(\" BAS172\",TABLAS!$A$59)","v":40},49,"(Td=D + Dx=E1311 + Lab=2)  + lab=FIN",null,null,null,null,null,null,"=+IMPORTARDATOSDINAMICOS(\" BAS043\";TABLAS!$A$59)","=+IMPORTARDATOSDINAMICOS(\" BAS044\";TABLAS!$A$59)",null,null,null,null,null,null,null,null,43,44,null,"043","044"]
[null,null,null,null,"Gestantes",null,"Inician",null,{"$f":"+GETPIVOTDATA(\" BAS173\",TABLAS!$A$59)","v":0},0,"(Td=D + Dx=E1311 + Lab=1) ",null,null,null,null,null,null,null,"=+IMPORTARDATOSDINAMICOS(\" BAS045\";TABLAS!$A$59)",null,null,null,null,null,null,null,null,null,{"$f":"+AC148+1","v":45},null,null,{"$f":"IF(AC149<10,CONCATENATE(\"00\",AC149),IF(AC149<100,CONCATENATE(\"0\",AC149),AC149))","v":"045"}]
[null,null,null,null,null,null,"Tratado",null,{"$f":"+GETPIVOTDATA(\" BAS174\",TABLAS!$A$59)","v":5},5,"(Td=D + Dx=E1311 + Lab=2)  + lab=FIG",null,null,null,null,null,null,null,{"$f":"CONCATENATE($R$8,AF150,$R$10)","v":"=+IMPORTARDATOSDINAMICOS(\" BAS046\";TABLAS!$A$59)"},null,null,null,null,null,null,null,null,null,{"$f":"+AC149+1","v":46},null,null,{"$f":"IF(AC150<10,CONCATENATE(\"00\",AC150),IF(AC150<100,CONCATENATE(\"0\",AC150),AC150))","v":"046"}]
[]
[null,"SALUD MENTAL",null,"usp_TRAMA_BASE_ADULTO_RPT_09_SALUD_MENTAL"]
[null,"Prestaciones de Salud Mental en Adultos",null,null,null,null,null,"Masculino","Femenino","TOTAL"]
[null,null,"Entrevista de Tamizaje","Violencia Familiar",null,null,null,{"$f":"+GETPIVOTDATA(\" BAS175\",TABLAS!$A$59)","v":13},{"$f":"+GETPIVOTDATA(\" BAS176\",TABLAS!$A$59)","v":0},{"$f":"SUM(H154:I154)","v":13},"U140 / D /LAB=VIF + EDAD >=30 Y <=59",null,null,null,null,null,null,{"$f":"CONCATENATE($R$8,AE154,$R$10)","v":"=+IMPORTARDATOSDINAMICOS(\" BAS047\";TABLAS!$A$59)"},{"$f":"CONCATENATE($R$8,AF154,$R$10)","v":"=+IMPORTARDATOSDINAMICOS(\" BAS048\";TABLAS!$A$59)"},null,null,null,null,null,null,null,null,{"$f":"+AC150+1","v":47},48,null,"047","048"]
[null,null,null,"Violencia Sexual",null,null,null,{"$f":"+GETPIVOTDATA(\" BAS177\",TABLAS!$A$59)","v":2},{"$f":"+GETPIVOTDATA(\" BAS178\",TABLAS!$A$59)","v":3},5,"U140 / D /LAB=VSX + EDAD >=30 Y <=59",null,null,null,null,null,null,"=+IMPORTARDATOSDINAMICOS(\" BAS049\";TABLAS!$A$59)","=+IMPORTARDATOSDINAMICOS(\" BAS050\";TABLAS!$A$59)",null,null,null,null,null,null,null,null,49,50,null,"049","050"]
[null,null,null,"Violencia Social",null,null,null,{"$f":"+GETPIVOTDATA(\" BAS179\",TABLAS!$A$59)","v":0},{"$f":"+GETPIVOTDATA(\" BAS180\",TABLAS!$A$59)","v":0},0,"U140 / D /LAB=VS + EDAD >=30 Y <=59",null,null,null,null,null,null,"=+IMPORTARDATOSDINAMICOS(\" BAS051\";TABLAS!$A$59)","=+IMPORTARDATOSDINAMICOS(\" BAS052\";TABLAS!$A$59)",null,null,null,null,null,null,null,null,51,52,null,"051","052"]
[null,null,null,"Alcohol y Drogas",null,null,null,{"$f":"+GETPIVOTDATA(\" BAS181\",TABLAS!$A$59)","v":0},{"$f":"+GETPIVOTDATA(\" BAS182\",TABLAS!$A$59)","v":0},0,"U140 / D /LAB=AD + EDAD >=30 Y <=59",null,null,null,null,null,null,"=+IMPORTARDATOSDINAMICOS(\" BAS053\";TABLAS!$A$59)","=+IMPORTARDATOSDINAMICOS(\" BAS054\";TABLAS!$A$59)",null,null,null,null,null,null,null,null,53,54,null,"053","054"]
[null,null,null,"Trastornos Depresivos",null,null,null,{"$f":"+GETPIVOTDATA(\" BAS183\",TABLAS!$A$59)","v":0},{"$f":"+GETPIVOTDATA(\" BAS184\",TABLAS!$A$59)","v":0},0,"U140 / D /LAB=TD + EDAD >=30 Y <=59",null,null,null,null,null,null,"=+IMPORTARDATOSDINAMICOS(\" BAS055\";TABLAS!$A$59)","=+IMPORTARDATOSDINAMICOS(\" BAS056\";TABLAS!$A$59)",null,null,null,null,null,null,null,null,55,56,null,"055","056"]
[null,null,"Tamizaje Positivo","Problemas relacionados con violencia",null,null,null,{"$f":"+GETPIVOTDATA(\" BAS185\",TABLAS!$A$59)","v":0},{"$f":"+GETPIVOTDATA(\" BAS186\",TABLAS!$A$59)","v":0},0,"R456 / D",null,null,null,null,null,null,"=+IMPORTARDATOSDINAMICOS(\" BAS057\";TABLAS!$A$59)","=+IMPORTARDATOSDINAMICOS(\" BAS058\";TABLAS!$A$59)",null,null,null,null,null,null,null,null,57,58,null,"057","058"]
[null,null,null,"Problemas Relacionados con el Uso de Tabaco",null,null,null,{"$f":"+GETPIVOTDATA(\" BAS187\",TABLAS!$A$59)","v":49},{"$f":"+GETPIVOTDATA(\" BAS188\",TABLAS!$A$59)","v":376},425,"Z720 / D",null,null,null,null,null,null,"=+IMPORTARDATOSDINAMICOS(\" BAS059\";TABLAS!$A$59)","=+IMPORTARDATOSDINAMICOS(\" BAS060\";TABLAS!$A$59)",null,null,null,null,null,null,null,null,59,60,null,"059","060"]
[null,null,null,"Problemas Sociales Relacionados con el Uso de Alcohol",null,null,null,{"$f":"+GETPIVOTDATA(\" BAS189\",TABLAS!$A$59)","v":0},{"$f":"+GETPIVOTDATA(\" BAS190\",TABLAS!$A$59)","v":0},0,"Z721 / D",null,null,null,null,null,null,"=+IMPORTARDATOSDINAMICOS(\" BAS061\";TABLAS!$A$59)","=+IMPORTARDATOSDINAMICOS(\" BAS062\";TABLAS!$A$59)",null,null,null,null,null,null,null,null,61,62,null,"061","062"]
[null,null,null,"Problemas Sociales Relacionados con el Uso de drogas",null,null,null,{"$f":"+GETPIVOTDATA(\" BAS191\",TABLAS!$A$59)","v":127},{"$f":"+GETPIVOTDATA(\" BAS192\",TABLAS!$A$59)","v":9},136,"Z722 / D",null,null,null,null,null,null,"=+IMPORTARDATOSDINAMICOS(\" BAS063\";TABLAS!$A$59)","=+IMPORTARDATOSDINAMICOS(\" BAS064\";TABLAS!$A$59)",null,null,null,null,null,null,null,null,63,64,null,"063","064"]
[null,null,null,"Depresión",null,null,null,{"$f":"+GETPIVOTDATA(\" BAS193\",TABLAS!$A$59)","v":0},{"$f":"+GETPIVOTDATA(\" BAS194\",TABLAS!$A$59)","v":0},0,"(U140 / LAB=TD) + Z133 / D",null,null,null,null,null,null,"=+IMPORTARDATOSDINAMICOS(\" BAS065\";TABLAS!$A$59)","=+IMPORTARDATOSDINAMICOS(\" BAS066\";TABLAS!$A$59)",null,null,null,null,null,null,null,null,65,66,null,"065","066"]
[null,null,null,"Psicosis",null,null,null,{"$f":"+GETPIVOTDATA(\" BAS195\",TABLAS!$A$59)","v":0},{"$f":"+GETPIVOTDATA(\" BAS196\",TABLAS!$A$59)","v":0},0,"(U140 / LAB=EP) + Z133 / D",null,null,null,null,null,null,"=+IMPORTARDATOSDINAMICOS(\" BAS067\";TABLAS!$A$59)","=+IMPORTARDATOSDINAMICOS(\" BAS068\";TABLAS!$A$59)",null,null,null,null,null,null,null,null,67,68,null,"067","068"]
[]
[null,"TBC",null,"usp_TRAMA_BASE_ADULTO_RPT_10_TBC"]
[null,"Detección de TBC en Adultos",null,null,null,null,null,"Masculino","Femenino","TOTAL"]
[null,null,"Sintomáticos Respiratorios Examinados (TBC)",null,null,null,null,{"$f":"+GETPIVOTDATA(\" BAS197\",TABLAS!$A$59)","v":0},{"$f":"+GETPIVOTDATA(\" BAS198\",TABLAS!$A$59)","v":0},{"$f":"SUM(H168:I168)","v":0},"DX=D/R + U200 + (U2142 + LAB=1)",null,null,null,null,null,null,"=+IMPORTARDATOSDINAMICOS(\" BAS069\";TABLAS!$A$59)","=+IMPORTARDATOSDINAMICOS(\" BAS070\";TABLAS!$A$59)",null,null,null,null,null,null,null,null,{"$f":"+AC164+1","v":69},70,null,"069","070"]
[null,null,"Sintomáticos Respiratorios Identificados",null,null,null,null,{"$f":"+GETPIVOTDATA(\" BAS199\",TABLAS!$A$59)","v":736},{"$f":"+GETPIVOTDATA(\" BAS200\",TABLAS!$A$59)","v":995},1731,"DX=D + U200",null,null,null,null,null,null,"=+IMPORTARDATOSDINAMICOS(\" BAS071\";TABLAS!$A$59)","=+IMPORTARDATOSDINAMICOS(\" BAS072\";TABLAS!$A$59)",null,null,null,null,null,null,null,null,71,72,null,"071","072"]
[]
[null,"SALUD SEXUAL Y REPRODUCTIVA",null,null,"usp_TRAMA_BASE_ADULTO_RPT_11_SSR"]
[null,"Prestaciones de Salud Sexual y Reproductiva en Adultos, Gestantes y No gestantes",null,null,null,null,null,"Masculino","Femenino","TOTAL"]
[null,null,"Nº de personas tamizadas para VIH (incluye datos de ESNSSR y ESN TB)",null,null,null,null,{"$f":"+GETPIVOTDATA(\" BAS001\",TABLAS!$A$59)","v":10},{"$f":"+GETPIVOTDATA(\" BAS002\",TABLAS!$A$59)","v":1634},{"$f":"SUM(H173:I173)","v":1644},"DX= Z7172, Z7173 + Edad","SEXO= F + (TD=D + DX= 86703,87389)",null,null,null,null,null,"=+IMPORTARDATOSDINAMICOS(\" BAS001\";TABLAS!$A$59)","=+IMPORTARDATOSDINAMICOS(\" BAS002\";TABLAS!$A$59)",null,null,null,null,null,null,null,null,1,2,null,"001","002"]
[null,null,"Nº de personas tamizadas para VIH con resultado reactivo (incuye datos de ESNSSR y ESN TB)",null,null,null,null,{"$f":"+GETPIVOTDATA(\" BAS003\",TABLAS!$A$59)","v":858},{"$f":"+GETPIVOTDATA(\" BAS004\",TABLAS!$A$59)","v":3054},3912,"DX= Z7172 + Edad","SEXO= F + (DX= 86703,87389 + LAB=RP) ",null,null,null,null,null,"=+IMPORTARDATOSDINAMICOS(\" BAS003\";TABLAS!$A$59)","=+IMPORTARDATOSDINAMICOS(\" BAS004\";TABLAS!$A$59)",null,null,null,null,null,null,null,null,3,4,null,"003","004"]
[null,null,"Gestantes Atendidas (1º Control Prenatal)","Total",null,null,null,null,null,0,"SUMA"]
[null,null,null,"en 1º Trimestre de Gestación",null,null,null,null,{"$f":"+GETPIVOTDATA(\" BAS005\",TABLAS!$A$59)","v":782},782,"Z3591+Z3491 + LAB=1",null,null,null,null,null,null,null,"=+IMPORTARDATOSDINAMICOS(\" BAS005\";TABLAS!$A$59)",null,null,null,null,null,null,null,null,null,{"$f":"+AC174+1","v":5},null,"00","005"]
[null,null,null,"en 2º Trimestre de Gestación",null,null,null,null,{"$f":"+GETPIVOTDATA(\" BAS006\",TABLAS!$A$59)","v":1391},1391,"Z3592+Z3492 + LAB=1",null,null,null,null,null,null,null,"=+IMPORTARDATOSDINAMICOS(\" BAS006\";TABLAS!$A$59)",null,null,null,null,null,null,null,null,null,{"$f":"+AC176+1","v":6},null,"00","006"]
[null,null,null,"en 3º Trimestre de Gestación",null,null,null,null,{"$f":"+GETPIVOTDATA(\" BAS007\",TABLAS!$A$59)","v":2265},2265,"Z3593+Z3493 + LAB=1",null,null,null,null,null,null,null,"=+IMPORTARDATOSDINAMICOS(\" BAS007\";TABLAS!$A$59)",null,null,null,null,null,null,null,null,null,7,null,"00","007"]
[null,null,"Gestantes Controladas (6º Control Prenatal)",null,null,null,null,null,{"$f":"+GETPIVOTDATA(\" BAS008\",TABLAS!$A$59)","v":3774},3774,"(Z3491+Z3492+Z3493+Z3591+Z3592+Z3593) + LAB=6",null,null,null,null,null,null,null,"=+IMPORTARDATOSDINAMICOS(\" BAS008\";TABLAS!$A$59)",null,null,null,null,null,null,null,null,null,8,null,"00","008"]
[null,null,"Gestantes con atención prenatal reenfocada",null,null,null,null,null,{"$f":"+GETPIVOTDATA(\" BAS009\",TABLAS!$A$59)","v":301},301,"(TD=D + DX=Z359 / Z3591 / Z3592 / Z3593 / Z3491 / Z3492 / Z3493 + Lab >=6) + Cualquier Lab= TA",null,null,null,null,null,null,null,"=+IMPORTARDATOSDINAMICOS(\" BAS009\";TABLAS!$A$59)",null,null,null,null,null,null,null,null,null,9,null,"00","009"]
[null,null,"Suplementación con Sulfato Ferroso en Gestantes",null,null,null,null,null,{"$f":"+GETPIVOTDATA(\" BAS010\",TABLAS!$A$59)","v":486},486,"(TD=D + DX=Z359 / Z3591 / Z3592 / Z3593 / Z3491 / Z3492 / Z3493) + (TD=D + DX=Z298 + Lab=SF6)",null,null,null,null,null,null,null,"=+IMPORTARDATOSDINAMICOS(\" BAS010\";TABLAS!$A$59)",null,null,null,null,null,null,null,null,null,10,null,"00","010"]
[null,null,"Suplementación con Ácido Fólico en Gestantes",null,null,null,null,null,{"$f":"+GETPIVOTDATA(\" BAS011\",TABLAS!$A$59)","v":870},870,"(TD=D + DX=Z359 / Z3591 / Z3592 / Z3593 / Z3491 / Z3492 / Z3493) + (TD=D + DX=Z298 + Lab=AF3)",null,null,null,null,null,null,null,"=+IMPORTARDATOSDINAMICOS(\" BAS011\";TABLAS!$A$59)",null,null,null,null,null,null,null,null,null,11,null,"00","011"]
[null,null,"Parto",null,null,null,null,null,{"$f":"+GETPIVOTDATA(\" BAS012\",TABLAS!$A$59)","v":2391},2391,"TD=D + (O80 - O84) + Edad = (30 -59)",null,null,null,null,null,null,null,"=+IMPORTARDATOSDINAMICOS(\" BAS012\";TABLAS!$A$59)",null,null,null,null,null,null,null,null,null,12,null,"00","012"]
[null,null,"Toma de PAP",null,null,null,null,null,{"$f":"+GETPIVOTDATA(\" BAS013\",TABLAS!$A$59)","v":678},678,"TD=D + DX=Z359 + [88141 / Z0141]",null,null,null,null,null,null,null,"=+IMPORTARDATOSDINAMICOS(\" BAS013\";TABLAS!$A$59)",null,null,null,null,null,null,null,null,null,13,null,"00","013"]
[null,null,"Entrega de Resultados PAP",null,null,null,null,null,{"$f":"+GETPIVOTDATA(\" BAS014\",TABLAS!$A$59)","v":1395},1395,"TD=D + U2601",null,null,null,null,null,null,null,"=+IMPORTARDATOSDINAMICOS(\" BAS014\";TABLAS!$A$59)",null,null,null,null,null,null,null,null,null,14,null,"00","014"]
[null,null,"Resultado positivo de PAP (Gestantes)",null,null,null,null,null,{"$f":"+GETPIVOTDATA(\" BAS015\",TABLAS!$A$59)","v":979},979,"TD=D + DX=U2601 + (DX=D060, D061, D069, N879, N870, N871, N872 + En cualquier Lab=G)  / Z359 + TD=D + DX=U2601+ (DX=D060, D061, D069, N879, N870, N871, N872)",null,null,null,null,null,null,null,"=+IMPORTARDATOSDINAMICOS(\" BAS015\";TABLAS!$A$59)",null,null,null,null,null,null,null,null,null,15,null,"00","015"]
[]
[null,"ITS-VIH","usp_TRAMA_BASE_ADULTO_RPT_12_VIH"]
[null,null,null,null,null,null,null,"Masculino","Femenino","TOTAL"]
[null,null,"Consejería/Orientación en prevención de ITS,VIH, Hepatitis B",null,null,null,"1° Vez",{"$f":"+GETPIVOTDATA(\" BAS016\",TABLAS!$A$59)","v":2051},{"$f":"+GETPIVOTDATA(\" BAS017\",TABLAS!$A$59)","v":2345},{"$f":"SUM(H190:I190)","v":4396},"99402.05 + Lab=PV","SEXO= F + TD=D + (DX= 99402.05)",null,null,null,null,null,{"$f":"CONCATENATE($R$8,AE190,$R$10)","v":"=+IMPORTARDATOSDINAMICOS(\" BAS016\";TABLAS!$A$59)"},{"$f":"CONCATENATE($R$8,AF190,$R$10)","v":"=+IMPORTARDATOSDINAMICOS(\" BAS017\";TABLAS!$A$59)"},null,null,null,null,null,null,null,null,{"$f":"+AC186+1","v":16},{"$f":"+AB190+1","v":17},null,{"$f":"IF(AB190<10,CONCATENATE(\"00\",AB190),IF(AB190<100,CONCATENATE(\"0\",AB190),AB190))","v":"016"},{"$f":"IF(AC190<10,CONCATENATE(\"00\",AC190),IF(AC190<100,CONCATENATE(\"0\",AC190),AC190))","v":"017"}]
[null,null,null,null,null,null,"Más de una vez",{"$f":"+GETPIVOTDATA(\" BAS018\",TABLAS!$A$59)","v":3543},{"$f":"+GETPIVOTDATA(\" BAS019\",TABLAS!$A$59)","v":835},4378,"99402.05 + Lab=blanco",null,null,null,null,null,null,"=+IMPORTARDATOSDINAMICOS(\" BAS018\";TABLAS!$A$59)","=+IMPORTARDATOSDINAMICOS(\" BAS019\";TABLAS!$A$59)",null,null,null,null,null,null,null,null,{"$f":"+AC190+1","v":18},19,null,"018","019"]
[null,null,"Consejería Pre-test para VIH",null,null,null,null,{"$f":"+GETPIVOTDATA(\" BAS020\",TABLAS!$A$59)","v":4896},{"$f":"+GETPIVOTDATA(\" BAS021\",TABLAS!$A$59)","v":92},4988,"Z7171/D","99401.33",null,null,null,null,null,"=+IMPORTARDATOSDINAMICOS(\" BAS020\";TABLAS!$A$59)","=+IMPORTARDATOSDINAMICOS(\" BAS021\";TABLAS!$A$59)",null,null,null,null,null,null,null,null,20,21,null,"020","021"]
[null,null,"Consejería Post-test positivo para VIH",null,null,null,null,{"$f":"+GETPIVOTDATA(\" BAS022\",TABLAS!$A$59)","v":191},{"$f":"+GETPIVOTDATA(\" BAS023\",TABLAS!$A$59)","v":10},201,"Z7172/D","99403.03 ",null,null,null,null,null,"=+IMPORTARDATOSDINAMICOS(\" BAS022\";TABLAS!$A$59)","=+IMPORTARDATOSDINAMICOS(\" BAS023\";TABLAS!$A$59)",null,null,null,null,null,null,null,null,22,23,null,"022","023"]
[null,null,"Consejería Post-test negativo para VIH",null,null,null,null,{"$f":"+GETPIVOTDATA(\" BAS024\",TABLAS!$A$59)","v":12},{"$f":"+GETPIVOTDATA(\" BAS025\",TABLAS!$A$59)","v":0},12,"Z7173/D","99401.34 ",null,null,null,null,null,"=+IMPORTARDATOSDINAMICOS(\" BAS024\";TABLAS!$A$59)","=+IMPORTARDATOSDINAMICOS(\" BAS025\";TABLAS!$A$59)",null,null,null,null,null,null,null,null,24,25,null,"024","025"]
[null,null,"Tamizaje en Hepatitis B",null,null,null,"Reactivo",{"$f":"+GETPIVOTDATA(\" BAS026\",TABLAS!$A$59)","v":1},{"$f":"+GETPIVOTDATA(\" BAS027\",TABLAS!$A$59)","v":0},1,"86706/D",null,null,null,null,null,null,"=+IMPORTARDATOSDINAMICOS(\" BAS026\";TABLAS!$A$59)","=+IMPORTARDATOSDINAMICOS(\" BAS027\";TABLAS!$A$59)",null,null,null,null,null,null,null,null,26,27,null,"026","027"]
[null,null,null,null,null,null,"No Reactivo",{"$f":"+GETPIVOTDATA(\" BAS028\",TABLAS!$A$59)","v":0},{"$f":"+GETPIVOTDATA(\" BAS029\",TABLAS!$A$59)","v":1},1,"Z115+Lab=PRA",null,null,null,null,null,null,"=+IMPORTARDATOSDINAMICOS(\" BAS028\";TABLAS!$A$59)","=+IMPORTARDATOSDINAMICOS(\" BAS029\";TABLAS!$A$59)",null,null,null,null,null,null,null,null,28,29,null,"028","029"]
[]
[null,"SALUD OCULAR",null,"usp_TRAMA_BASE_ADULTO_RPT_13_SALUD_OCULAR"]
[null,null,null,null,null,null,null,"Masculino","Femenino","TOTAL"]
[null,null,"Consejería en Salud Ocular",null,null,null,null,{"$f":"+GETPIVOTDATA(\" BAS030\",TABLAS!$A$59)","v":1},{"$f":"+GETPIVOTDATA(\" BAS031\",TABLAS!$A$59)","v":112},{"$f":"SUM(H200:I200)","v":113},"99401.16/D",null,null,null,null,null,null,{"$f":"CONCATENATE($R$8,AE200,$R$10)","v":"=+IMPORTARDATOSDINAMICOS(\" BAS030\";TABLAS!$A$59)"},{"$f":"CONCATENATE($R$8,AF200,$R$10)","v":"=+IMPORTARDATOSDINAMICOS(\" BAS031\";TABLAS!$A$59)"},null,null,null,null,null,null,null,null,{"$f":"+AC196+1","v":30},31,null,{"$f":"IF(AB200<10,CONCATENATE(\"00\",AB200),IF(AB200<100,CONCATENATE(\"0\",AB200),AB200))","v":"030"},{"$f":"IF(AC200<10,CONCATENATE(\"00\",AC200),IF(AC200<100,CONCATENATE(\"0\",AC200),AC200))","v":"031"}]
[null,null,"Determinación de la agudeza visual",null,null,null,null,{"$f":"+GETPIVOTDATA(\" BAS032\",TABLAS!$A$59)","v":530},{"$f":"+GETPIVOTDATA(\" BAS033\",TABLAS!$A$59)","v":103},633,"99173/D",null,null,null,null,null,null,"=+IMPORTARDATOSDINAMICOS(\" BAS032\";TABLAS!$A$59)","=+IMPORTARDATOSDINAMICOS(\" BAS033\";TABLAS!$A$59)",null,null,null,null,null,null,null,null,32,33,null,"032","033"]
[null,null,"Limitación visual moderada",null,null,null,null,{"$f":"+GETPIVOTDATA(\" BAS034\",TABLAS!$A$59)","v":418},{"$f":"+GETPIVOTDATA(\" BAS035\",TABLAS!$A$59)","v":53},471,"H456/D",null,null,null,null,null,null,"=+IMPORTARDATOSDINAMICOS(\" BAS034\";TABLAS!$A$59)","=+IMPORTARDATOSDINAMICOS(\" BAS035\";TABLAS!$A$59)",null,null,null,null,null,null,null,null,34,35,null,"034","035"]
[null,null,"Catarata no especificada",null,null,null,null,{"$f":"+GETPIVOTDATA(\" BAS036\",TABLAS!$A$59)","v":360},{"$f":"+GETPIVOTDATA(\" BAS037\",TABLAS!$A$59)","v":3},363,"H259/D",null,null,null,null,null,null,"=+IMPORTARDATOSDINAMICOS(\" BAS036\";TABLAS!$A$59)","=+IMPORTARDATOSDINAMICOS(\" BAS037\";TABLAS!$A$59)",null,null,null,null,null,null,null,null,36,37,null,"036","037"]
[null,null,"Examen de los ojos y la visión",null,null,null,null,{"$f":"+GETPIVOTDATA(\" BAS038\",TABLAS!$A$59)","v":16},{"$f":"+GETPIVOTDATA(\" BAS039\",TABLAS!$A$59)","v":0},16,"Z006/D",null,null,null,null,null,null,"=+IMPORTARDATOSDINAMICOS(\" BAS038\";TABLAS!$A$59)","=+IMPORTARDATOSDINAMICOS(\" BAS039\";TABLAS!$A$59)",null,null,null,null,null,null,null,null,38,39,null,"038","039"]
[]
[null,"ACTIVIDADES PREVENTIVAS PROMOCIONALES",null,null,null,"usp_TRAMA_BASE_ADULTO_RPT_14_APP"]
[null,"VISITA FAMILIAR INTEGRAL",null,null,null,null,null,"Masculino","Femenino","TOTAL"]
[null,null,"Visita Familiar Integral",null,null,null,"Con 1 Visita",{"$f":"+GETPIVOTDATA(\" BAS040\",TABLAS!$A$59)","v":14},{"$f":"+GETPIVOTDATA(\" BAS041\",TABLAS!$A$59)","v":67},{"$f":"SUM(H208:I208)","v":81},"99344 / D + LAB=1",null,null,null,null,null,null,"=+IMPORTARDATOSDINAMICOS(\" BAS040\";TABLAS!$A$59)","=+IMPORTARDATOSDINAMICOS(\" BAS041\";TABLAS!$A$59)",null,null,null,null,null,null,null,null,{"$f":"+AC204+1","v":40},41,null,"040","041"]
[null,null,null,null,null,null,"Con 2 Visitas",{"$f":"+GETPIVOTDATA(\" BAS042\",TABLAS!$A$59)","v":89},{"$f":"+GETPIVOTDATA(\" BAS043\",TABLAS!$A$59)","v":56},145,"99344 / D + LAB=2",null,null,null,null,null,null,"=+IMPORTARDATOSDINAMICOS(\" BAS042\";TABLAS!$A$59)","=+IMPORTARDATOSDINAMICOS(\" BAS043\";TABLAS!$A$59)",null,null,null,null,null,null,null,null,42,43,null,"042","043"]
[null,null,null,null,null,null,"Con 3 a + Visitas",{"$f":"+GETPIVOTDATA(\" BAS044\",TABLAS!$A$59)","v":107},{"$f":"+GETPIVOTDATA(\" BAS045\",TABLAS!$A$59)","v":54},161,"99344 / D + LAB>=3",null,null,null,null,null,null,"=+IMPORTARDATOSDINAMICOS(\" BAS044\";TABLAS!$A$59)","=+IMPORTARDATOSDINAMICOS(\" BAS045\";TABLAS!$A$59)",null,null,null,null,null,null,null,null,44,45,null,"044","045"]
[null,null,"V.F.I. de Identificación de riesgos y necesidades.",null,null,null,null,{"$f":"+GETPIVOTDATA(\" BAS046\",TABLAS!$A$59)","v":0},{"$f":"+GETPIVOTDATA(\" BAS047\",TABLAS!$A$59)","v":0},0,"C0011.01",null,null,null,null,null,null,"=+IMPORTARDATOSDINAMICOS(\" BAS046\";TABLAS!$A$59)","=+IMPORTARDATOSDINAMICOS(\" BAS047\";TABLAS!$A$59)",null,null,null,null,null,null,null,null,46,47,null,"046","047"]
[null,null,"V.F.I. para cuidados esenciales",null,null,null,null,{"$f":"+GETPIVOTDATA(\" BAS048\",TABLAS!$A$59)","v":3},{"$f":"+GETPIVOTDATA(\" BAS049\",TABLAS!$A$59)","v":0},3,"C0011.02",null,null,null,null,null,null,"=+IMPORTARDATOSDINAMICOS(\" BAS048\";TABLAS!$A$59)","=+IMPORTARDATOSDINAMICOS(\" BAS049\";TABLAS!$A$59)",null,null,null,null,null,null,null,null,{"$f":"+AC211+1","v":48},49,null,"048","049"]
[]
[null,"INMUNIZACIONES",null,"usp_TRAMA_BASE_ADULTO_RPT_15_VACUNA"]
[null,"Inmunizaciones en Adultos",null,null,null,null,null,"Masculino","Femenino","TOTAL"]
[null,null,"Vacunación Diftotetánica (dT) \n(No incluye Gestantes) ","    ======> DOSIS 1",null,null,null,{"$f":"+GETPIVOTDATA(\" BAS050\",TABLAS!$A$59)","v":0},{"$f":"+GETPIVOTDATA(\" BAS051\",TABLAS!$A$59)","v":36},{"$f":"SUM(H216:I216)","v":36},"D+Z2781+Lab(1,D1)+edad 30A-59A+sexo=F+(Lab<>G)",null,null,null,null,null,null,"=+IMPORTARDATOSDINAMICOS(\" BAS050\";TABLAS!$A$59)","=+IMPORTARDATOSDINAMICOS(\" BAS051\";TABLAS!$A$59)",null,null,null,null,null,null,null,null,{"$f":"+AC212+1","v":50},51,null,"050","051"]
[null,null,null,"    ======> DOSIS 2",null,null,null,{"$f":"+GETPIVOTDATA(\" BAS052\",TABLAS!$A$59)","v":73},{"$f":"+GETPIVOTDATA(\" BAS053\",TABLAS!$A$59)","v":647},720,"D+Z2781+Lab(2,D2)+edad 30A-59A+sexo=F+(Lab<>G)",null,null,null,null,null,null,"=+IMPORTARDATOSDINAMICOS(\" BAS052\";TABLAS!$A$59)","=+IMPORTARDATOSDINAMICOS(\" BAS053\";TABLAS!$A$59)",null,null,null,null,null,null,null,null,52,53,null,"052","053"]
[null,null,null,"    ======> DOSIS 3 (Protegida)",null,null,null,{"$f":"+GETPIVOTDATA(\" BAS054\",TABLAS!$A$59)","v":1871},{"$f":"+GETPIVOTDATA(\" BAS055\",TABLAS!$A$59)","v":0},1871,"D+Z2781+Lab(3,D3)+edad 30A-59A+sexo=F+(Lab<>G)",null,null,null,null,null,null,"=+IMPORTARDATOSDINAMICOS(\" BAS054\";TABLAS!$A$59)","=+IMPORTARDATOSDINAMICOS(\" BAS055\";TABLAS!$A$59)",null,null,null,null,null,null,null,null,54,55,null,"054","055"]
[null,null,"Vacunación Diftotetánica (dT)\n(SOLO Gestantes)","    ======> DOSIS 1",null,null,null,{"$f":"+GETPIVOTDATA(\" BAS056\",TABLAS!$A$59)","v":0},{"$f":"+GETPIVOTDATA(\" BAS057\",TABLAS!$A$59)","v":69},69,"D+Z2781+Lab(1,D1)+edad 30A-59A+sexo=F+(Lab=G)",null,null,null,null,null,null,"=+IMPORTARDATOSDINAMICOS(\" BAS056\";TABLAS!$A$59)","=+IMPORTARDATOSDINAMICOS(\" BAS057\";TABLAS!$A$59)",null,null,null,null,null,null,null,null,56,57,null,"056","057"]
[null,null,null,"    ======> DOSIS 2",null,null,null,{"$f":"+GETPIVOTDATA(\" BAS058\",TABLAS!$A$59)","v":83},{"$f":"+GETPIVOTDATA(\" BAS059\",TABLAS!$A$59)","v":5},88,"D+Z2781+Lab(2,D2)+edad 30A-59A+sexo=F+(Lab=G)",null,null,null,null,null,null,"=+IMPORTARDATOSDINAMICOS(\" BAS058\";TABLAS!$A$59)","=+IMPORTARDATOSDINAMICOS(\" BAS059\";TABLAS!$A$59)",null,null,null,null,null,null,null,null,58,59,null,"058","059"]
[null,null,null,"    ======> DOSIS 3 (Protegida)",null,null,null,{"$f":"+GETPIVOTDATA(\" BAS060\",TABLAS!$A$59)","v":2},{"$f":"+GETPIVOTDATA(\" BAS061\",TABLAS!$A$59)","v":0},2,"D+Z2781+Lab(3,D3)+edad 30A-59A+sexo=F+(Lab=G)",null,null,null,null,null,null,"=+IMPORTARDATOSDINAMICOS(\" BAS060\";TABLAS!$A$59)","=+IMPORTARDATOSDINAMICOS(\" BAS061\";TABLAS!$A$59)",null,null,null,null,null,null,null,null,60,61,null,"060","061"]
[null,null,"Vacunación contra la Hepatitis B","    ======> DOSIS 1",null,null,null,{"$f":"+GETPIVOTDATA(\" BAS062\",TABLAS!$A$59)","v":0},{"$f":"+GETPIVOTDATA(\" BAS063\",TABLAS!$A$59)","v":5},5,"(D+90744+Lab(1,D1)+edad>=30A<=59A)",null,null,null,null,null,null,"=+IMPORTARDATOSDINAMICOS(\" BAS062\";TABLAS!$A$59)","=+IMPORTARDATOSDINAMICOS(\" BAS063\";TABLAS!$A$59)",null,null,null,null,null,null,null,null,62,63,null,"062","063"]
[null,null,null,"    ======> DOSIS 2",null,null,null,{"$f":"+GETPIVOTDATA(\" BAS064\",TABLAS!$A$59)","v":4},{"$f":"+GETPIVOTDATA(\" BAS065\",TABLAS!$A$59)","v":52},56,"(D+90744+Lab(2,D2)+edad>=30A<=59A)",null,null,null,null,null,null,"=+IMPORTARDATOSDINAMICOS(\" BAS064\";TABLAS!$A$59)","=+IMPORTARDATOSDINAMICOS(\" BAS065\";TABLAS!$A$59)",null,null,null,null,null,null,null,null,64,65,null,"064","065"]
[null,null,null,"    ======> DOSIS 3 (Protegido)",null,null,null,{"$f":"+GETPIVOTDATA(\" BAS066\",TABLAS!$A$59)","v":95},{"$f":"+GETPIVOTDATA(\" BAS067\",TABLAS!$A$59)","v":0},95,"(D+90744+Lab(3,D3)+edad>=30A<=59A)",null,null,null,null,null,null,"=+IMPORTARDATOSDINAMICOS(\" BAS066\";TABLAS!$A$59)","=+IMPORTARDATOSDINAMICOS(\" BAS067\";TABLAS!$A$59)",null,null,null,null,null,null,null,null,66,67,null,"066","067"]
[null,null,"Influenza","    ======> DOSIS 1",null,null,null,{"$f":"+GETPIVOTDATA(\" BAS068\",TABLAS!$A$59)","v":18},{"$f":"+GETPIVOTDATA(\" BAS069\",TABLAS!$A$59)","v":0},18,"90657/D+lab(D1)",null,null,null,null,null,null,"=+IMPORTARDATOSDINAMICOS(\" BAS068\";TABLAS!$A$59)","=+IMPORTARDATOSDINAMICOS(\" BAS069\";TABLAS!$A$59)",null,null,null,null,null,null,null,null,68,69,null,"068","069"]
[]
[null,"SESIONES",null,"usp_TRAMA_BASE_ADULTO_RPT_16_SESIONES"]
[null,null,null,null,"Nº","Part/Benef"]
[null,"C0010","Demostrativa",null,{"$f":"+GETPIVOTDATA(\" BAS070\",TABLAS!$A$59)","v":29},{"$f":"+GETPIVOTDATA(\" BAS071\",TABLAS!$A$59)","v":1},null,null,null,null,null,null,null,null,null,null,null,"=+IMPORTARDATOSDINAMICOS(\" BAS070\";TABLAS!$A$59)","=+IMPORTARDATOSDINAMICOS(\" BAS071\";TABLAS!$A$59)",null,null,null,null,null,null,null,null,{"$f":"+AC225+1","v":70},71,null,"070","071"]
[null,"C0009","Educativa",null,{"$f":"+GETPIVOTDATA(\" BAS072\",TABLAS!$A$59)","v":1},{"$f":"+GETPIVOTDATA(\" BAS073\",TABLAS!$A$59)","v":0},null,null,null,null,null,null,null,null,null,null,null,"=+IMPORTARDATOSDINAMICOS(\" BAS072\";TABLAS!$A$59)","=+IMPORTARDATOSDINAMICOS(\" BAS073\";TABLAS!$A$59)",null,null,null,null,null,null,null,null,72,73,null,"072","073"]
[null,"CAMPAÑAS",null,null,{"$f":"+GETPIVOTDATA(\" BAS074\",TABLAS!$A$59)","v":1},{"$f":"+GETPIVOTDATA(\" BAS075\",TABLAS!$A$59)","v":634},null,null,null,null,null,null,null,null,null,null,null,"=+IMPORTARDATOSDINAMICOS(\" BAS074\";TABLAS!$A$59)","=+IMPORTARDATOSDINAMICOS(\" BAS075\";TABLAS!$A$59)",null,null,null,null,null,null,null,null,74,75,null,"074","075"]
[null,"TALLERES DE HABILIDADES SOCIALES",null,null,{"$f":"+GETPIVOTDATA(\" BAS076\",TABLAS!$A$59)","v":6039},{"$f":"+GETPIVOTDATA(\" BAS077\",TABLAS!$A$59)","v":166},null,null,null,null,null,null,null,null,null,null,null,"=+IMPORTARDATOSDINAMICOS(\" BAS076\";TABLAS!$A$59)","=+IMPORTARDATOSDINAMICOS(\" BAS077\";TABLAS!$A$59)",null,null,null,null,null,null,null,null,76,77,null,"076","077"]
[]
[null,"OTRAS CONSEJERÍAS",null,"usp_TRAMA_BASE_ADULTO_RPT_17_CONSEJERIAS"]
[null,null,null,null,null,null,null,"TOTAL"]
[null,99403.01,"Consejería Nutricional",null,null,null,null,{"$f":"+GETPIVOTDATA(\" BAS078\",TABLAS!$A$59)","v":3227},null,null,null,null,null,null,null,null,null,null,"=+IMPORTARDATOSDINAMICOS(\" BAS078\";TABLAS!$A$59)",null,null,null,null,null,null,null,null,null,{"$f":"+AC232+1","v":78},null,"00","078"]
[null,99402.08,"Consejería preventiva en factores de riesgo para el cáncer",null,null,null,null,{"$f":"+GETPIVOTDATA(\" BAS079\",TABLAS!$A$59)","v":6},null,null,null,null,null,null,null,null,null,null,"=+IMPORTARDATOSDINAMICOS(\" BAS079\";TABLAS!$A$59)",null,null,null,null,null,null,null,null,null,{"$f":"+AC236+1","v":79},null,"00","079"]
[null,"99401.31","Consejería en Prevención de Enfermedades no transmisibles",null,null,null,null,{"$f":"+GETPIVOTDATA(\" BAS080\",TABLAS!$A$59)","v":601},null,null,null,null,null,null,null,null,null,null,"=+IMPORTARDATOSDINAMICOS(\" BAS080\";TABLAS!$A$59)",null,null,null,null,null,null,null,null,null,{"$f":"+AC237+1","v":80},null,"00","080"]
[null,99401.15,"Consejería en habilidades sociales",null,null,null,null,{"$f":"+GETPIVOTDATA(\" BAS081\",TABLAS!$A$59)","v":1},null,null,null,null,null,null,null,null,null,null,"=+IMPORTARDATOSDINAMICOS(\" BAS081\";TABLAS!$A$59)",null,null,null,null,null,null,null,null,null,81,null,"00","081"]
[null,99173,"Examen de agudeza visual cuantitativa bilateral",null,null,null,null,{"$f":"+GETPIVOTDATA(\" BAS082\",TABLAS!$A$59)","v":490},null,null,null,null,null,null,null,null,null,null,"=+IMPORTARDATOSDINAMICOS(\" BAS082\";TABLAS!$A$59)",null,null,null,null,null,null,null,null,null,82,null,"00","082"]
[null,99174,"Tamizaje ocular con instrumento (fototamizaje, refracción automatizada) bilateral",null,null,null,null,{"$f":"+GETPIVOTDATA(\" BAS083\",TABLAS!$A$59)","v":0},null,null,null,null,null,null,null,null,null,null,"=+IMPORTARDATOSDINAMICOS(\" BAS083\";TABLAS!$A$59)",null,null,null,null,null,null,null,null,null,83,null,"00","083"]

{"sheet":"Datos","index":3,"n_rows":444,"n_cols":32,"rows_kept":444,"cut":false,"hidden":true,"merged":[]}
[]
[]
[]
[]
[]
[]
[]
[]
[null,"ANO",null,"MESES",null,"COD_RED","DESC_RED","CONCATENAR",null,"COD_RED","COD_MIC","DESC_MICRO","CONCATENAR",null,"COD_ESTAB","DESC_ESTAB","COD_RED","COD_MIC","COD_PROV","COD_DIST","REDMIC","CONCATENAR",null,"COD_PROV","DESC_PROV","CONCATENAR",null,"COD_PROV","COD_DIST","DESC_DIST","PROVDIST","CONCATENAR"]
[null,2024,null,"01-Enero",null,"00","NO TIENE ASIGNADO NINGUNA RED",{"$f":"CONCATENATE(F10,\" - \",G10)","v":"00 - NO TIENE ASIGNADO NINGUNA RED"},null,"00","00","NO PERTENECE A NINGUNA MICRORED                                                                     ",{"$f":"CONCATENATE(J10,K10,\" - \",L10)","v":"0000 - NO PERTENECE A NINGUNA MICRORED                                                                     "},null,"000000000","(All)","00","00",null,null,{"$f":"CONCATENATE(Q10,R10)","v":"0000"},{"$f":"CONCATENATE(O10,\" - \",P10)","v":"000000000 - (All)"},null,"00","(All)",{"$f":"CONCATENATE(X10,\" - \",Y10)","v":"00 - (All)"},null,"01","00","(All)",{"$f":"CONCATENATE(AB10,AC10)","v":"0100"},{"$f":"CONCATENATE(AB10,AC10,\" - \",AD10)","v":"0100 - (All)"}]
[null,null,null,"02-Febrero",null,"01","CUSCO SUR",{"$f":"CONCATENATE(F11,\" - \",G11)","v":"01 - CUSCO SUR"},null,"00","99","(All)","0099 - (All)",null,"000028190","SAMUE CUSCO","00","00","01","01",{"$f":"CONCATENATE(Q11,R11)","v":"0000"},{"$f":"CONCATENATE(O11,\" - \",P11)","v":"000028190 - SAMUE CUSCO"},null,"01","CUSCO",{"$f":"CONCATENATE(X11,\" - \",Y11)","v":"01 - CUSCO"},null,"01","01","CUSCO",{"$f":"CONCATENATE(AB11,AC11)","v":"0101"},{"$f":"CONCATENATE(AB11,AC11,\" - \",AD11)","v":"0101 - CUSCO"}]
[null,null,null,"03-Marzo",null,"02","CUSCO NORTE","02 - CUSCO NORTE",null,"01","00","NO PERTENECE A NINGUNA MICRORED                                                                     ","0100 - NO PERTENECE A NINGUNA MICRORED                                                                     ",null,"000002289","HOSPITAL DE APOYO DEPARTAMENTAL CUSCO","00","00","01","01","0000","000002289 - HOSPITAL DE APOYO DEPARTAMENTAL CUSCO",null,"02","ACOMAYO",{"$f":"CONCATENATE(X12,\" - \",Y12)","v":"02 - ACOMAYO"},null,"01","02","CCORCA","0102","0102 - CCORCA"]
[null,null,null,"04-Abril",null,"03","LA CONVENCION","03 - LA CONVENCION",null,"01","16","CUSCO                                                                                               ","0116 - CUSCO                                                                                               ",null,"000002305","ANTONIO LORENA DEL CUSCO","00","00","01","06","0000","000002305 - ANTONIO LORENA DEL CUSCO",null,"03","ANTA","03 - ANTA",null,"01","03","POROY","0103","0103 - POROY"]
[null,null,null,"05-Mayo",null,"04","CANAS-CANCHIS-ESPINAR","04 - CANAS-CANCHIS-ESPINAR",null,"01","03","PARURO                                                                                              ","0103 - PARURO                                                                                              ",null,"999999999","(All)","00","99",null,null,"0099","999999999 - (All)",null,"04","CALCA","04 - CALCA",null,"01","04","SAN JERONIMO","0104","0104 - SAN JERONIMO"]
[null,null,null,"06-Junio",null,"05","KIMBIRI PICHARI","05 - KIMBIRI PICHARI",null,"01","06","PAUCARTAMBO                                                                                         ","0106 - PAUCARTAMBO                                                                                         ",null,"000025210","TUPAC AMARU","01","00","01","05","0100","000025210 - TUPAC AMARU",null,"05","CANAS","05 - CANAS",null,"01","05","SAN SEBASTIAN","0105","0105 - SAN SEBASTIAN"]
[null,null,null,"07-Julio",null,"06","CHUMBIVILCAS","06 - CHUMBIVILCAS",null,"01","12","URCOS                                                                                               ","0112 - URCOS                                                                                               ",null,"000000000","(All)","01","03",null,null,"0103","000000000 - (All)",null,"06","CANCHIS","06 - CANCHIS",null,"01","06","SANTIAGO","0106","0106 - SANTIAGO"]
[null,null,null,"08-Agosto",null,"99","(All)","99 - (All)",null,"01","13","ACOMAYO                                                                                             ","0113 - ACOMAYO                                                                                             ",null,"000002499","PARURO","01","03","10","01","0103","000002499 - PARURO",null,"07","CHUMBIVILCAS","07 - CHUMBIVILCAS",null,"01","07","SAYLLA","0107","0107 - SAYLLA"]
[null,null,null,"09-Setiembre",null,null,null,null,null,"01","15","OCONGATE                                                                                            ","0115 - OCONGATE                                                                                            ",null,"000002500","ACCHA","01","03","10","02","0103","000002500 - ACCHA",null,"08","ESPINAR","08 - ESPINAR",null,"01","08","WANCHAQ","0108","0108 - WANCHAQ"]
[null,null,null,"10-Octubre",null,null,null,null,null,"01","99","(All)","0199 - (All)",null,"000002501","CCAPI","01","03","10","03","0103","000002501 - CCAPI",null,"09","LA CONVENCION","09 - LA CONVENCION",null,"02","00","(All)","0200","0200 - (All)"]
[null,null,null,"11-Noviembre",null,"EJECUTORAS",null,null,null,"02","01","BELEMPAMPA                                                                                          ","0201 - BELEMPAMPA                                                                                          ",null,"000002502","CCOYABAMBA","01","03","10","03","0103","000002502 - CCOYABAMBA",null,"10","PARURO","10 - PARURO",null,"02","01","ACOMAYO","0201","0201 - ACOMAYO"]
[null,null,null,"12-Diciembre",null,"COD_RED","DESC_RED","CONCATENAR",null,"02","02","WANCHAQ                                                                                             ","0202 - WANCHAQ                                                                                             ",null,"000002503","COLCHA","01","03","10","04","0103","000002503 - COLCHA",null,"11","PAUCARTAMBO","11 - PAUCARTAMBO",null,"02","02","ACOPIA","0202","0202 - ACOPIA"]
[null,null,null,null,null,"01","HOSPITAL REGIONAL CUSCO",{"$f":"CONCATENATE(F22,\" - \",G22)","v":"01 - HOSPITAL REGIONAL CUSCO"},null,"02","03","ANTA                                                                                                ","0203 - ANTA                                                                                                ",null,"000002504","HUANOQUITE","01","03","10","05","0103","000002504 - HUANOQUITE",null,"12","QUISPICANCHI","12 - QUISPICANCHI",null,"02","03","ACOS","0203","0203 - ACOS"]
[null,null,null,null,null,"02","HOSPITAL ANTONIO LORENA",{"$f":"CONCATENATE(F23,\" - \",G23)","v":"02 - HOSPITAL ANTONIO LORENA"},null,"02","04","LIMATAMBO                                                                                           ","0204 - LIMATAMBO                                                                                           ",null,"000002505","OMACHA","01","03","10","06","0103","000002505 - OMACHA",null,"13","URUBAMBA","13 - URUBAMBA",null,"02","04","MOSOC LLACTA","0204","0204 - MOSOC LLACTA"]
[null,null,null,null,null,"03","CUSCO NORTE","03 - CUSCO NORTE",null,"02","05","PISAC                                                                                               ","0205 - PISAC                                                                                               ",null,"000002506","ANTAPALLPA","01","03","10","06","0103","000002506 - ANTAPALLPA",null,null,null,null,null,"02","05","POMACANCHI","0205","0205 - POMACANCHI"]
[null,null,null,null,null,"04","CUSCO SUR","04 - CUSCO SUR",null,"02","06","CALCA                                                                                               ","0206 - CALCA                                                                                               ",null,"000002507","PACCARECTAMBO","01","03","10","07","0103","000002507 - PACCARECTAMBO",null,null,null,null,null,"02","06","RONDOCAN","0206","0206 - RONDOCAN"]
[null,null,null,null,null,"05","LA CONVENCION","05 - LA CONVENCION",null,"02","07","URUBAMBA                                                                                            ","0207 - URUBAMBA                                                                                            ",null,"000002509","YAURISQUE","01","03","10","09","0103","000002509 - YAURISQUE",null,null,null,null,null,"02","07","SANGARARA","0207","0207 - SANGARARA"]
[null,null,null,null,null,"06","HOSPITAL QUILLABAMBA","06 - HOSPITAL QUILLABAMBA",null,"02","08","YANATILE                                                                                            ","0208 - YANATILE                                                                                            ",null,"000006978","CCOCHIRIHUAY","01","03","10","04","0103","000006978 - CCOCHIRIHUAY",null,null,null,null,null,"03","00","(All)","0300","0300 - (All)"]
[null,null,null,null,null,"07","CANAS CANCHIS ESPINAR","07 - CANAS CANCHIS ESPINAR",null,"02","09","SIETE CUARTONES                                                                                     ","0209 - SIETE CUARTONES                                                                                     ",null,"000007147","PUESTO DE SALUD DE HUASQUILLAY","01","03","10","06","0103","000007147 - PUESTO DE SALUD DE HUASQUILLAY",null,null,null,null,null,"03","01","ANTA","0301","0301 - ANTA"]
[null,null,null,null,null,"08","HOSPITAL SICUANI","08 - HOSPITAL SICUANI",null,"02","99","(All)","0299 - (All)",null,"000012924","SAHUA SAHUA","01","03","10","06","0103","000012924 - SAHUA SAHUA",null,null,null,null,null,"03","02","ANCAHUASI","0302","0302 - ANCAHUASI"]
[null,null,null,null,null,"09","HOSPITAL ESPINAR","09 - HOSPITAL ESPINAR",null,"03","00","NO PERTENECE A NINGUNA MICRORED                                                                     ","0300 - NO PERTENECE A NINGUNA MICRORED                                                                     ",null,"000000000","(All)","01","06",null,null,"0106","000000000 - (All)",null,null,null,null,null,"03","03","CACHIMAYO","0303","0303 - CACHIMAYO"]
[null,null,null,null,null,"10","KIMBIRI PICHARI","10 - KIMBIRI PICHARI",null,"03","01","SANTA ANA                                                                                           ","0301 - SANTA ANA                                                                                           ",null,"000002510","PAUCARTAMBO","01","06","11","01","0106","000002510 - PAUCARTAMBO",null,null,null,null,null,"03","04","CHINCHAYPUJIO","0304","0304 - CHINCHAYPUJIO"]
[null,null,null,null,null,"11","CHUMBIVILCAS","11 - CHUMBIVILCAS",null,"03","02","MARANURA                                                                                            ","0302 - MARANURA                                                                                            ",null,"000002511","MOLLOMARCA","01","06","11","01","0106","000002511 - MOLLOMARCA",null,null,null,null,null,"03","05","HUAROCONDO","0305","0305 - HUAROCONDO"]
[null,null,null,null,null,"99","(ALL)",{"$f":"CONCATENATE(F33,\" - \",G33)","v":"99 - (ALL)"},null,"03","03","QUELLOUNO                                                                                           ","0303 - QUELLOUNO                                                                                           ",null,"000002512","CAICAY","01","06","11","02","0106","000002512 - CAICAY",null,null,null,null,null,"03","06","LIMATAMBO","0306","0306 - LIMATAMBO"]
[null,null,null,null,null,null,null,null,null,"03","04","KITENI                                                                                              ","0304 - KITENI                                                                                              ",null,"000002513","HUASAC","01","06","11","02","0106","000002513 - HUASAC",null,null,null,null,null,"03","07","MOLLEPATA","0307","0307 - MOLLEPATA"]
[null,null,null,null,null,null,null,null,null,"03","05","KAMISEA                                                                                             ","0305 - KAMISEA                                                                                             ",null,"000002514","CHALLABAMBA","01","06","11","03","0106","000002514 - CHALLABAMBA",null,null,null,null,null,"03","08","PUCYURA","0308","0308 - PUCYURA"]
[null,null,null,null,null,null,null,null,null,"03","06","PUCYURA                                                                                             ","0306 - PUCYURA                                                                                             ",null,"000002516","COLQUEPATA","01","06","11","04","0106","000002516 - COLQUEPATA",null,null,null,null,null,"03","09","ZURITE","0309","0309 - ZURITE"]
[null,null,null,null,null,null,null,null,null,"03","07","PALMA REAL","0307 - PALMA REAL",null,"000002517","PICHIHUA COLQUEPATA","01","06","11","04","0106","000002517 - PICHIHUA COLQUEPATA",null,null,null,null,null,"04","00","(All)","0400","0400 - (All)"]
[null,null,null,null,null,null,null,null,null,"03","99","(All)","0399 - (All)",null,"000002518","VIZCOCHONI","01","06","11","04","0106","000002518 - VIZCOCHONI",null,null,null,null,null,"04","01","CALCA","0401","0401 - CALCA"]
[null,null,null,null,null,null,null,null,null,"04","00","NO PERTENECE A NINGUNA MICRORED                                                                     ","0400 - NO PERTENECE A NINGUNA MICRORED                                                                     ",null,"000002519","AYRE","01","06","11","04","0106","000002519 - AYRE",null,null,null,null,null,"04","02","COYA","0402","0402 - COYA"]
[null,null,null,null,null,null,null,null,null,"04","01","YANAOCA                                                                                             ","0401 - YANAOCA                                                                                             ",null,"000002520","HUANCARANI","01","06","11","05","0106","000002520 - HUANCARANI",null,null,null,null,null,"04","03","LAMAY","0403","0403 - LAMAY"]
[null,null,null,null,null,null,null,null,null,"04","02","EL DESCANSO                                                                                         ","0402 - EL DESCANSO                                                                                         ",null,"000002521","PILCOPATA","01","06","11","06","0106","000002521 - PILCOPATA",null,null,null,null,null,"04","04","LARES","0404","0404 - LARES"]
[null,null,null,null,null,null,null,null,null,"04","03","COMBAPATA                                                                                           ","0403 - COMBAPATA                                                                                           ",null,"000002522","PATRIA","01","06","11","06","0106","000002522 - PATRIA",null,null,null,null,null,"04","05","PISAC","0405","0405 - PISAC"]
[null,null,null,null,null,null,null,null,null,"04","04","TECHO OBRERO                                                                                        ","0404 - TECHO OBRERO                                                                                        ",null,"000006979","TOCRA","01","06","11","04","0106","000006979 - TOCRA",null,null,null,null,null,"04","06","SAN SALVADOR","0406","0406 - SAN SALVADOR"]
[null,null,null,null,null,null,null,null,null,"04","05","PAMPAPHALLA                                                                                         ","0405 - PAMPAPHALLA                                                                                         ",null,"000010077","PAUCARTAMBO -ESSALUD","01","06","11","01","0106","000010077 - PAUCARTAMBO -ESSALUD",null,null,null,null,null,"04","07","TARAY","0407","0407 - TARAY"]
[null,null,null,null,null,null,null,null,null,"04","06","YAURI                                                                                               ","0406 - YAURI                                                                                               ",null,"000033777","MENTAL COMUNITARIO VIRGEN DEL ROSARIO","01","06","11","01","0106","000033777 - MENTAL COMUNITARIO VIRGEN DEL ROSARIO",null,null,null,null,null,"04","08","YANATILE","0408","0408 - YANATILE"]
[null,null,null,null,null,null,null,null,null,"04","99","(All)","0499 - (All)",null,"000000000","(All)","01","12",null,null,"0112","000000000 - (All)",null,null,null,null,null,"05","00","(All)","0500","0500 - (All)"]
[null,null,null,null,null,null,null,null,null,"05","00","NO PERTENECE A NINGUNA MICRORED                                                                     ","0500 - NO PERTENECE A NINGUNA MICRORED                                                                     ",null,"000002523","URCOS","01","12","12","01","0112","000002523 - URCOS",null,null,null,null,null,"05","01","YANAOCA","0501","0501 - YANAOCA"]
[null,null,null,null,null,null,null,null,null,"05","01","KIMBIRI                                                                                             ","0501 - KIMBIRI                                                                                             ",null,"000002525","ANDAHUAYLILLAS","01","12","12","02","0112","000002525 - ANDAHUAYLILLAS",null,null,null,null,null,"05","02","CHECCA","0502","0502 - CHECCA"]
[null,null,null,null,null,null,null,null,null,"05","02","PICHARI                                                                                             ","0502 - PICHARI                                                                                             ",null,"000002530","CUSIPATA","01","12","12","06","0112","000002530 - CUSIPATA",null,null,null,null,null,"05","03","KUNTURKANKI","0503","0503 - KUNTURKANKI"]
[null,null,null,null,null,null,null,null,null,"05","99","(All)","0599 - (All)",null,"000002532","HUARO","01","12","12","07","0112","000002532 - HUARO",null,null,null,null,null,"05","04","LANGUI","0504","0504 - LANGUI"]
[null,null,null,null,null,null,null,null,null,"06","00","NO PERTENECE A NINGUNA MICRORED                                                                     ","0600 - NO PERTENECE A NINGUNA MICRORED                                                                     ",null,"000002533","URPAY","01","12","12","07","0112","000002533 - URPAY",null,null,null,null,null,"05","05","LAYO","0505","0505 - LAYO"]
[null,null,null,null,null,null,null,null,null,"06","09","SANTO TOMAS                                                                                         ","0609 - SANTO TOMAS                                                                                         ",null,"000002534","LUCRE","01","12","12","08","0112","000002534 - LUCRE",null,null,null,null,null,"05","06","PAMPAMARCA","0506","0506 - PAMPAMARCA"]
[null,null,null,null,null,null,null,null,null,"06","01","LIVITACA                                                                                            ","0601 - LIVITACA                                                                                            ",null,"000002537","OROPESA","01","12","12","11","0112","000002537 - OROPESA",null,null,null,null,null,"05","07","QUEHUE","0507","0507 - QUEHUE"]
[null,null,null,null,null,null,null,null,null,"06","99","(All)","0699 - (All)",null,"000002538","QUIQUIJANA","01","12","12","12","0112","000002538 - QUIQUIJANA",null,null,null,null,null,"05","08","TUPAC AMARU","0508","0508 - TUPAC AMARU"]
[null,null,null,null,null,null,null,null,null,"99","99","(All)","9999 - (All)",null,"000002539","CCOLCA","01","12","12","12","0112","000002539 - CCOLCA",null,null,null,null,null,"06","00","(All)","0600","0600 - (All)"]
[null,null,null,null,null,null,null,null,null,null,null,null,null,null,"000006980","CHILLIHUANI","01","12","12","06","0112","000006980 - CHILLIHUANI",null,null,null,null,null,"06","01","SICUANI","0601","0601 - SICUANI"]
[null,null,null,null,null,null,null,null,null,null,null,null,null,null,"000008911","HUARA HUARA","01","12","12","05","0112","000008911 - HUARA HUARA",null,null,null,null,null,"06","02","CHECACUPE","0602","0602 - CHECACUPE"]
[null,null,null,null,null,null,null,null,null,null,null,null,null,null,"000011747","POSTA MEDICA POLICIAL PUCUTO","01","12","12","07","0112","000011747 - POSTA MEDICA POLICIAL PUCUTO",null,null,null,null,null,"06","03","COMBAPATA","0603","0603 - COMBAPATA"]
[null,null,null,null,null,null,null,null,null,null,null,null,null,null,"000026385","URCOS - ESSALUD","01","12","12","01","0112","000026385 - URCOS - ESSALUD",null,null,null,null,null,"06","04","MARANGANI","0604","0604 - MARANGANI"]
[null,null,null,null,null,null,null,null,null,null,null,null,null,null,"000030708","MENTAL COMUNITARIO HUARO","01","12","12","07","0112","000030708 - MENTAL COMUNITARIO HUARO",null,null,null,null,null,"06","05","PITUMARCA","0605","0605 - PITUMARCA"]
[null,null,null,null,null,null,null,null,null,null,null,null,null,null,"000000000","(All)","01","13",null,null,"0113","000000000 - (All)",null,null,null,null,null,"06","06","SAN PABLO","0606","0606 - SAN PABLO"]
[null,null,null,null,null,null,null,null,null,null,null,null,null,null,"000002317","ACOMAYO","01","13","02","01","0113","000002317 - ACOMAYO",null,null,null,null,null,"06","07","SAN PEDRO","0607","0607 - SAN PEDRO"]
[null,null,null,null,null,null,null,null,null,null,null,null,null,null,"000002318","ACOPIA","01","13","02","02","0113","000002318 - ACOPIA",null,null,null,null,null,"06","08","TINTA","0608","0608 - TINTA"]
[null,null,null,null,null,null,null,null,null,null,null,null,null,null,"000002319","ACOS","01","13","02","03","0113","000002319 - ACOS",null,null,null,null,null,"07","00","(All)","0700","0700 - (All)"]
[null,null,null,null,null,null,null,null,null,null,null,null,null,null,"000002321","POMACANCHI","01","13","02","05","0113","000002321 - POMACANCHI",null,null,null,null,null,"07","01","SANTO TOMAS","0701","0701 - SANTO TOMAS"]
[null,null,null,null,null,null,null,null,null,null,null,null,null,null,"000002322","SAN JUAN DE POMACANCHI","01","13","02","05","0113","000002322 - SAN JUAN DE POMACANCHI",null,null,null,null,null,"07","02","CAPACMARCA","0702","0702 - CAPACMARCA"]
[null,null,null,null,null,null,null,null,null,null,null,null,null,null,"000002324","PUESTO DE SALUD SANGARARA","01","13","02","07","0113","000002324 - PUESTO DE SALUD SANGARARA",null,null,null,null,null,"07","03","CHAMACA","0703","0703 - CHAMACA"]
[null,null,null,null,null,null,null,null,null,null,null,null,null,null,"000002325","PUESTO DE SALUD MARCACONGA","01","13","02","07","0113","000002325 - PUESTO DE SALUD MARCACONGA",null,null,null,null,null,"07","04","COLQUEMARCA","0704","0704 - COLQUEMARCA"]
[null,null,null,null,null,null,null,null,null,null,null,null,null,null,"000002508","PILLPINTO","01","13","10","08","0113","000002508 - PILLPINTO",null,null,null,null,null,"07","05","LIVITACA","0705","0705 - LIVITACA"]
[null,null,null,null,null,null,null,null,null,null,null,null,null,null,"000010076","ACOMAYO - ESSALUD","01","13","02","01","0113","000010076 - ACOMAYO - ESSALUD",null,null,null,null,null,"07","06","LLUSCO","0706","0706 - LLUSCO"]
[null,null,null,null,null,null,null,null,null,null,null,null,null,0,"000012926","SANTA LUCIA","01","13","02","05","0113","000012926 - SANTA LUCIA",null,null,null,null,null,"07","07","QUIÑOTA","0707","0707 - QUIÑOTA"]
[null,null,null,null,null,null,null,null,null,null,null,null,null,1,"000000000","(All)","01","15",null,null,"0115","000000000 - (All)",null,null,null,null,null,"07","08","VELILLE","0708","0708 - VELILLE"]
[null,null,null,null,null,null,null,null,null,null,null,null,null,2,"000002524","PAMPACAMARA","01","15","12","05","0115","000002524 - PAMPACAMARA",null,null,null,null,null,"08","00","(All)","0800","0800 - (All)"]
[null,null,null,null,null,null,null,null,null,null,null,null,null,3,"000002526","QUINCE MIL","01","15","12","03","0115","000002526 - QUINCE MIL",null,null,null,null,null,"08","01","ESPINAR","0801","0801 - ESPINAR"]
[null,null,null,null,null,null,null,null,null,null,null,null,null,4,"000002527","CCARHUAYO","01","15","12","04","0115","000002527 - CCARHUAYO",null,null,null,null,null,"08","02","CONDOROMA",{"$f":"CONCATENATE(AB75,AC75)","v":"0802"},{"$f":"CONCATENATE(AB75,AC75,\" - \",AD75)","v":"0802 - CONDOROMA"}]
[null,null,null,null,null,null,null,null,null,null,null,null,null,5,"000002528","CCATCCA","01","15","12","05","0115","000002528 - CCATCCA",null,null,null,null,null,"08","03","COPORAQUE","0803","0803 - COPORAQUE"]
[null,null,null,null,null,null,null,null,null,null,null,null,null,6,"000002529","KCAURY","01","15","12","05","0115","000002529 - KCAURY",null,null,null,null,null,"08","04","OCORURO","0804","0804 - OCORURO"]
[null,null,null,null,null,null,null,null,null,null,null,null,null,7,"000002535","MARCAPATA","01","15","12","09","0115","000002535 - MARCAPATA",null,null,null,null,null,"08","05","PALLPATA","0805","0805 - PALLPATA"]
[null,null,null,null,null,null,null,null,null,null,null,null,null,9,"000002536","OCONGATE","01","15","12","10","0115","000002536 - OCONGATE",null,null,null,null,null,"08","06","PICHIGUA","0806","0806 - PICHIGUA"]
[null,null,null,null,null,null,null,null,null,null,null,null,null,10,"000006977","TINKI","01","15","12","10",{"$f":"CONCATENATE(Q80,R80)","v":"0115"},{"$f":"CONCATENATE(O80,\" - \",P80)","v":"000006977 - TINKI"},null,null,null,null,null,"08","07","SUYCKUTAMBO","0807","0807 - SUYCKUTAMBO"]
[null,null,null,null,null,null,null,null,null,null,null,null,null,11,"000007110","INCACANCHA","01","15","12","09","0115","000007110 - INCACANCHA",null,null,null,null,null,"08","08","ALTO PICHIGUA","0808","0808 - ALTO PICHIGUA"]
[null,null,null,null,null,null,null,null,null,null,null,null,null,12,"000012931","CHICHINA","01","15","12","05","0115","000012931 - CHICHINA",null,null,null,null,null,"09","00","(All)","0900","0900 - (All)"]
[null,null,null,null,null,null,null,null,null,null,null,null,null,13,"000016335","CCAPANA","01","15","12","05","0115","000016335 - CCAPANA",null,null,null,null,null,"09","01","SANTA ANA","0901","0901 - SANTA ANA"]
[null,null,null,null,null,null,null,null,null,null,null,null,null,0,"000000000","(All)","01","16",null,null,"0116","000000000 - (All)",null,null,null,null,null,"09","02","ECHARATE","0902","0902 - ECHARATE"]
[null,null,null,null,null,null,null,null,null,null,null,null,null,1,"000002300","SAN JERONIMO","01","16","01","04","0116","000002300 - SAN JERONIMO",null,null,null,null,null,"09","03","HUAYOPATA","0903","0903 - HUAYOPATA"]
[null,null,null,null,null,null,null,null,null,null,null,null,null,2,"000002301","SAN SEBASTIAN","01","16","01","05","0116","000002301 - SAN SEBASTIAN",null,null,null,null,null,"09","04","MARANURA","0904","0904 - MARANURA"]
[null,null,null,null,null,null,null,null,null,null,null,null,null,3,"000002303","SANTA ROSA","01","16","01","05","0116","000002303 - SANTA ROSA",null,null,null,null,null,"09","05","OCOBAMBA","0905","0905 - OCOBAMBA"]
[null,null,null,null,null,null,null,null,null,null,null,null,null,4,"000002314","SAYLLA","01","16","01","07","0116","000002314 - SAYLLA",null,null,null,null,null,"09","06","QUELLOUNO","0906","0906 - QUELLOUNO"]
[null,null,null,null,null,null,null,null,null,null,null,null,null,5,"000002323","RONDOCAN","01","16","02","06","0116","000002323 - RONDOCAN",null,null,null,null,null,"09","07","KIMBIRI","0907","0907 - KIMBIRI"]
[null,null,null,null,null,null,null,null,null,null,null,null,null,6,"000007699","CONCHACALLE","01","16","01","04","0116","000007699 - CONCHACALLE",null,null,null,null,null,"09","08","SANTA TERESA","0908","0908 - SANTA TERESA"]
[null,null,null,null,null,null,null,null,null,null,null,null,null,7,"000010065","SAN SEBASTIAN ESSALUD","01","16","01","05","0116","000010065 - SAN SEBASTIAN ESSALUD",null,null,null,null,null,"09","09","VILCABAMBA","0909","0909 - VILCABAMBA"]
[null,null,null,null,null,null,null,null,null,null,null,null,null,8,"000011743","POLICIAL \"SANTA ROSA\"  CUSCO","01","16","01","05","0116","000011743 - POLICIAL \"SANTA ROSA\"  CUSCO",null,null,null,null,null,"09","10","PICHARI","0910","0910 - PICHARI"]
[null,null,null,null,null,null,null,null,null,null,null,null,null,9,"000018926","ESTABLECIMIENTO PENITENCIARIO CUSCO VARONES","01","16","01","04","0116","000018926 - ESTABLECIMIENTO PENITENCIARIO CUSCO VARONES",null,null,null,null,null,"09","11","INKAWASI                                ","0911","0911 - INKAWASI                                "]
[null,null,null,null,null,null,null,null,null,null,null,null,null,10,"000021187","ESTABLECIMIENTO PENITENCIARIO CUSCO MUJERES","01","16","01","04","0116","000021187 - ESTABLECIMIENTO PENITENCIARIO CUSCO MUJERES",null,null,null,null,null,"09","12","VILLA VIRGEN","0912","0912 - VILLA VIRGEN"]
[null,null,null,null,null,null,null,null,null,null,null,null,null,0,"000026181","MENTAL SAN SEBASTIAN","01","16","01","05","0116","000026181 - MENTAL SAN SEBASTIAN",null,null,null,null,null,"09","13","VILLA KINTIARINA","0913","0913 - VILLA KINTIARINA"]
[null,null,null,null,null,null,null,null,null,null,null,null,null,1,"000030727","PATRÓN SAN SEBASTIAN","01","16","01","04","0116","000030727 - PATRÓN SAN SEBASTIAN",null,null,null,null,null,"09","14","MEGANTONI","0914","0914 - MEGANTONI"]
[null,null,null,null,null,null,null,null,null,null,null,null,null,2,"999999999","(All)","01","99",null,null,"0199","999999999 - (All)",null,null,null,null,null,"09","15","KUMPIRUSHIATO","0915","0915 - KUMPIRUSHIATO"]
[null,null,null,null,null,null,null,null,null,null,null,null,null,3,"000000000","(All)","02","01",null,null,"0201","000000000 - (All)",null,null,null,null,null,"09","16","CIELO PUNCO","0916","0916 - CIELO PUNCO"]
[null,null,null,null,null,null,null,null,null,null,null,null,null,null,"000002292","INDEPENDENCIA","02","01","01","01","0201","000002292 - INDEPENDENCIA",null,null,null,null,null,"09","17","MANITEA","0917","0917 - MANITEA"]
[null,null,null,null,null,null,null,null,null,null,null,null,null,4,"000002297","CCORCCA","02","01","01","02","0201","000002297 - CCORCCA",null,null,null,null,null,"09","18","UNION ASHANINKA","0918","0918 - UNION ASHANINKA"]
[null,null,null,null,null,null,null,null,null,null,null,null,null,5,"000002306","BELEMPAMPA","02","01","01","06","0201","000002306 - BELEMPAMPA",null,null,null,null,null,"09","00","(All)","0900","0900 - (All)"]
[null,null,null,null,null,null,null,null,null,null,null,null,null,6,"000002308","ZARZUELA ALTA","02","01","01","06","0201","000002308 - ZARZUELA ALTA",null,null,null,null,null,"10","01","PARURO","1001","1001 - PARURO"]
[null,null,null,null,null,null,null,null,null,null,null,null,null,null,"000002309","DIGNIDAD NACIONAL","02","01","01","06","0201","000002309 - DIGNIDAD NACIONAL",null,null,null,null,null,"10","02","ACCHA","1002","1002 - ACCHA"]
[null,null,null,null,null,null,null,null,null,null,null,null,null,7,"000002313","OCCOPATA","02","01","01","06","0201","000002313 - OCCOPATA",null,null,null,null,null,"10","03","CCAPI","1003","1003 - CCAPI"]
[null,null,null,null,null,null,null,null,null,null,null,null,null,8,"000010067","C.M. SANTIAGO  ESSALUD","02","01","01","06","0201","000010067 - C.M. SANTIAGO  ESSALUD",null,null,null,null,null,"10","04","COLCHA","1004","1004 - COLCHA"]
[null,null,null,null,null,null,null,null,null,null,null,null,null,9,"000010920","QUINTA BRIGADA DE MONTAÑA","02","01","01","06","0201","000010920 - QUINTA BRIGADA DE MONTAÑA",null,null,null,null,null,"10","05","HUANOQUITE","1005","1005 - HUANOQUITE"]
[null,null,null,null,null,null,null,null,null,null,null,null,null,10,"000026182","MENTAL SANTIAGO","02","01","01","06","0201","000026182 - MENTAL SANTIAGO",null,null,null,null,null,"10","06","OMACHA","1006","1006 - OMACHA"]
[null,null,null,null,null,null,null,null,null,null,null,null,null,11,"000000000","(All)","02","02",null,null,"0202","000000000 - (All)",null,null,null,null,null,"10","07","PACCARITAMBO","1007","1007 - PACCARITAMBO"]
[null,null,null,null,null,null,null,null,null,null,null,null,null,0,"000002302","CCORAO","02","02","01","05","0202","000002302 - CCORAO",null,null,null,null,null,"10","08","PILLPINTO","1008","1008 - PILLPINTO"]
[null,null,null,null,null,null,null,null,null,null,null,null,null,1,"000002307","MANCO CAPAC","02","02","01","06","0202","000002307 - MANCO CAPAC",null,null,null,null,null,"10","09","YAURISQUE","1009","1009 - YAURISQUE"]
[null,null,null,null,null,null,null,null,null,null,null,null,null,null,"000002310","CHOCCO","02","02","01","06","0202","000002310 - CHOCCO",null,null,null,null,null,"11","00","(All)","1100","1100 - (All)"]
[null,null,null,null,null,null,null,null,null,null,null,null,null,null,"000002315","WANCHAQ","02","02","01","08","0202","000002315 - WANCHAQ",null,null,null,null,null,"11","01","PAUCARTAMBO","1101","1101 - PAUCARTAMBO"]
[null,null,null,null,null,null,null,null,null,null,null,null,null,2,"000002316","TTIO","02","02","01","08","0202","000002316 - TTIO",null,null,null,null,null,"11","02","CAICAY","1102","1102 - CAICAY"]
[null,null,null,null,null,null,null,null,null,null,null,null,null,3,"000010041","ADOLFO GUEVARA VELASCO","02","02","01","08","0202","000010041 - ADOLFO GUEVARA VELASCO",null,null,null,null,null,"11","03","CHALLABAMBA","1103","1103 - CHALLABAMBA"]
[null,null,null,null,null,null,null,null,null,null,null,null,null,4,"000026183","METROPOLITANO","02","02","01","08","0202","000026183 - METROPOLITANO",null,null,null,null,null,"11","04","COLQUEPATA","1104","1104 - COLQUEPATA"]
[null,null,null,null,null,null,null,null,null,null,null,null,null,5,"000030730","PATRON SANTIAGO","02","02","01","08","0202","000030730 - PATRON SANTIAGO",null,null,null,null,null,"11","05","HUANCARANI","1105","1105 - HUANCARANI"]
[null,null,null,null,null,null,null,null,null,null,null,null,null,6,"000000000","(All)","02","03",null,null,"0203","000000000 - (All)",null,null,null,null,null,"11","06","KOSÑIPATA","1106","1106 - KOSÑIPATA"]
[null,null,null,null,null,null,null,null,null,null,null,null,null,7,"000002326","ANTA","02","03","03","01","0203","000002326 - ANTA",null,null,null,null,null,"12","00","(All)","1200","1200 - (All)"]
[null,null,null,null,null,null,null,null,null,null,null,null,null,0,"000002327","CHACAN","02","03","03","01","0203","000002327 - CHACAN",null,null,null,null,null,"12","01","URCOS","1201","1201 - URCOS"]
[null,null,null,null,null,null,null,null,null,null,null,null,null,1,"000002328","COMPONE","02","03","03","01","0203","000002328 - COMPONE",null,null,null,null,null,"12","02","ANDAHUAYLILLAS","1202","1202 - ANDAHUAYLILLAS"]
[null,null,null,null,null,null,null,null,null,null,null,null,null,2,"000002329","CONCHACALLA","02","03","03","01","0203","000002329 - CONCHACALLA",null,null,null,null,null,"12","03","CAMANTI","1203","1203 - CAMANTI"]
[null,null,null,null,null,null,null,null,null,null,null,null,null,3,"000002330","ANCAHUASI","02","03","03","02","0203","000002330 - ANCAHUASI",null,null,null,null,null,"12","04","CCARHUAYO","1204","1204 - CCARHUAYO"]
[null,null,null,null,null,null,null,null,null,null,null,null,null,4,"000002331","CACHIMAYO","02","03","03","03","0203","000002331 - CACHIMAYO",null,null,null,null,null,"12","05","CCATCA","1205","1205 - CCATCA"]
[null,null,null,null,null,null,null,null,null,null,null,null,null,5,"000002332","CHINCHAYPUJIO","02","03","03","04","0203","000002332 - CHINCHAYPUJIO",null,null,null,null,null,"12","06","CUSIPATA","1206","1206 - CUSIPATA"]
[null,null,null,null,null,null,null,null,null,null,null,null,null,6,"000002333","HUAROCONDO","02","03","03","05","0203","000002333 - HUAROCONDO",null,null,null,null,null,"12","07","HUARO","1207","1207 - HUARO"]
[null,null,null,null,null,null,null,null,null,null,null,null,null,7,"000002334","HUAYLLACOCHA","02","03","03","05","0203","000002334 - HUAYLLACOCHA",null,null,null,null,null,"12","08","LUCRE","1208","1208 - LUCRE"]
[null,null,null,null,null,null,null,null,null,null,null,null,null,null,"000002339","PUCYURA ANTA","02","03","03","08","0203","000002339 - PUCYURA ANTA",null,null,null,null,null,"12","09","MARCAPATA","1209","1209 - MARCAPATA"]
[null,null,null,null,null,null,null,null,null,null,null,null,null,8,"000002340","ZURITE","02","03","03","09","0203","000002340 - ZURITE",null,null,null,null,null,"12","10","OCONGATE","1210","1210 - OCONGATE"]
[null,null,null,null,null,null,null,null,null,null,null,null,null,9,"000006972","PANTIPATA","02","03","03","04","0203","000006972 - PANTIPATA",null,null,null,null,null,"12","11","OROPESA","1211","1211 - OROPESA"]
[null,null,null,null,null,null,null,null,null,null,null,null,null,10,"000027790","MENTAL COMUNITARIO ANTA","02","03","03","01","0203","000027790 - MENTAL COMUNITARIO ANTA",null,null,null,null,null,"12","12","QUIQUIJANA","1212","1212 - QUIQUIJANA"]
[null,null,null,null,null,null,null,null,null,null,null,null,null,null,"000029514","ESSALUD ANTA","02","03","03","01","0203","000029514 - ESSALUD ANTA",null,null,null,null,null,"13","00","(All)","1300","1300 - (All)"]
[null,null,null,null,null,null,null,null,null,null,null,null,null,null,"000000000","(All)","02","04",null,null,"0204","000000000 - (All)",null,null,null,null,null,"13","01","URUBAMBA","1301","1301 - URUBAMBA"]
[null,null,null,null,null,null,null,null,null,null,null,null,null,null,"000002336","LIMATAMBO","02","04","03","06","0204","000002336 - LIMATAMBO",null,null,null,null,null,"13","02","CHINCHERO","1302","1302 - CHINCHERO"]
[null,null,null,null,null,null,null,null,null,null,null,null,null,null,"000002337","PAMPACONGA","02","04","03","06","0204","000002337 - PAMPACONGA",null,null,null,null,null,"13","03","HUAYLLABAMBA","1303","1303 - HUAYLLABAMBA"]
[null,null,null,null,null,null,null,null,null,null,null,null,null,null,"000002338","MOLLEPATA","02","04","03","07","0204","000002338 - MOLLEPATA",null,null,null,null,null,"13","04","MACHUPICCHU","1304","1304 - MACHUPICCHU"]
[null,null,null,null,null,null,null,null,null,null,null,null,null,null,"000010761","URATARI","02","04","03","06","0204","000010761 - URATARI",null,null,null,null,null,"13","05","MARAS","1305","1305 - MARAS"]
[null,null,null,null,null,null,null,null,null,null,null,null,null,null,"000021061","HUAMANPATA","02","04","03","07","0204","000021061 - HUAMANPATA",null,null,null,null,null,"13","06","OLLANTAYTAMBO","1306","1306 - OLLANTAYTAMBO"]
[null,null,null,null,null,null,null,null,null,null,null,null,null,null,"000000000","(All)","02","05",null,null,"0205","000000000 - (All)",null,null,null,null,null,"13","07","YUCAY",{"$f":"CONCATENATE(AB138,AC138)","v":"1307"},"1307 - YUCAY"]
[null,null,null,null,null,null,null,null,null,null,null,null,null,null,"000002343","COYA","02","05","04","02","0205","000002343 - COYA",null,null,null,null,null,"00","00","(All)",{"$f":"CONCATENATE(AB139,AC139)","v":"0000"},"0000 - (All)"]
[null,null,null,null,null,null,null,null,null,null,null,null,null,null,"000002344","LAMAY","02","05","04","03","0205","000002344 - LAMAY"]
[null,null,null,null,null,null,null,null,null,null,null,null,null,null,"000002348","PISAC","02","05","04","05","0205","000002348 - PISAC"]
[null,null,null,null,null,null,null,null,null,null,null,null,null,null,"000002349","CUYO CHICO","02","05","04","05","0205","000002349 - CUYO CHICO"]
[null,null,null,null,null,null,null,null,null,null,null,null,null,null,"000002350","CUYO GRANDE","02","05","04","05","0205","000002350 - CUYO GRANDE"]
[null,null,null,null,null,null,null,null,null,null,null,null,null,null,"000002351","QUELLO QUELLO","02","05","04","05","0205","000002351 - QUELLO QUELLO"]
[null,null,null,null,null,null,null,null,null,null,null,null,null,null,"000002352","SAN SALVADOR","02","05","04","06","0205","000002352 - SAN SALVADOR"]
[null,null,null,null,null,null,null,null,null,null,null,null,null,null,"000002353","TARAY","02","05","04","07","0205","000002353 - TARAY"]
[null,null,null,null,null,null,null,null,null,null,null,null,null,null,"000002354","HUANCALLE","02","05","04","07","0205","000002354 - HUANCALLE"]
[null,null,null,null,null,null,null,null,null,null,null,null,null,null,"000006970","TIRACANCHA","02","05","04","06","0205","000006970 - TIRACANCHA"]
[null,null,null,null,null,null,null,null,null,null,null,null,null,null,"000006975","SAYLLAFAYA","02","05","04","03","0205","000006975 - SAYLLAFAYA"]
[null,null,null,null,null,null,null,null,null,null,null,null,null,null,"000007145","HUAMA","02","05","04","03",{"$f":"CONCATENATE(Q150,R150)","v":"0205"},{"$f":"CONCATENATE(O150,\" - \",P150)","v":"000007145 - HUAMA"}]
[null,null,null,null,null,null,null,null,null,null,null,null,null,null,"000007146","POQUES","02","05","04","03","0205","000007146 - POQUES"]
[null,null,null,null,null,null,null,null,null,null,null,null,null,null,"000025368","HUARQUI","02","05","04","03","0205","000025368 - HUARQUI"]
[null,null,null,null,null,null,null,null,null,null,null,null,null,null,"000000000","(All)","02","06",null,null,"0206","000000000 - (All)"]
[null,null,null,null,null,null,null,null,null,null,null,null,null,null,"000002341","CALCA","02","06","04","01","0206","000002341 - CALCA"]
[null,null,null,null,null,null,null,null,null,null,null,null,null,null,"000002342","AMPARAES","02","06","04","04","0206","000002342 - AMPARAES"]
[null,null,null,null,null,null,null,null,null,null,null,null,null,null,"000002345","CCACHIN","02","06","04","04","0206","000002345 - CCACHIN"]
[null,null,null,null,null,null,null,null,null,null,null,null,null,null,"000002346","CHOQUECANCHA","02","06","04","04","0206","000002346 - CHOQUECANCHA"]
[null,null,null,null,null,null,null,null,null,null,null,null,null,null,"000002347","LARES","02","06","04","04","0206","000002347 - LARES"]
[null,null,null,null,null,null,null,null,null,null,null,null,null,null,"000002361","SUYO","02","06","04","04","0206","000002361 - SUYO"]
[null,null,null,null,null,null,null,null,null,null,null,null,null,null,"000002515","PAROBAMBA","02","06","11","03","0206","000002515 - PAROBAMBA"]
[null,null,null,null,null,null,null,null,null,null,null,null,null,null,"000007143","OTOCANI","02","06","11","03","0206","000007143 - OTOCANI"]
[null,null,null,null,null,null,null,null,null,null,null,null,null,null,"000007144","PATABAMBA","02","06","04","07","0206","000007144 - PATABAMBA"]
[null,null,null,null,null,null,null,null,null,null,null,null,null,null,"000010069","ESSALUD CALCA","02","06","04","01","0206","000010069 - ESSALUD CALCA"]
[null,null,null,null,null,null,null,null,null,null,null,null,null,null,"000010759","HUARAN","02","06","04","01","0206","000010759 - HUARAN"]
[null,null,null,null,null,null,null,null,null,null,null,null,null,null,"000010762","ACCHA ALTA - PAMPALLACTA","02","06","04","01","0206","000010762 - ACCHA ALTA - PAMPALLACTA"]
[null,null,null,null,null,null,null,null,null,null,null,null,null,null,"000026273","MENTAL COMUNITARIO VIRGEN ASUNTA DE CALCA","02","06","04","01","0206","000026273 - MENTAL COMUNITARIO VIRGEN ASUNTA DE CALCA"]
[null,null,null,null,null,null,null,null,null,null,null,null,null,null,"000000000","(All)","02","07",null,null,"0207","000000000 - (All)"]
[null,null,null,null,null,null,null,null,null,null,null,null,null,null,"000002540","URUBAMBA","02","07","13","01","0207","000002540 - URUBAMBA"]
[null,null,null,null,null,null,null,null,null,null,null,null,null,null,"000002541","YANAHUARA","02","07","13","01","0207","000002541 - YANAHUARA"]
[null,null,null,null,null,null,null,null,null,null,null,null,null,null,"000002543","CHINCHERO","02","07","13","02","0207","000002543 - CHINCHERO"]
[null,null,null,null,null,null,null,null,null,null,null,null,null,null,"000002544","OCCOTUAN","02","07","13","02","0207","000002544 - OCCOTUAN"]
[null,null,null,null,null,null,null,null,null,null,null,null,null,null,"000002545","HUAYLLABAMBA","02","07","13","03","0207","000002545 - HUAYLLABAMBA"]
[null,null,null,null,null,null,null,null,null,null,null,null,null,null,"000002546","MACHUPICCHU","02","07","13","04","0207","000002546 - MACHUPICCHU"]
[null,null,null,null,null,null,null,null,null,null,null,null,null,null,"000002547","COLLPANI","02","07","13","04","0207","000002547 - COLLPANI"]
[null,null,null,null,null,null,null,null,null,null,null,null,null,null,"000002548","MARAS","02","07","13","05","0207","000002548 - MARAS"]
[null,null,null,null,null,null,null,null,null,null,null,null,null,null,"000002549","OLLANTAYTAMBO","02","07","13","06","0207","000002549 - OLLANTAYTAMBO"]
[null,null,null,null,null,null,null,null,null,null,null,null,null,null,"000002550","CHILLCA","02","07","13","06","0207","000002550 - CHILLCA"]
[null,null,null,null,null,null,null,null,null,null,null,null,null,null,"000002551","YUCAY","02","07","13","07","0207","000002551 - YUCAY"]
[null,null,null,null,null,null,null,null,null,null,null,null,null,null,"000006974","CAMINO INCA HUAYLLABAMBA","02","07","13","04","0207","000006974 - CAMINO INCA HUAYLLABAMBA"]
[null,null,null,null,null,null,null,null,null,null,null,null,null,null,"000010060","CAS URUBAMBA -ESSALUD","02","07","13","01","0207","000010060 - CAS URUBAMBA -ESSALUD"]
[null,null,null,null,null,null,null,null,null,null,null,null,null,null,"000010073","MACHU PICCHU - ESSALUD","02","07","13","04","0207","000010073 - MACHU PICCHU - ESSALUD"]
[null,null,null,null,null,null,null,null,null,null,null,null,null,null,"000010758","CRUZPATA","02","07","13","05","0207","000010758 - CRUZPATA"]
[null,null,null,null,null,null,null,null,null,null,null,null,null,null,"000010760","PATACANCHA","02","07","13","06","0207","000010760 - PATACANCHA"]
[null,null,null,null,null,null,null,null,null,null,null,null,null,null,"000030666","MENTAL COMUNITARIO URUBAMBA","02","07","13","01","0207","000030666 - MENTAL COMUNITARIO URUBAMBA"]
[null,null,null,null,null,null,null,null,null,null,null,null,null,null,"000000000","(All)","02","08",null,null,"0208","000000000 - (All)"]
[null,null,null,null,null,null,null,null,null,null,null,null,null,null,"000002355","LA QUEBRADA","02","08","04","08","0208","000002355 - LA QUEBRADA"]
[null,null,null,null,null,null,null,null,null,null,null,null,null,null,"000002356","CCORIMAYO","02","08","04","08","0208","000002356 - CCORIMAYO"]
[null,null,null,null,null,null,null,null,null,null,null,null,null,null,"000002357","COLCCA YANATILE","02","08","04","08","0208","000002357 - COLCCA YANATILE"]
[null,null,null,null,null,null,null,null,null,null,null,null,null,null,"000002358","MUYUPAY","02","08","04","08","0208","000002358 - MUYUPAY"]
[null,null,null,null,null,null,null,null,null,null,null,null,null,null,"000002359","PUTUCUSI","02","08","04","08","0208","000002359 - PUTUCUSI"]
[null,null,null,null,null,null,null,null,null,null,null,null,null,null,"000002360","QUESQUENTO","02","08","04","08","0208","000002360 - QUESQUENTO"]
[null,null,null,null,null,null,null,null,null,null,null,null,null,null,"000002362","HUACHIBAMBA","02","08","04","08","0208","000002362 - HUACHIBAMBA"]
[null,null,null,null,null,null,null,null,null,null,null,null,null,null,"000002464","VERSALLES","02","08","09","05","0208","000002464 - VERSALLES"]
[null,null,null,null,null,null,null,null,null,null,null,null,null,null,"000002467","PUENTE SANTIAGO","02","08","09","06","0208","000002467 - PUENTE SANTIAGO"]
[null,null,null,null,null,null,null,null,null,null,null,null,null,null,"000006971","COMBAPATA YANATILE","02","08","04","08","0208","000006971 - COMBAPATA YANATILE"]
[null,null,null,null,null,null,null,null,null,null,null,null,null,null,"000006973","BELLAVISTA","02","08","04","08","0208","000006973 - BELLAVISTA"]
[null,null,null,null,null,null,null,null,null,null,null,null,null,null,"000007142","CHANCAMAYO","02","08","04","08","0208","000007142 - CHANCAMAYO"]
[null,null,null,null,null,null,null,null,null,null,null,null,null,null,"000000000","(All)","02","09",null,null,"0209","000000000 - (All)"]
[null,null,null,null,null,null,null,null,null,null,null,null,null,null,"000002290","SAN PEDRO CUSCO","02","09","01","01","0209","000002290 - SAN PEDRO CUSCO"]
[null,null,null,null,null,null,null,null,null,null,null,null,null,null,"000002291","SIETE CUARTONES","02","09","01","01","0209","000002291 - SIETE CUARTONES"]
[null,null,null,null,null,null,null,null,null,null,null,null,null,null,"000002293","MIRAFLORES","02","09","01","01","0209","000002293 - MIRAFLORES"]
[null,null,null,null,null,null,null,null,null,null,null,null,null,null,"000002294","PICCHU LA RINCONADA","02","09","01","01","0209","000002294 - PICCHU LA RINCONADA"]
[null,null,null,null,null,null,null,null,null,null,null,null,null,null,"000002295","BUENA VISTA","02","09","01","01","0209","000002295 - BUENA VISTA"]
[null,null,null,null,null,null,null,null,null,null,null,null,null,null,"000002299","POROY","02","09","01","03","0209","000002299 - POROY"]
[null,null,null,null,null,null,null,null,null,null,null,null,null,null,"999999999","(All)","02","99",null,null,"0299","999999999 - (All)"]
[null,null,null,null,null,null,null,null,null,null,null,null,null,null,"000002421","QUILLABAMBA","03","00","09","01","0300","000002421 - QUILLABAMBA"]
[null,null,null,null,null,null,null,null,null,null,null,null,null,null,"000000000","(All)","03","01",null,null,"0301","000000000 - (All)"]
[null,null,null,null,null,null,null,null,null,null,null,null,null,null,"000002422","HUAYANAY","03","01","09","01","0301","000002422 - HUAYANAY"]
[null,null,null,null,null,null,null,null,null,null,null,null,null,null,"000002423","IDMA","03","01","09","01","0301","000002423 - IDMA"]
[null,null,null,null,null,null,null,null,null,null,null,null,null,null,"000002424","POTRERO","03","01","09","01","0301","000002424 - POTRERO"]
[null,null,null,null,null,null,null,null,null,null,null,null,null,null,"000002425","ECHARATE","03","01","09","02","0301","000002425 - ECHARATE"]
[null,null,null,null,null,null,null,null,null,null,null,null,null,null,"000002430","PAMPA CONCEPCION","03","01","09","02","0301","000002430 - PAMPA CONCEPCION"]
[null,null,null,null,null,null,null,null,null,null,null,null,null,null,"000002446","CHACCO","03","01","09","02","0301","000002446 - CHACCO"]
[null,null,null,null,null,null,null,null,null,null,null,null,null,null,"000002451","CHAHUARES","03","01","09","02","0301","000002451 - CHAHUARES"]
[null,null,null,null,null,null,null,null,null,null,null,null,null,null,"000008910","SANTA ANA","03","01","09","01","0301","000008910 - SANTA ANA"]
[null,null,null,null,null,null,null,null,null,null,null,null,null,null,"000010062","QUILLABAMBA - ESSALUD","03","01","09","01","0301","000010062 - QUILLABAMBA - ESSALUD"]
[null,null,null,null,null,null,null,null,null,null,null,null,null,null,"000011744","POSTA MEDICO POLICIAL LA CONVENCION - QUILLABAMBA","03","01","09","01","0301","000011744 - POSTA MEDICO POLICIAL LA CONVENCION - QUILLABAMBA"]
[null,null,null,null,null,null,null,null,null,null,null,null,null,null,"000015842","PAVAYOC","03","01","09","01",{"$f":"CONCATENATE(Q218,R218)","v":"0301"},{"$f":"CONCATENATE(O218,\" - \",P218)","v":"000015842 - PAVAYOC"}]
[null,null,null,null,null,null,null,null,null,null,null,null,null,null,"000024653","INPE QUILLABAMBA","03","01","09","01","0301","000024653 - INPE QUILLABAMBA"]
[null,null,null,null,null,null,null,null,null,null,null,null,null,null,"000026386","MENTAL QUILLABAMBA","03","01","09","01","0301","000026386 - MENTAL QUILLABAMBA"]
[null,null,null,null,null,null,null,null,null,null,null,null,null,null,"000033273","SAN ISIDRO LABRADOR - ECHARATI","03","01","09","02","0301","000033273 - SAN ISIDRO LABRADOR - ECHARATI"]
[null,null,null,null,null,null,null,null,null,null,null,null,null,null,"000000000","(All)","03","02",null,null,"0302","000000000 - (All)"]
[null,null,null,null,null,null,null,null,null,null,null,null,null,null,"000002453","HUYRO","03","02","09","03","0302","000002453 - HUYRO"]
[null,null,null,null,null,null,null,null,null,null,null,null,null,null,"000002454","ALFAMAYO","03","02","09","03","0302","000002454 - ALFAMAYO"]
[null,null,null,null,null,null,null,null,null,null,null,null,null,null,"000002455","HUAYOPATA","03","02","09","03","0302","000002455 - HUAYOPATA"]
[null,null,null,null,null,null,null,null,null,null,null,null,null,null,"000002456","AMAYBAMBA","03","02","09","03","0302","000002456 - AMAYBAMBA"]
[null,null,null,null,null,null,null,null,null,null,null,null,null,null,"000002457","SAN PABLO HUAYOPATA","03","02","09","03","0302","000002457 - SAN PABLO HUAYOPATA"]
[null,null,null,null,null,null,null,null,null,null,null,null,null,null,"000002458","MARANURA","03","02","09","04","0302","000002458 - MARANURA"]
[null,null,null,null,null,null,null,null,null,null,null,null,null,null,"000002460","SANTA MARIA","03","02","09","04","0302","000002460 - SANTA MARIA"]
[null,null,null,null,null,null,null,null,null,null,null,null,null,null,"000002461","UCHUMAYO","03","02","09","04","0302","000002461 - UCHUMAYO"]
[null,null,null,null,null,null,null,null,null,null,null,null,null,null,"000002476","SANTA TERESA","03","02","09","08","0302","000002476 - SANTA TERESA"]
[null,null,null,null,null,null,null,null,null,null,null,null,null,null,"000002477","SULLUCUYOC","03","02","09","08","0302","000002477 - SULLUCUYOC"]
[null,null,null,null,null,null,null,null,null,null,null,null,null,null,"000002478","TOTORA","03","02","09","08","0302","000002478 - TOTORA"]
[null,null,null,null,null,null,null,null,null,null,null,null,null,null,"000010075","CAP HUYRO - ESSALUD","03","02","09","03","0302","000010075 - CAP HUYRO - ESSALUD"]
[null,null,null,null,null,null,null,null,null,null,null,null,null,null,"000000000","(All)","03","03",null,null,"0303","000000000 - (All)"]
[null,null,null,null,null,null,null,null,null,null,null,null,null,null,"000002363","TUPAC AMARU QUELLOUNO","03","03","04","08","0303","000002363 - TUPAC AMARU QUELLOUNO"]
[null,null,null,null,null,null,null,null,null,null,null,null,null,null,"000002462","OCCOBAMBA LACONVENCION","03","03","09","05","0303","000002462 - OCCOBAMBA LACONVENCION"]
[null,null,null,null,null,null,null,null,null,null,null,null,null,null,"000002463","CHINGANILLA","03","03","09","05","0303","000002463 - CHINGANILLA"]
[null,null,null,null,null,null,null,null,null,null,null,null,null,null,"000002465","QUELLOUNO","03","03","09","06","0303","000002465 - QUELLOUNO"]
[null,null,null,null,null,null,null,null,null,null,null,null,null,null,"000002466","HUILLCAPAMPA","03","03","09","06","0303","000002466 - HUILLCAPAMPA"]
[null,null,null,null,null,null,null,null,null,null,null,null,null,null,"000002468","SAN MARTIN","03","03","09","06","0303","000002468 - SAN MARTIN"]
[null,null,null,null,null,null,null,null,null,null,null,null,null,null,"000008906","ESTRELLA","03","03","09","06","0303","000008906 - ESTRELLA"]
[null,null,null,null,null,null,null,null,null,null,null,null,null,null,"000008907","MATORIATO","03","03","09","06","0303","000008907 - MATORIATO"]
[null,null,null,null,null,null,null,null,null,null,null,null,null,null,"000008908","CHIRUMBIA","03","03","09","06","0303","000008908 - CHIRUMBIA"]
[null,null,null,null,null,null,null,null,null,null,null,null,null,null,"000008909","CHAPO BOYERO","03","03","09","06","0303","000008909 - CHAPO BOYERO"]
[null,null,null,null,null,null,null,null,null,null,null,null,null,null,"000000000","(All)","03","04",null,null,"0304","000000000 - (All)"]
[null,null,null,null,null,null,null,null,null,null,null,null,null,null,"000002427","KITENI","03","04","09","02","0304","000002427 - KITENI"]
[null,null,null,null,null,null,null,null,null,null,null,null,null,null,"000002431","IVOCHOTE","03","04","09","02","0304","000002431 - IVOCHOTE"]
[null,null,null,null,null,null,null,null,null,null,null,null,null,null,"000002432","KEPASHIATO","03","04","09","02","0304","000002432 - KEPASHIATO"]
[null,null,null,null,null,null,null,null,null,null,null,null,null,null,"000002434","MATERIATO","03","04","09","02","0304","000002434 - MATERIATO"]
[null,null,null,null,null,null,null,null,null,null,null,null,null,null,"000002438","PACHIRI","03","04","09","02","0304","000002438 - PACHIRI"]
[null,null,null,null,null,null,null,null,null,null,null,null,null,null,"000002440","PANGOA","03","04","09","02","0304","000002440 - PANGOA"]
[null,null,null,null,null,null,null,null,null,null,null,null,null,null,"000002443","SANIRIATO","03","04","09","02","0304","000002443 - SANIRIATO"]
[null,null,null,null,null,null,null,null,null,null,null,null,null,null,"000002447","KAMANQUIRIATO","03","04","09","02","0304","000002447 - KAMANQUIRIATO"]
[null,null,null,null,null,null,null,null,null,null,null,null,null,null,"000002489","YUVENI","03","04","09","09","0304","000002489 - YUVENI"]
[null,null,null,null,null,null,null,null,null,null,null,null,null,null,"000002493","SELVA ALEGRE","03","04","09","09","0304","000002493 - SELVA ALEGRE"]
[null,null,null,null,null,null,null,null,null,null,null,null,null,null,"000006976","CHONTABAMBA","03","04","09","09","0304","000006976 - CHONTABAMBA"]
[null,null,null,null,null,null,null,null,null,null,null,null,null,null,"000013068","TRIO RIO","03","04","09","02","0304","000013068 - TRIO RIO"]
[null,null,null,null,null,null,null,null,null,null,null,null,null,null,"000013069","PUGUIENTIMARI","03","04","09","02","0304","000013069 - PUGUIENTIMARI"]
[null,null,null,null,null,null,null,null,null,null,null,null,null,null,"000014531","CENTRO DE ATENCIÓN PRIMARIA I ECHARATE - KITENI","03","04","09","02","0304","000014531 - CENTRO DE ATENCIÓN PRIMARIA I ECHARATE - KITENI"]
[null,null,null,null,null,null,null,null,null,null,null,null,null,null,"000024583","BCT N° 314 - KEPASHIATO","03","04","09","02","0304","000024583 - BCT N° 314 - KEPASHIATO"]
[null,null,null,null,null,null,null,null,null,null,null,null,null,null,"000000000","(All)","03","05",null,null,"0305","000000000 - (All)"]
[null,null,null,null,null,null,null,null,null,null,null,null,null,null,"000002426","KIRIGUETI","03","05","09","14","0305","000002426 - KIRIGUETI"]
[null,null,null,null,null,null,null,null,null,null,null,null,null,null,"000002428","CHOCORIARI","03","05","09","14","0305","000002428 - CHOCORIARI"]
[null,null,null,null,null,null,null,null,null,null,null,null,null,null,"000002435","MIARIA","03","05","09","14","0305","000002435 - MIARIA"]
[null,null,null,null,null,null,null,null,null,null,null,null,null,null,"000002436","NUEVA LUZ","03","05","09","14","0305","000002436 - NUEVA LUZ"]
[null,null,null,null,null,null,null,null,null,null,null,null,null,null,"000002437","NUEVO MUNDO","03","05","09","14","0305","000002437 - NUEVO MUNDO"]
[null,null,null,null,null,null,null,null,null,null,null,null,null,null,"000002441","PUERTO HUALLANA","03","05","09","14","0305","000002441 - PUERTO HUALLANA"]
[null,null,null,null,null,null,null,null,null,null,null,null,null,null,"000002442","PUERTO RICO","03","05","09","14","0305","000002442 - PUERTO RICO"]
[null,null,null,null,null,null,null,null,null,null,null,null,null,null,"000002444","SENSA","03","05","09","14","0305","000002444 - SENSA"]
[null,null,null,null,null,null,null,null,null,null,null,null,null,null,"000002445","TIMPIA","03","05","09","14","0305","000002445 - TIMPIA"]
[null,null,null,null,null,null,null,null,null,null,null,null,null,null,"000002448","KAMISEA","03","05","09","14","0305","000002448 - KAMISEA"]
[null,null,null,null,null,null,null,null,null,null,null,null,null,null,"000002452","SHIVANKORENI","03","05","09","14","0305","000002452 - SHIVANKORENI"]
[null,null,null,null,null,null,null,null,null,null,null,null,null,null,"000013066","MONTETONI","03","05","09","14","0305","000013066 - MONTETONI"]
[null,null,null,null,null,null,null,null,null,null,null,null,null,null,"000013067","TANGOSHIARI","03","05","09","14","0305","000013067 - TANGOSHIARI"]
[null,null,null,null,null,null,null,null,null,null,null,null,null,null,"000015235","NUEVA VIDA","03","05","09","14","0305","000015235 - NUEVA VIDA"]
[null,null,null,null,null,null,null,null,null,null,null,null,null,null,"000015843","CASHIRIARI","03","05","09","14","0305","000015843 - CASHIRIARI"]
[null,null,null,null,null,null,null,null,null,null,null,null,null,null,"000015844","CAMANA","03","05","09","14","0305","000015844 - CAMANA"]
[null,null,null,null,null,null,null,null,null,null,null,null,null,null,"000033274","BCT  NUEVO MUNDO","03","05","09","14","0305","000033274 - BCT  NUEVO MUNDO"]
[null,null,null,null,null,null,null,null,null,null,null,null,null,null,"000000000","(All)","03","06",null,null,"0306","000000000 - (All)"]
[null,null,null,null,null,null,null,null,null,null,null,null,null,null,"000002480","PUCYURA","03","06","09","09","0306","000002480 - PUCYURA"]
[null,null,null,null,null,null,null,null,null,null,null,null,null,null,"000002481","CCARCCO","03","06","09","11",{"$f":"CONCATENATE(Q282,R282)","v":"0306"},{"$f":"CONCATENATE(O282,\" - \",P282)","v":"000002481 - CCARCCO"}]
[null,null,null,null,null,null,null,null,null,null,null,null,null,null,"000002482","INCAHUASI","03","06","09","11","0306","000002482 - INCAHUASI"]
[null,null,null,null,null,null,null,null,null,null,null,null,null,null,"000002484","OYARA","03","06","09","09","0306","000002484 - OYARA"]
[null,null,null,null,null,null,null,null,null,null,null,null,null,null,"000002485","PACCAYBAMBA","03","06","09","11","0306","000002485 - PACCAYBAMBA"]
[null,null,null,null,null,null,null,null,null,null,null,null,null,null,"000002486","PAMPACONAS","03","06","09","09","0306","000002486 - PAMPACONAS"]
[null,null,null,null,null,null,null,null,null,null,null,null,null,null,"000002487","CHOQUETIRA","03","06","09","11","0306","000002487 - CHOQUETIRA"]
[null,null,null,null,null,null,null,null,null,null,null,null,null,null,"000002490","ARMA","03","06","09","09","0306","000002490 - ARMA"]
[null,null,null,null,null,null,null,null,null,null,null,null,null,null,"000002491","LUCMAHUAYCO","03","06","09","11","0306","000002491 - LUCMAHUAYCO"]
[null,null,null,null,null,null,null,null,null,null,null,null,null,null,"000002492","PALTAYBAMBA","03","06","09","09","0306","000002492 - PALTAYBAMBA"]
[null,null,null,null,null,null,null,null,null,null,null,null,null,null,"000013070","CHANCAVINE","03","06","09","12","0306","000013070 - CHANCAVINE"]
[null,null,null,null,null,null,null,null,null,null,null,null,null,null,"000000000","(All)","03","07",null,null,"0307","000000000 - (All)"]
[null,null,null,null,null,null,null,null,null,null,null,null,null,null,"000002429","CIRIALO                                                                                             ","03","07","09","02","0307","000002429 - CIRIALO                                                                                             "]
[null,null,null,null,null,null,null,null,null,null,null,null,null,null,"000002433","KORIBENI                                                                                            ","03","07","09","02","0307","000002433 - KORIBENI                                                                                            "]
[null,null,null,null,null,null,null,null,null,null,null,null,null,null,"000002439","PALMA REAL                                                                                          ","03","07","09","02","0307","000002439 - PALMA REAL                                                                                          "]
[null,null,null,null,null,null,null,null,null,null,null,null,null,null,"000002449","ICHIQUIATO                                                                                          ","03","07","09","02","0307","000002449 - ICHIQUIATO                                                                                          "]
[null,null,null,null,null,null,null,null,null,null,null,null,null,null,"000002450","SAN ANTONIO                                                                                         ","03","07","09","02","0307","000002450 - SAN ANTONIO                                                                                         "]
[null,null,null,null,null,null,null,null,null,null,null,null,null,null,"999999999","(All)","03","99",null,null,"0399","999999999 - (All)"]
[null,null,null,null,null,null,null,null,null,null,null,null,null,null,"000000000","(All)","04","00",null,null,"0400","000000000 - (All)"]
[null,null,null,null,null,null,null,null,null,null,null,null,null,null,"000002378","SICUANI","04","00","06","01","0400","000002378 - SICUANI"]
[null,null,null,null,null,null,null,null,null,null,null,null,null,null,"000007135","ESPINAR","04","00","08","01","0400","000007135 - ESPINAR"]
[null,null,null,null,null,null,null,null,null,null,null,null,null,null,"000000000","(All)","04","01",null,null,"0401","000000000 - (All)"]
[null,null,null,null,null,null,null,null,null,null,null,null,null,null,"000002364","YANAOCA","04","01","05","01","0401","000002364 - YANAOCA"]
[null,null,null,null,null,null,null,null,null,null,null,null,null,null,"000002365","PONGOÑA","04","01","05","01","0401","000002365 - PONGOÑA"]
[null,null,null,null,null,null,null,null,null,null,null,null,null,null,"000002372","PAMPAMARCA","04","01","05","06","0401","000002372 - PAMPAMARCA"]
[null,null,null,null,null,null,null,null,null,null,null,null,null,null,"000002373","QUEHUE","04","01","05","07","0401","000002373 - QUEHUE"]
[null,null,null,null,null,null,null,null,null,null,null,null,null,null,"000002374","HUINCHIRI","04","01","05","07","0401","000002374 - HUINCHIRI"]
[null,null,null,null,null,null,null,null,null,null,null,null,null,null,"000002375","SURIMANA","04","01","05","08","0401","000002375 - SURIMANA"]
[null,null,null,null,null,null,null,null,null,null,null,null,null,null,"000002376","TUNGASUCA","04","01","05","08","0401","000002376 - TUNGASUCA"]
[null,null,null,null,null,null,null,null,null,null,null,null,null,null,"000002377","TOCCOCCORI","04","01","05","08","0401","000002377 - TOCCOCCORI"]
[null,null,null,null,null,null,null,null,null,null,null,null,null,null,"000018241","HAMPATURA","04","01","05","01","0401","000018241 - HAMPATURA"]
[null,null,null,null,null,null,null,null,null,null,null,null,null,null,"000032339","CCOCHAPATA","04","01","05","08","0401","000032339 - CCOCHAPATA"]
[null,null,null,null,null,null,null,null,null,null,null,null,null,null,"000000000","(All)","04","02",null,null,"0402","000000000 - (All)"]
[null,null,null,null,null,null,null,null,null,null,null,null,null,null,"000002366","CHECCA","04","02","05","02","0402","000002366 - CHECCA"]
[null,null,null,null,null,null,null,null,null,null,null,null,null,null,"000002367","CHITIBAMBA","04","01","05","02","0401","000002367 - CHITIBAMBA"]
[null,null,null,null,null,null,null,null,null,null,null,null,null,null,"000007700","EL DESCANSO","04","02","05","03","0402","000007700 - EL DESCANSO"]
[null,null,null,null,null,null,null,null,null,null,null,null,null,null,"000000000","(All)","04","03",null,null,"0403","000000000 - (All)"]
[null,null,null,null,null,null,null,null,null,null,null,null,null,null,"000002320","MOSOCLLACTA","04","03","02","04","0403","000002320 - MOSOCLLACTA"]
[null,null,null,null,null,null,null,null,null,null,null,null,null,null,"000002385","CHECACUPE","04","03","06","02","0403","000002385 - CHECACUPE"]
[null,null,null,null,null,null,null,null,null,null,null,null,null,null,"000002386","COMBAPATA CANCHIS","04","03","06","03","0403","000002386 - COMBAPATA CANCHIS"]
[null,null,null,null,null,null,null,null,null,null,null,null,null,null,"000002387","CHIARA","04","03","06","03","0403","000002387 - CHIARA"]
[null,null,null,null,null,null,null,null,null,null,null,null,null,null,"000002392","PITUMARCA","04","03","06","05","0403","000002392 - PITUMARCA"]
[null,null,null,null,null,null,null,null,null,null,null,null,null,null,"000002397","TINTA","04","03","06","08","0403","000002397 - TINTA"]
[null,null,null,null,null,null,null,null,null,null,null,null,null,null,"000000000","(All)","04","04",null,null,"0404","000000000 - (All)"]
[null,null,null,null,null,null,null,null,null,null,null,null,null,null,"000002369","LANGUI","04","04","05","04","0404","000002369 - LANGUI"]
[null,null,null,null,null,null,null,null,null,null,null,null,null,null,"000002370","CONDEVILUYO","04","04","05","04","0404","000002370 - CONDEVILUYO"]
[null,null,null,null,null,null,null,null,null,null,null,null,null,null,"000002371","LAYO","04","04","05","05","0404","000002371 - LAYO"]
[null,null,null,null,null,null,null,null,null,null,null,null,null,null,"000002379","HERCCA","04","04","06","01","0404","000002379 - HERCCA"]
[null,null,null,null,null,null,null,null,null,null,null,null,null,null,"000002380","TECHO OBRERO","04","04","06","01","0404","000002380 - TECHO OBRERO"]
[null,null,null,null,null,null,null,null,null,null,null,null,null,null,"000002388","MARANGANI","04","04","06","04","0404","000002388 - MARANGANI"]
[null,null,null,null,null,null,null,null,null,null,null,null,null,null,"000002389","CHECTUYOC","04","04","06","04","0404","000002389 - CHECTUYOC"]
[null,null,null,null,null,null,null,null,null,null,null,null,null,null,"000002390","CCUYO","04","04","06","04","0404","000002390 - CCUYO"]
[null,null,null,null,null,null,null,null,null,null,null,null,null,null,"000002391","OCCOBAMBA MARANGANI","04","04","06","04","0404","000002391 - OCCOBAMBA MARANGANI"]
[null,null,null,null,null,null,null,null,null,null,null,null,null,null,"000010063","ESSALUD SICUANI","04","04","06","01","0404","000010063 - ESSALUD SICUANI"]
[null,null,null,null,null,null,null,null,null,null,null,null,null,null,"000024639","INPE SICUANI","04","04","06","01","0404","000024639 - INPE SICUANI"]
[null,null,null,null,null,null,null,null,null,null,null,null,null,null,"000024663","SANIDAD PNP  SICUANI","04","04","06","01","0404","000024663 - SANIDAD PNP  SICUANI"]
[null,null,null,null,null,null,null,null,null,null,null,null,null,null,"000000000","(All)","04","05",null,null,"0405","000000000 - (All)"]
[null,null,null,null,null,null,null,null,null,null,null,null,null,null,"000002381","QUEHUAR","04","05","06","01","0405","000002381 - QUEHUAR"]
[null,null,null,null,null,null,null,null,null,null,null,null,null,null,"000002382","UZCUPATA","04","05","06","01","0405","000002382 - UZCUPATA"]
[null,null,null,null,null,null,null,null,null,null,null,null,null,null,"000002383","LA FLORIDA","04","05","06","01","0405","000002383 - LA FLORIDA"]
[null,null,null,null,null,null,null,null,null,null,null,null,null,null,"000002384","PAMPAPHALLA","04","05","06","01","0405","000002384 - PAMPAPHALLA"]
[null,null,null,null,null,null,null,null,null,null,null,null,null,null,"000002393","PHINAYA","04","05","06","05","0405","000002393 - PHINAYA"]
[null,null,null,null,null,null,null,null,null,null,null,null,null,null,"000002394","SAN PABLO CANCHIS","04","05","06","06","0405","000002394 - SAN PABLO CANCHIS"]
[null,null,null,null,null,null,null,null,null,null,null,null,null,null,"000002395","SANTA BARBARA","04","05","06","06","0405","000002395 - SANTA BARBARA"]
[null,null,null,null,null,null,null,null,null,null,null,null,null,null,"000002396","SAN PEDRO CANCHIS","04","05","06","07","0405","000002396 - SAN PEDRO CANCHIS"]
[null,null,null,null,null,null,null,null,null,null,null,null,null,null,"000026387","MENTAL COMUNITARIO SICUANI","04","05","06","01","0405","000026387 - MENTAL COMUNITARIO SICUANI"]
[null,null,null,null,null,null,null,null,null,null,null,null,null,null,"000032923","SR DE PAMPACUCHO-SICUANI","04","05","06","01","0405","000032923 - SR DE PAMPACUCHO-SICUANI"]
[null,null,null,null,null,null,null,null,null,null,null,null,null,null,"000000000","(All)","04","06",null,null,"0406","000000000 - (All)"]
[null,null,null,null,null,null,null,null,null,null,null,null,null,null,"000002410","YAURI","04","06","08","01",{"$f":"CONCATENATE(Q349,R349)","v":"0406"},{"$f":"CONCATENATE(O349,\" - \",P349)","v":"000002410 - YAURI"}]
[null,null,null,null,null,null,null,null,null,null,null,null,null,null,"000002411","CONDOROMA","04","06","08","02","0406","000002411 - CONDOROMA"]
[null,null,null,null,null,null,null,null,null,null,null,null,null,null,"000002412","COPORAQUE","04","06","08","03","0406","000002412 - COPORAQUE"]
[null,null,null,null,null,null,null,null,null,null,null,null,null,null,"000002413","URINSAYA","04","06","08","03","0406","000002413 - URINSAYA"]
[null,null,null,null,null,null,null,null,null,null,null,null,null,null,"000002414","HUAYHUAHUASI","04","06","08","03","0406","000002414 - HUAYHUAHUASI"]
[null,null,null,null,null,null,null,null,null,null,null,null,null,null,"000002415","OCCORURO","04","06","08","04","0406","000002415 - OCCORURO"]
[null,null,null,null,null,null,null,null,null,null,null,null,null,null,"000002416","PALLPATA","04","06","08","05","0406","000002416 - PALLPATA"]
[null,null,null,null,null,null,null,null,null,null,null,null,null,null,"000002417","PICHIGUA ESPINAR","04","06","08","06","0406","000002417 - PICHIGUA ESPINAR"]
[null,null,null,null,null,null,null,null,null,null,null,null,null,null,"000002418","SAN MIGUEL","04","06","08","06","0406","000002418 - SAN MIGUEL"]
[null,null,null,null,null,null,null,null,null,null,null,null,null,null,"000002419","SUYKUTAMBO","04","06","08","07","0406","000002419 - SUYKUTAMBO"]
[null,null,null,null,null,null,null,null,null,null,null,null,null,null,"000002420","ACCOCUNCA","04","06","08","08","0406","000002420 - ACCOCUNCA"]
[null,null,null,null,null,null,null,null,null,null,null,null,null,null,"000006745","TINTAYA MARQUIRI","04","06","08","01","0406","000006745 - TINTAYA MARQUIRI"]
[null,null,null,null,null,null,null,null,null,null,null,null,null,null,"000010061","ESPINAR - ESSALUD","04","06","08","01","0406","000010061 - ESPINAR - ESSALUD"]
[null,null,null,null,null,null,null,null,null,null,null,null,null,null,"000030366","MENTAL COMUNITARIO ESPINAR \"MUSUQ KAWSAY\"","04","06","08","01","0406","000030366 - MENTAL COMUNITARIO ESPINAR \"MUSUQ KAWSAY\""]
[null,null,null,null,null,null,null,null,null,null,null,null,null,null,"999999999","(All)","04","99",null,null,"0499","999999999 - (All)"]
[null,null,null,null,null,null,null,null,null,null,null,null,null,null,"000002469","SAN JUAN DE KIMBIRI-VRAEM","05","00","09","07","0500","000002469 - SAN JUAN DE KIMBIRI-VRAEM"]
[null,null,null,null,null,null,null,null,null,null,null,null,null,null,"000000000","(All)","05","01",null,null,"0501","000000000 - (All)"]
[null,null,null,null,null,null,null,null,null,null,null,null,null,null,"000002470","CHIRUMPIARI","05","01","09","07","0501","000002470 - CHIRUMPIARI"]
[null,null,null,null,null,null,null,null,null,null,null,null,null,null,"000002471","LOBO TAHUANTINSUYO","05","01","09","07","0501","000002471 - LOBO TAHUANTINSUYO"]
[null,null,null,null,null,null,null,null,null,null,null,null,null,null,"000002472","MAPITUNARI","05","01","09","07","0501","000002472 - MAPITUNARI"]
[null,null,null,null,null,null,null,null,null,null,null,null,null,null,"000002473","UNION ROSALES","05","01","09","07","0501","000002473 - UNION ROSALES"]
[null,null,null,null,null,null,null,null,null,null,null,null,null,null,"000002474","SAMANIATO","05","01","09","07","0501","000002474 - SAMANIATO"]
[null,null,null,null,null,null,null,null,null,null,null,null,null,null,"000002475","KIMBIRI ALTO","05","01","09","07","0501","000002475 - KIMBIRI ALTO"]
[null,null,null,null,null,null,null,null,null,null,null,null,null,null,"000002479","VILLA VIRGEN","05","01","09","12","0501","000002479 - VILLA VIRGEN"]
[null,null,null,null,null,null,null,null,null,null,null,null,null,null,"000002488","VILLA KINTIARINA","05","01","09","13","0501","000002488 - VILLA KINTIARINA"]
[null,null,null,null,null,null,null,null,null,null,null,null,null,null,"000008283","PUEBLO LIBRE","05","01","09","13","0501","000008283 - PUEBLO LIBRE"]
[null,null,null,null,null,null,null,null,null,null,null,null,null,null,"000008284","MANITEA ALTA","05","01","09","07","0501","000008284 - MANITEA ALTA"]
[null,null,null,null,null,null,null,null,null,null,null,null,null,null,"000008285","ANGELES","05","01","09","07","0501","000008285 - ANGELES"]
[null,null,null,null,null,null,null,null,null,null,null,null,null,null,"000024957","BTC LA OROYA  N°34 VILLA VIRGEN","05","01","09","12","0501","000024957 - BTC LA OROYA  N°34 VILLA VIRGEN"]
[null,null,null,null,null,null,null,null,null,null,null,null,null,null,"000000000","(All)","05","02",null,null,"0502","000000000 - (All)"]
[null,null,null,null,null,null,null,null,null,null,null,null,null,null,"000002494","PICHARI","05","02","09","10","0502","000002494 - PICHARI"]
[null,null,null,null,null,null,null,null,null,null,null,null,null,null,"000002495","MANTARO","05","02","09","10","0502","000002495 - MANTARO"]
[null,null,null,null,null,null,null,null,null,null,null,null,null,null,"000002496","OMAYA","05","02","09","10","0502","000002496 - OMAYA"]
[null,null,null,null,null,null,null,null,null,null,null,null,null,null,"000002497","OTARI","05","02","09","10","0502","000002497 - OTARI"]
[null,null,null,null,null,null,null,null,null,null,null,null,null,null,"000002498","PUERTO MAYO","05","02","09","10","0502","000002498 - PUERTO MAYO"]
[null,null,null,null,null,null,null,null,null,null,null,null,null,null,"000007113","NATIVIDAD","05","02","09","10","0502","000007113 - NATIVIDAD"]
[null,null,null,null,null,null,null,null,null,null,null,null,null,null,"000007114","QUISTO CENTRAL","05","02","09","10","0502","000007114 - QUISTO CENTRAL"]
[null,null,null,null,null,null,null,null,null,null,null,null,null,null,"000015104","TAMBO DEL ENE","05","02","09","10","0502","000015104 - TAMBO DEL ENE"]
[null,null,null,null,null,null,null,null,null,null,null,null,null,null,"000015169","PITIRINQUINI","05","02","09","10","0502","000015169 - PITIRINQUINI"]
[null,null,null,null,null,null,null,null,null,null,null,null,null,null,"000015170","PICHARI BAJA","05","02","09","10","0502","000015170 - PICHARI BAJA"]
[null,null,null,null,null,null,null,null,null,null,null,null,null,null,"000024638","MILITAR PICHARI","05","02","09","10","0502","000024638 - MILITAR PICHARI"]
[null,null,null,null,null,null,null,null,null,null,null,null,null,null,"000027230","MEDICA POLICIAL PICHARI","05","02","09","10","0502","000027230 - MEDICA POLICIAL PICHARI"]
[null,null,null,null,null,null,null,null,null,null,null,null,null,null,"000027948","ESSALUD PICHARI","05","02","09","10","0502","000027948 - ESSALUD PICHARI"]
[null,null,null,null,null,null,null,null,null,null,null,null,null,null,"000032211","NUEVO PROGRESO","05","02","09","10","0502","000032211 - NUEVO PROGRESO"]
[null,null,null,null,null,null,null,null,null,null,null,null,null,null,"000033988","MENTAL COMUNITARIO PICHARI","05","02","09","10","0502","000033988 - MENTAL COMUNITARIO PICHARI"]
[null,null,null,null,null,null,null,null,null,null,null,null,null,null,"999999999","(All)","05","99",null,null,"0599","999999999 - (All)"]
[null,null,null,null,null,null,null,null,null,null,null,null,null,null,"000002398","SANTO TOMAS","06","00","07","01","0600","000002398 - SANTO TOMAS"]
[null,null,null,null,null,null,null,null,null,null,null,null,null,null,"000033097","SAMUE CHUMBIVILCAS","06","00","07","01","0600","000033097 - SAMUE CHUMBIVILCAS"]
[null,null,null,null,null,null,null,null,null,null,null,null,null,null,"000000000","(All)","06","01",null,null,"0601","000000000 - (All)"]
[null,null,null,null,null,null,null,null,null,null,null,null,null,null,"000002402","CHAMACA","06","01","07","03","0601","000002402 - CHAMACA"]
[null,null,null,null,null,null,null,null,null,null,null,null,null,null,"000002403","AÑAHUICHI","06","01","07","03","0601","000002403 - AÑAHUICHI"]
[null,null,null,null,null,null,null,null,null,null,null,null,null,null,"000002406","LIVITACA","06","01","07","05","0601","000002406 - LIVITACA"]
[null,null,null,null,null,null,null,null,null,null,null,null,null,null,"000016325","CHILLOROYA - LIVITACA","06","01","07","05","0601","000016325 - CHILLOROYA - LIVITACA"]
[null,null,null,null,null,null,null,null,null,null,null,null,null,null,"000016327","AUSANTA","06","01","07","05","0601","000016327 - AUSANTA"]
[null,null,null,null,null,null,null,null,null,null,null,null,null,null,"000016328","UCCHUCCARCCO","06","01","07","03","0601","000016328 - UCCHUCCARCCO"]
[null,null,null,null,null,null,null,null,null,null,null,null,null,null,"000016329","INGATA","06","01","07","03","0601","000016329 - INGATA"]
[null,null,null,null,null,null,null,null,null,null,null,null,null,null,"000016330","CCONCHACCOLLO","06","01","07","03","0601","000016330 - CCONCHACCOLLO"]
[null,null,null,null,null,null,null,null,null,null,null,null,null,null,"000016332","PATAQUEÑA - LIVITACA","06","01","07","05","0601","000016332 - PATAQUEÑA - LIVITACA"]
[null,null,null,null,null,null,null,null,null,null,null,null,null,null,"000016334","KISIO","06","01","07","05","0601","000016334 - KISIO"]
[null,null,null,null,null,null,null,null,null,null,null,null,null,null,"000025739","PISQUICOCHA","06","01","07","05","0601","000025739 - PISQUICOCHA"]
[null,null,null,null,null,null,null,null,null,null,null,null,null,null,"000025740","TOTORA - REYNA DE LOS ANGELES","06","01","07","05","0601","000025740 - TOTORA - REYNA DE LOS ANGELES"]
[null,null,null,null,null,null,null,null,null,null,null,null,null,null,"000000000","(All)","06","09",null,null,"0609","000000000 - (All)"]
[null,null,null,null,null,null,null,null,null,null,null,null,null,null,"000002399","PULPERA","06","09","07","01","0609","000002399 - PULPERA"]
[null,null,null,null,null,null,null,null,null,null,null,null,null,null,"000002400","ALHUACCHULLO","06","09","07","01","0609","000002400 - ALHUACCHULLO"]
[null,null,null,null,null,null,null,null,null,null,null,null,null,null,"000002401","CCAPACMARCA","06","09","07","02","0609","000002401 - CCAPACMARCA"]
[null,null,null,null,null,null,null,null,null,null,null,null,null,null,"000002404","COLQUEMARCA","06","09","07","04","0609","000002404 - COLQUEMARCA"]
[null,null,null,null,null,null,null,null,null,null,null,null,null,null,"000002405","CHARAMURAY","06","09","07","04","0609","000002405 - CHARAMURAY"]
[null,null,null,null,null,null,null,null,null,null,null,null,null,null,"000002407","LLUSCO","06","09","07","06","0609","000002407 - LLUSCO"]
[null,null,null,null,null,null,null,null,null,null,null,null,null,null,"000002408","QUIÑOTA","06","09","07","07","0609","000002408 - QUIÑOTA"]
[null,null,null,null,null,null,null,null,null,null,null,null,null,null,"000002409","VELILLE","06","09","07","08","0609","000002409 - VELILLE"]
[null,null,null,null,null,null,null,null,null,null,null,null,null,null,"000006746","LLIQUE","06","09","07","01","0609","000006746 - LLIQUE"]
[null,null,null,null,null,null,null,null,null,null,null,null,null,null,"000006747","LUTTO","06","09","07","06","0609","000006747 - LUTTO"]
[null,null,null,null,null,null,null,null,null,null,null,null,null,null,"000006748","COLLPA","06","09","07","06","0609","000006748 - COLLPA"]
[null,null,null,null,null,null,null,null,null,null,null,null,null,null,"000006981","CCOYO","06","09","07","01",{"$f":"CONCATENATE(Q422,R422)","v":"0609"},{"$f":"CONCATENATE(O422,\" - \",P422)","v":"000006981 - CCOYO"}]
[null,null,null,null,null,null,null,null,null,null,null,null,null,null,"000006982","MELLOTOTORA","06","09","07","01","0609","000006982 - MELLOTOTORA"]
[null,null,null,null,null,null,null,null,null,null,null,null,null,null,"000006983","ORCCOMA","06","09","07","01","0609","000006983 - ORCCOMA"]
[null,null,null,null,null,null,null,null,null,null,null,null,null,null,"000006984","CCOLLANA","06","09","07","07","0609","000006984 - CCOLLANA"]
[null,null,null,null,null,null,null,null,null,null,null,null,null,null,"000006985","TOTORAPALLCA","06","09","07","06","0609","000006985 - TOTORAPALLCA"]
[null,null,null,null,null,null,null,null,null,null,null,null,null,null,"000007111","YAVINA","06","09","07","01","0609","000007111 - YAVINA"]
[null,null,null,null,null,null,null,null,null,null,null,null,null,null,"000007112","YORENCCA","06","09","07","07","0609","000007112 - YORENCCA"]
[null,null,null,null,null,null,null,null,null,null,null,null,null,null,"000008912","ALCCA VICTORIA","06","09","07","08","0609","000008912 - ALCCA VICTORIA"]
[null,null,null,null,null,null,null,null,null,null,null,null,null,null,"000008913","HUARACO","06","09","07","04","0609","000008913 - HUARACO"]
[null,null,null,null,null,null,null,null,null,null,null,null,null,null,"000008914","HUAYLLANI","06","09","07","04","0609","000008914 - HUAYLLANI"]
[null,null,null,null,null,null,null,null,null,null,null,null,null,null,"000008915","PFULLPURI CONDEPAMPA","06","09","07","01","0609","000008915 - PFULLPURI CONDEPAMPA"]
[null,null,null,null,null,null,null,null,null,null,null,null,null,null,"000009963","CANCAHUANI","06","09","07","02","0609","000009963 - CANCAHUANI"]
[null,null,null,null,null,null,null,null,null,null,null,null,null,null,"000012932","YANQUE","06","09","07","04","0609","000012932 - YANQUE"]
[null,null,null,null,null,null,null,null,null,null,null,null,null,null,"000013185","CAP I SANTO TOMÁS  ESSALUD","06","09","07","01","0609","000013185 - CAP I SANTO TOMÁS  ESSALUD"]
[null,null,null,null,null,null,null,null,null,null,null,null,null,null,"000025369","PUMALLACTA","06","09","07","07","0609","000025369 - PUMALLACTA"]
[null,null,null,null,null,null,null,null,null,null,null,null,null,null,"000025371","TUNTUMA","06","09","07","08","0609","000025371 - TUNTUMA"]
[null,null,null,null,null,null,null,null,null,null,null,null,null,null,"000027008","ANTUYO","06","09","07","06","0609","000027008 - ANTUYO"]
[null,null,null,null,null,null,null,null,null,null,null,null,null,null,"000027009","TAHUAY","06","09","07","02","0609","000027009 - TAHUAY"]
[null,null,null,null,null,null,null,null,null,null,null,null,null,null,"000027011","AYACCASI","06","09","07","08","0609","000027011 - AYACCASI"]
[null,null,null,null,null,null,null,null,null,null,null,null,null,null,"000027016","HUAYCUÑUTA - URCURUTA","06","09","07","08","0609","000027016 - HUAYCUÑUTA - URCURUTA"]
[null,null,null,null,null,null,null,null,null,null,null,null,null,null,"000030940","ARCANGEL SAN MIGUEL DE ESQUINA CONGUNYA","06","09","07","01","0609","000030940 - ARCANGEL SAN MIGUEL DE ESQUINA CONGUNYA"]
[null,null,null,null,null,null,null,null,null,null,null,null,null,null,"999999999","(All)","06","99",null,null,"0699","999999999 - (All)"]
[null,null,null,null,null,null,null,null,null,null,null,null,null,null,"999999999","(All)","99","99",null,null,"9999","999999999 - (All)"]