{"text_format":"1","workbook":"xlsx","n_sheets":5,"sheets":["MENU","TABLAS","Datos","SUPLEMENTACION","TTO. ANEMIA"],"not_rendered":{"charts":0,"images":30,"macros":1,"external_links":0,"defined_names":5,"comments":0,"pivot_tables":4},"unopened":[],"bounds":{"document_bytes":16777216,"sheet_cells":100000,"rows_first":2000,"rows_last":500,"rows_between":2000,"halvings":0,"cell_chars":16384,"cell_head_chars":4096},"cells_cut":0,"cells_raw":0,"read":"whole","date_system":"1900"}

{"sheet":"MENU","index":0,"n_rows":29,"n_cols":12,"rows_kept":29,"cut":false,"hidden":false,"merged":[[28,7,29,10],[26,7,27,10]]}
[]
[]
[]
[null,null,null,null,null,null,null,null,null,null,null,{"$f":"+TABLAS!A81","v":"4-5-3-2-1-T------"}]
[null,null,null,null,null,null,null,null,null,null,null,{"$f":"+TABLAS!A117","v":"4-5-3-2-1-T------"}]
[null,null,null,null,null,null,null,null,null,null,null,{"$f":"+TABLAS!A152","v":"4-5-3-1-2-T------"}]
[null,null,null,null,null,null,null,null,null,null,null,{"$f":"+TABLAS!A190","v":"4-5-3-2-1-T------"}]
[]
[]
[]
[]
[]
[]
[]
[]
[]
[]
[]
[]
[]
[]
[]
[]
[]
[]
[]
[null,null,null,null,null,null,null,"CONTROL DE MESES"]
[]
[null,null,null,null,null,null,null,{"$f":"+TABLAS!A190","v":"4-5-3-2-1-T------"}]

{"sheet":"TABLAS","index":1,"n_rows":192,"n_cols":232,"rows_kept":192,"cut":false,"hidden":true,"merged":[[7,2,7,6],[8,3,8,6],[9,3,9,6],[10,3,10,6],[80,0,80,1],[189,0,189,1],[116,0,116,1],[151,0,151,1],[11,3,11,6],[12,3,12,6],[13,3,13,6]]}
[]
[]
[]
[]
[]
[]
[]
[null,null,"Valores",null,null,null,null,null,"Tabla",{"$f":"IF(I9=\"(Todas)\",\"CUSCO \",\"\")","v":""}]
[null,null,"RED","99 - (All)",null,null,null,null,{"$f":"IF(MID(D9,1,2)=\"99\",\"(All)\",MID(D9,1,2))","v":"(All)"},{"$f":"IF(I9=\"(All)\",\" \",I9)","v":" "},null,null,{"$f":"LEN(MID(D9,5,90))","v":6},null,{"$f":"IF(MID(D9,6,5)=\"(All)\",\"\",D9)","v":""}]
[null,null,"Micro RED","9999 - (All)",null,null,null,null,{"$f":"IF(MID(D10,3,2)=\"99\",\"(All)\",MID(D10,1,4))","v":"(All)"}," ",null,null,{"$f":"LEN(MID(D10,7,90))","v":6},null,{"$f":"IF(MID(D10,8,5)=\"(All)\",\"\",D10)","v":""}]
[null,null,"Establecimiento","999999999 - (All)",null,null,null,null,{"$f":"IF(OR(MID(D11,1,9)=\"999999999\",MID(D11,1,9)=\"000000000\"),\"(All)\",MID(D11,1,9))","v":"(All)"}," ",null,null,{"$f":"LEN(MID(D11,12,90))","v":6},null,{"$f":"IF(MID(D11,13,5)=\"(All)\",\"\",D11)","v":""},null,{"$f":"MID(O11,1,9)","v":""}]
[null,null,"Provincia","00 - (All)",null,null,null,null,{"$f":"IF(MID(D12,1,2)=\"00\",\"(All)\",MID(D12,1,2))","v":"(All)"}," ",null,null,{"$f":"LEN(MID(D12,6,90))","v":5},null,{"$f":"IF(MID(D12,6,5)=\"(All)\",\"\",D12)","v":""}]
[null,null,"Distrito","0000 - (All)",null,null,null,null,{"$f":"IF(OR(MID(D13,1,4)=\"0000\",MID(D13,3,2)=\"00\"),\"(All)\",MID(D13,1,4))","v":"(All)"}," ",null,null,{"$f":"LEN(MID(D13,8,90))","v":5},null,{"$f":"IF(MID(D13,8,5)=\"(All)\",\"\",D13)","v":""}]
[null,null,"Ejecutira","99 - (ALL)",null,null,null,null,{"$f":"IF(MID(D14,1,2)=\"99\",\"(All)\",MID(D14,1,2))","v":"(All)"}," ",null,null,{"$f":"LEN(MID(D14,5,90))","v":6},null,{"$f":"IF(MID(D14,6,5)=\"(All)\",\"\",D14)","v":""}]
[]
[null,null,"Año","2025",null,null,null,null,{"$f":"+D16","v":"2025"},{"$f":"IF(I16=\"(Todas)\",\" \",I16)","v":"2025"}]
[]
[]
[]
[null,1,1,1,1,1,0,0,0,0,0,0,0,{"$f":"SUM(B20:M20)","v":5}]
[null,{"$f":"IF(B20=1,\"ENERO\",\"\")","v":"ENERO"},{"$f":"IF(C20=1,\"FEBRERO\",\"\")","v":"FEBRERO"},{"$f":"IF(D20=1,\"MARZO\",\"\")","v":"MARZO"},{"$f":"IF(E20=1,\"ABRIL\",\"\")","v":"ABRIL"},{"$f":"IF(F20=1,\"MAYO\",\"\")","v":"MAYO"},{"$f":"IF(G20=1,\"JUNIO\",\"\")","v":""},{"$f":"IF(H20=1,\"JULIO\",\"\")","v":""},{"$f":"IF(I20=1,\"AGOSTO\",\"\")","v":""},{"$f":"IF(J20=1,\"SETIEMBRE\",\"\")","v":""},{"$f":"IF(K20=1,\"OCTUBRE\",\"\")","v":""},{"$f":"IF(L20=1,\"NOVIEMBRE\",\"\")","v":""},{"$f":"IF(M20=1,\"DICIEMBRE\",\"\")","v":""},{"$f":"IF(B20=1,B21,IF(C20=1,C21,IF(D20=1,D21,IF(E20=1,E21,IF(F20=1,F21,IF(G20=1,G21,IF(H20=1,H21,IF(I20=1,I21,IF(J20=1,J21,IF(K20=1,K21,IF(L20=1,L21,IF(M20=1,M21,\"\"))))))))))))","v":"ENERO"}]
[null,null,null,null,null,null,null,null,null,null,null,null,null,{"$f":"IF(N20=1,N21,\"\")","v":""}]
[null,2,4,6,8,10,null,null,null,null,null,null,null,{"$f":"MIN(B23:M23)","v":2},{"$f":"MAX(B23:M23)","v":10},{"$f":"MAX(C23:N23)","v":10}]
[null,{"$f":"IF(B23=2,\"ENE\",\"\")","v":"ENE"},{"$f":"IF(C23=4,\"FEB\",\"\")","v":"FEB"},{"$f":"IF(D23=6,\"MAR\",\"\")","v":"MAR"},{"$f":"IF(E23=8,\"ABR\",\"\")","v":"ABR"},{"$f":"IF(F23=10,\"MAY\",\"\")","v":"MAY"},{"$f":"IF(G23=12,\"JUN\",\"\")","v":""},{"$f":"IF(H23=14,\"JUL\",\"\")","v":""},{"$f":"IF(I23=16,\"AGO\",\"\")","v":""},{"$f":"IF(J23=18,\"SET\",\"\")","v":""},{"$f":"IF(K23=20,\"OCT\",\"\")","v":""},{"$f":"IF(L23=22,\"NOV\",\"\")","v":""},{"$f":"IF(M23=24,\"DIC\",\"\")","v":""},{"$f":"IF(N23=B23,B24,IF(N23=C23,C24,IF(N23=D23,D24,IF(N23=E23,E24,IF(N23=F23,F24,IF(N23=G23,G24,IF(N23=H23,#REF!,IF(N23=I23,I24,IF(N23=J23,J24,IF(N23=K23,K24,IF(N23=L23,L24,IF(N23=M23,M24,\"\"))))))))))))","v":"ENE"},{"$f":"IF(O23=C23,C24,IF(O23=D23,D24,IF(O23=E23,E24,IF(O23=F23,F24,IF(O23=G23,G24,IF(O23=H23,H24,IF(O23=I23,I24,IF(O23=J23,J24,IF(O23=K23,K24,IF(O23=L23,L24,IF(O23=M23,M24,\"\")))))))))))","v":"MAY"},{"$f":"IF(P23=D23,D24,IF(P23=E23,E24,IF(P23=F23,F24,IF(P23=G23,G24,IF(P23=H23,H24,IF(P23=I23,I24,IF(P23=J23,J24,IF(P23=K23,K24,IF(P23=L23,L24,IF(P23=M23,M24,IF(P23=N23,N24,\"\")))))))))))","v":"MAY"}]
[null,null,null,null,null,null,null,null,null,null,null,null,null,{"$f":"CONCATENATE(N24,\" - \",O24)","v":"ENE - MAY"}]
[null,null,null,null,null,null,null,null,null,null,null,null,null,{"$f":"IF(N23=O23,N22,N25)","v":"ENE - MAY"}]
[]
[]
[]
[]
[]
[]
[]
[]
[]
[]
[]
[]
[]
[]
[]
[]
[]
[]
[]
[]
[]
[]
[]
["ESANS_01"]
["anno",2025]
["cod_red","(Todas)"]
["codmic","(Todas)"]
["cod_prov","(Todas)"]
["coddist","(Todas)"]
["cod_estab","(Todas)"]
["cod_eje","(Todas)"]
[]
[null,"Valores"]
["Etiquetas de fila"," BAS001"," BAS002"," BAS003"," BAS004"," BAS005"," BAS006"," BAS007"," BAS008"," BAS009"," BAS010"," BAS011"," BAS012"," BAS013"," BAS014"," BAS015"," BAS016"," BAS017"," BAS018"," BAS019"," BAS020"," BAS021"," BAS022"," BAS023"," BAS024"," BAS025"," BAS026"," BAS027"," BAS028"," BAS029"," BAS030"," BAS031"," BAS032"," BAS033"," BAS034"," BAS035"," BAS036"," BAS037"," BAS038"," BAS039"," BAS040"," BAS041"," BAS042"," BAS043"," BAS044"," BAS045"," BAS046"," BAS047"," BAS048"," BAS049"," BAS050"," BAS051"," BAS052"," BAS053"," BAS054"," BAS055"," BAS056"," BAS057"," BAS058"," BAS059"," BAS060"," BAS061"," BAS062"," BAS063"," BAS064"," BAS065"," BAS066"," BAS067"," BAS068"," BAS069"," BAS070"," BAS071"," BAS072"," BAS073"," BAS074"," BAS075"," BAS076"," BAS077"," BAS078"," BAS079"," BAS080"," BAS081"," BAS082"," BAS083"," BAS084"," BAS085"," BAS086"," BAS087"," BAS088"," BAS089"," BAS090"," BAS091"," BAS092"," BAS093"," BAS094"," BAS095"," BAS096"," BAS097"," BAS098"," BAS099"," BAS100"," BAS101"," BAS102"," BAS103"," BAS104"," BAS105"," BAS106"," BAS107"," BAS108"," BAS109"," BAS110"," BAS111"," BAS112"," BAS113"," BAS114"," BAS115"," BAS116"," BAS117"," BAS118"," BAS119"," BAS120"," BAS121"," BAS122"," BAS123"," BAS124"," BAS125"," BAS126"," BAS127"," BAS128"," BAS129"," BAS130"," BAS131"," BAS132"," BAS133"," BAS134"," BAS135"," BAS136"," BAS137"," BAS138"," BAS139"," BAS140"," BAS141"," BAS142"," BAS143"," BAS144"," BAS145"," BAS146"," BAS147"," BAS148"," BAS149"," BAS150"," BAS151"," BAS152"," BAS153"," BAS154"," BAS155"," BAS156"," BAS157"," BAS158"," BAS159"," BAS160"," BAS161"," BAS162"," BAS163"," BAS164"," BAS165"," BAS166"," BAS167"," BAS168"," BAS169"," BAS170"," BAS171"," BAS172"," BAS173"," BAS174"," BAS175"," BAS176"," BAS177"," BAS178"," BAS179"," BAS180"," BAS181"," BAS182"," BAS183"," BAS184"," BAS185"," BAS186"," BAS187"," BAS188"," BAS189"," BAS190"," BAS191"," BAS192"," BAS193"," BAS194"," BAS195"," BAS196"," BAS197"," BAS198"," BAS199"," BAS200"," BAS201"," BAS202"," BAS203"," BAS204"," BAS205"," BAS206"," BAS207"," BAS208"," BAS209"," BAS210"," BAS211"," BAS212"," BAS213"," BAS214"," BAS215"," BAS216"," BAS217"," BAS218"," BAS219"," BAS220"," BAS221"," BAS222"," BAS223"," BAS224"," BAS225"," BAS226"," BAS227"," BAS228"," BAS229"," BAS230"]
[4,2,4,2,11,0,122,0,0,2,0,0,0,0,1,1,1,1,0,0,0,9,5,1,4,2,2,1,6,5,2,0,0,0,1,2,4,2,0,0,0,1,144,114,127,19,12,19,126,147,137,157,130,100,88,168,138,122,115,103,80,46,66,151,101,88,10,12,7,104,154,108,66,13,7,5,64,193,58,21,7,2,0,8,20,2,0,0,0,1,0,20,12,0,0,0,1,0,79,57,1,0,0,0,0,3,0,0,0,0,0,78,42,64,40,47,42,54,39,69,25,0,0,0,0,0,0,0,0,60,51,35,134,115,138,120,106,101,138,92,80,138,97,60,178,40,21,9,1,0,42,3,1,0,0,0,0,0,0,0,0,0,0,0,0,0,0,0,0,0,0,0,0,0,0,0,0,0,0,0,0,0,0,0,0,0,0,0,0,0,0,0,0,0,0,0,0,0,0,0,0,0,0,0,0,0,0,0,0,0,0,0,0,0,0,0,0,0,0,0,0,0,0,0,0,0,0,0,0,0,0]
[5,3,3,1,5,0,126,2,1,0,0,0,0,0,0,0,1,0,1,0,0,4,7,6,1,6,1,1,5,5,1,1,0,0,0,2,1,0,0,0,0,2,132,131,106,28,13,7,126,118,118,136,135,120,82,166,112,96,84,113,76,63,59,109,115,91,19,7,9,74,114,102,86,8,10,7,59,157,64,42,2,6,3,12,4,1,0,0,1,0,0,1,3,0,0,0,0,0,115,39,2,0,0,0,0,5,0,0,0,0,0,82,46,45,45,34,29,44,24,43,34,6,0,0,0,0,0,0,0,51,61,40,102,105,120,100,84,78,98,99,81,106,95,81,143,52,34,0,1,0,7,0,2,0,0,0,0,0,0,0,0,0,0,0,0,0,0,0,0,0,0,0,0,0,0,0,0,0,0,0,0,0,0,0,0,0,0,0,0,0,0,0,0,0,0,0,0,0,0,0,0,0,0,0,0,0,0,0,0,0,0,0,0,0,0,0,0,0,0,0,0,0,0,0,0,0,0,0,0,0,0]
[3,9,1,1,7,0,129,0,2,0,1,0,0,0,2,1,0,0,0,0,1,13,4,8,3,5,3,0,3,6,2,1,0,0,1,7,1,0,0,0,0,0,149,130,119,24,27,15,131,148,167,145,114,96,54,149,139,119,125,89,50,42,77,135,114,95,17,15,7,75,146,91,61,13,7,9,39,261,46,25,2,1,2,1,16,0,0,0,0,0,0,7,1,0,0,0,0,7,124,31,2,0,0,0,0,1,0,0,0,0,0,89,28,44,54,55,56,41,28,56,37,0,1,0,0,0,0,0,0,61,42,39,106,137,123,116,87,96,114,84,83,126,71,48,240,38,14,11,0,0,32,1,1,0,0,0,0,0,0,0,0,0,0,0,0,0,0,0,0,0,0,0,0,0,0,0,0,0,0,0,0,0,0,0,0,0,0,0,0,0,0,0,0,0,0,0,0,0,0,0,0,0,0,0,0,0,0,0,0,0,0,0,0,0,0,0,0,0,0,0,0,0,0,0,0,0,0,0,0,0,0]
[2,2,6,0,13,0,93,2,0,2,1,0,0,0,5,0,2,1,0,1,0,4,3,1,2,1,0,0,8,1,0,0,0,0,0,3,1,0,0,0,0,2,118,120,115,30,19,14,97,185,162,108,94,38,41,137,131,128,80,60,48,53,70,129,127,74,15,7,9,67,111,86,56,7,8,7,26,121,42,7,2,3,0,4,1,1,0,0,0,0,1,27,1,0,0,0,0,13,77,58,0,0,0,0,0,1,0,0,0,0,0,67,36,54,39,58,36,59,31,44,23,3,0,0,0,0,0,0,0,64,35,35,138,130,81,102,98,64,99,99,61,90,70,38,94,20,4,0,1,0,5,1,1,0,0,0,0,0,0,0,0,0,0,0,0,0,0,0,0,0,0,0,0,0,0,0,0,0,0,0,0,0,0,0,0,0,0,0,0,0,0,0,0,0,0,0,0,0,0,0,0,0,0,0,0,0,0,0,0,0,0,0,0,0,0,0,0,0,0,0,0,0,0,0,0,0,0,0,0,0,0]
[1,3,3,1,8,0,107,0,1,0,0,0,0,0,0,1,0,0,0,0,0,0,1,0,0,1,0,0,0,1,0,0,0,0,0,0,0,0,0,0,0,3,117,128,110,30,19,12,108,178,114,90,65,45,42,143,151,92,71,69,49,55,69,126,98,58,17,7,8,64,143,73,23,5,8,6,29,111,9,4,0,1,1,1,2,0,0,0,0,0,0,12,0,0,0,0,0,7,115,25,0,0,0,0,0,2,0,0,0,0,0,82,37,64,49,57,49,64,40,72,33,4,1,0,0,0,0,0,0,77,45,48,99,78,49,96,65,44,64,49,33,93,37,9,81,4,1,0,0,0,3,0,0,0,0,0,0,0,0,0,0,0,0,0,0,0,0,0,0,0,0,0,0,0,0,0,0,0,0,0,0,0,0,0,0,0,0,0,0,0,0,0,0,0,0,0,0,0,0,0,0,0,0,0,0,0,0,0,0,0,0,0,0,0,0,0,0,0,0,0,0,0,0,0,0,0,0,0,0,0,0]
["T",19,17,5,44,0,577,4,4,4,2,0,0,0,8,3,4,2,1,1,1,30,20,16,10,15,6,2,22,18,5,2,0,0,2,14,7,2,0,0,0,8,660,623,577,131,90,67,588,776,698,636,538,399,307,763,671,557,475,434,303,259,341,650,555,406,78,48,40,384,668,460,292,46,40,34,217,843,219,99,13,13,6,26,43,4,0,0,1,1,1,67,17,0,0,0,1,27,510,210,5,0,0,0,0,12,0,0,0,0,0,398,189,271,227,251,212,262,162,284,152,13,2,0,0,0,0,0,0,313,234,197,579,565,511,534,440,383,513,423,338,553,370,236,736,154,74,20,3,0,89,5,5,0,0,0,0,0,0,0,0,0,0,0,0,0,0,0,0,0,0,0,0,0,0,0,0,0,0,0,0,0,0,0,0,0,0,0,0,0,0,0,0,0,0,0,0,0,0,0,0,0,0,0,0,0,0,0,0,0,0,0,0,0,0,0,0,0,0,0,0,0,0,0,0,0,0,0,0,0,0]
[]
[]
[]
[]
[]
[]
[]
[]
[]
[]
[]
[]
["TOTAL"]
[{"$f":"COUNT(A61:A77)","v":5},{"$f":"SUM(B61:B77)","v":38},{"$f":"SUM(C61:C77)","v":34},10,88,0,1154,8,8,8,4,0,0,0,16,6,8,4,2,2,2,60,40,32,20,30,12,4,44,36,10,4,0,0,4,28,14,4,0,0,0,16,1320,1246,1154,262,180,134,1176,1552,1396,1272,1076,798,614,1526,1342,1114,950,868,606,518,682,1300,1110,812,{"$f":"SUM(BO61:BO77)","v":156},96,80,768,1336,920,584,92,80,68,434,1686,438,198,26,26,12,52,86,8,0,0,2,2,2,134,34,0,0,0,2,54,1020,420,10,0,0,0,0,24,0,0,0,0,0,796,378,542,454,502,424,524,324,568,304,26,4,0,0,0,0,0,0,626,{"$f":"SUM(EA61:EA77)","v":468},394,1158,1130,1022,1068,880,766,1026,846,676,1106,740,472,1472,308,148,40,6,0,178,10,10,0,0,0,0,0,0,0,0,0,0,0,0,0,0,0,0,0,0,0,0,0,0,0,0,0,0,0,0,0,0,0,0,0,0,0,0,0,0,0,0,0,{"$f":"SUM(GM61:GM77)","v":0},0,0,0,0,0,0,0,0,0,0,0,0,0,0,0,0,0,0,0,0,0,0,0,0,0,0,0,0,0,0,0,0,0,0,0,0,0]
[{"$f":"CONCATENATE(A61,\"-\",A62,\"-\",A63,\"-\",A64,\"-\",A65,\"-\",A66,\"-\",A67,\"-\",A68,\"-\",A69,\"-\",A70,\"-\",A71,\"-\",A72)","v":"4-5-3-2-1-T------"}]
[null," BAS001"," BAS002"," BAS003"," BAS004"," BAS005"," BAS006"," BAS007"," BAS008"," BAS009"," BAS010"," BAS011"," BAS012"," BAS013"," BAS014"," BAS015"," BAS016"," BAS017"," BAS018"," BAS019"," BAS020"," BAS021"," BAS022"," BAS023"," BAS024"," BAS025"," BAS026"," BAS027"," BAS028"," BAS029"," BAS030"," BAS031"," BAS032"," BAS033"," BAS034"," BAS035"," BAS036"," BAS037"," BAS038"," BAS039"," BAS040"," BAS041"," BAS042"," BAS043"," BAS044"," BAS045"," BAS046"," BAS047"," BAS048"," BAS049"," BAS050"," BAS051"," BAS052"," BAS053"," BAS054"," BAS055"," BAS056"," BAS057"," BAS058"," BAS059"," BAS060"," BAS061"," BAS062"," BAS063"," BAS064"," BAS065"," BAS066"," BAS067"," BAS068"," BAS069"," BAS070"," BAS071"," BAS072"," BAS073"," BAS074"," BAS075"," BAS076"," BAS077"," BAS078"," BAS079"," BAS080"," BAS081"," BAS082"," BAS083"," BAS084"," BAS085"," BAS086"," BAS087"," BAS088"," BAS089"," BAS090"," BAS091"," BAS092"," BAS093"," BAS094"," BAS095"," BAS096"," BAS097"," BAS098"," BAS099"," BAS100"," BAS101"," BAS102"," BAS103"," BAS104"," BAS105"," BAS106"," BAS107"," BAS108"," BAS109"," BAS110"," BAS111"," BAS112"," BAS113"," BAS114"," BAS115"," BAS116"," BAS117"," BAS118"," BAS119"," BAS120"," BAS121"," BAS122"," BAS123"," BAS124"," BAS125"," BAS126"," BAS127"," BAS128"," BAS129"," BAS130"," BAS131"," BAS132"," BAS133"," BAS134"," BAS135"," BAS136"," BAS137"," BAS138"," BAS139"," BAS140"," BAS141"," BAS142"," BAS143"," BAS144"," BAS145"," BAS146"," BAS147"," BAS148"," BAS149"," BAS150"," BAS151"," BAS152"," BAS153"," BAS154"," BAS155"," BAS156"," BAS157"," BAS158"," BAS159"," BAS160"," BAS161"," BAS162"," BAS163"," BAS164"," BAS165"," BAS166"," BAS167"," BAS168"," BAS169"," BAS170"," BAS171"," BAS172"," BAS173"," BAS174"," BAS175"," BAS176"," BAS177"," BAS178"," BAS179"," BAS180"," BAS181"," BAS182"," BAS183"," BAS184"," BAS185"," BAS186"," BAS187"," BAS188"," BAS189"," BAS190"," BAS191"," BAS192"," BAS193"," BAS194"," BAS195"," BAS196"," BAS197"," BAS198"," BAS199"," BAS200"," BAS201"," BAS202"," BAS203"," BAS204"," BAS205"," BAS206"," BAS207"," BAS208"," BAS209"," BAS210"," BAS211"," BAS212"," BAS213"," BAS214"," BAS215"," BAS216"," BAS217"," BAS218"," BAS219"," BAS220"," BAS221"," BAS222"," BAS223"," BAS224"," BAS225"," BAS226"," BAS227"," BAS228"," BAS229"," BAS230"]
[null,{"$f":"IF(B82=B60,\"SI\",\"NO\")","v":"SI"},{"$f":"IF(C82=C60,\"SI\",\"NO\")","v":"SI"},"SI","SI","SI","SI","SI","SI","SI","SI","SI","SI","SI","SI","SI","SI","SI","SI","SI","SI","SI","SI","SI","SI","SI","SI","SI","SI","SI","SI","SI","SI","SI","SI","SI","SI","SI","SI","SI","SI","SI","SI","SI","SI","SI","SI","SI","SI","SI","SI","SI","SI","SI","SI","SI","SI","SI","SI","SI","SI","SI","SI","SI","SI","SI",{"$f":"IF(BO82=BO60,\"SI\",\"NO\")","v":"SI"},"SI","SI","SI","SI","SI","SI","SI","SI","SI","SI","SI","SI","SI","SI","SI","SI","SI","SI","SI","SI","SI","SI","SI","SI","SI","SI","SI","SI","SI","SI","SI","SI","SI","SI","SI","SI","SI","SI","SI","SI","SI","SI","SI","SI","SI","SI","SI","SI","SI","SI","SI","SI","SI","SI","SI","SI","SI","SI","SI","SI","SI","SI","SI",{"$f":"IF(EA82=EA60,\"SI\",\"NO\")","v":"SI"},"SI","SI","SI","SI","SI","SI","SI","SI","SI","SI","SI","SI","SI","SI","SI","SI","SI","SI","SI","SI","SI","SI","SI","SI","SI","SI","SI","SI","SI","SI","SI","SI","SI","SI","SI","SI","SI","SI","SI","SI","SI","SI","SI","SI","SI","SI","SI","SI","SI","SI","SI","SI","SI","SI","SI","SI","SI","SI","SI","SI","SI","SI","SI",{"$f":"IF(GM82=GM60,\"SI\",\"NO\")","v":"SI"},"SI","SI","SI","SI","SI","SI","SI","SI","SI","SI","SI","SI","SI","SI","SI","SI","SI","SI","SI","SI","SI","SI","SI","SI","SI","SI","SI","SI","SI","SI","SI","SI","SI","SI","SI","SI",{"$f":"IF(HW82=HX60,\"SI\",\"NO\")","v":"NO"}]
[]
[]
["ESANS_02"]
["anno",2025]
["cod_red","(Todas)"]
["codmic","(Todas)"]
["cod_prov","(Todas)"]
["coddist","(Todas)"]
["cod_estab","(Todas)"]
["cod_eje","(Todas)"]
[]
[null,"Valores"]
["Etiquetas de fila"," BAS001"," BAS002"," BAS003"," BAS004"," BAS005"," BAS006"," BAS007"," BAS008"," BAS009"," BAS010"," BAS011"," BAS012"," BAS013"," BAS014"," BAS015"," BAS016"," BAS017"," BAS018"," BAS019"," BAS020"," BAS021"," BAS022"," BAS023"," BAS024"," BAS025"," BAS026"," BAS027"," BAS028"," BAS029"," BAS030"," BAS031"," BAS032"," BAS033"," BAS034"," BAS035"," BAS036"," BAS037"," BAS038"," BAS039"," BAS040"," BAS041"," BAS042"," BAS043"," BAS044"," BAS045"," BAS046"," BAS047"," BAS048"," BAS049"," BAS050"," BAS051"," BAS052"," BAS053"," BAS054"," BAS055"," BAS056"," BAS057"," BAS058"," BAS059"," BAS060"," BAS061"," BAS062"," BAS063"," BAS064"," BAS065"," BAS066"," BAS067"," BAS068"," BAS069"," BAS070"," BAS071"," BAS072"," BAS073"," BAS074"," BAS075"," BAS076"," BAS077"," BAS078"," BAS079"," BAS080"," BAS081"," BAS082"," BAS083"," BAS084"," BAS085"," BAS086"," BAS087"," BAS088"," BAS089"," BAS090"," BAS091"," BAS092"," BAS093"," BAS094"," BAS095"," BAS096"," BAS097"," BAS098"," BAS099"," BAS100"," BAS101"," BAS102"," BAS103"," BAS104"," BAS105"," BAS106"," BAS107"," BAS108"," BAS109"," BAS110"," BAS111"," BAS112"," BAS113"," BAS114"," BAS115"," BAS116"," BAS117"," BAS118"," BAS119"," BAS120"," BAS121"," BAS122"," BAS123"," BAS124"," BAS125"," BAS126"," BAS127"," BAS128"," BAS129"," BAS130"," BAS131"," BAS132"," BAS133"," BAS134"," BAS135"," BAS136"," BAS137"," BAS138"," BAS139"," BAS140"," BAS141"," BAS142"," BAS143"," BAS144"," BAS145"," BAS146"," BAS147"," BAS148"," BAS149"," BAS150"," BAS151"," BAS152"," BAS153"," BAS154"," BAS155"," BAS156"," BAS157"," BAS158"," BAS159"," BAS160"," BAS161"," BAS162"," BAS163"," BAS164"," BAS165"," BAS166"," BAS167"," BAS168"," BAS169"," BAS170"," BAS171"," BAS172"," BAS173"," BAS174"," BAS175"," BAS176"," BAS177"," BAS178"," BAS179"," BAS180"," BAS181"," BAS182"," BAS183"," BAS184"," BAS185"," BAS186"," BAS187"," BAS188"," BAS189"," BAS190"," BAS191"," BAS192"," BAS193"," BAS194"," BAS195"," BAS196"," BAS197"," BAS198"," BAS199"," BAS200"," BAS201"," BAS202"," BAS203"," BAS204"," BAS205"," BAS206"," BAS207"," BAS208"," BAS209"," BAS210"," BAS211"," BAS212"," BAS213"," BAS214"," BAS215"," BAS216"," BAS217"," BAS218"," BAS219"," BAS220"," BAS221"," BAS222"," BAS223"," BAS224"," BAS225"," BAS226"," BAS227"," BAS228"," BAS229"," BAS230"]
[4,4,3,0,156,102,113,145,148,79,167,104,0,134,71,0,410,0,0,829,0,0,48,0,0,111,116,68,99,0,0,3,0,0,2,0,0,8,0,0,12,0,0,12,0,0,6,0,0,10,0,0,7,0,0,5,0,0,7,0,0,0,0,0,0,1,49,31,50,27,9,28,41,14,11,0,0,0,0,0,0,0,0,0,0,0,0,0,0,0,0,0,0,0,0,0,0,0,0,0,0,0,0,0,0,0,0,0,0,0,0,0,0,0,0,0,0,0,0,0,0,0,0,0,0,0,0,0,0,0,0,0,0,0,0,0,0,0,0,0,0,0,0,0,0,0,0,0,0,0,0,0,0,0,0,0,0,0,0,0,0,0,0,0,0,0,0,0,0,0,0,0,0,0,0,0,0,0,0,0,0,0,0,0,0,0,0,0,0,0,0,0,0,0,0,0,0,0,0,0,0,0,0,0,0,0,0,0,0,0,0,0,0,0,0,0,0,0,0,0,0,0,0,0,0,0,0,0,0,0,0]
[5,6,2,0,148,104,118,114,147,83,157,88,0,93,64,0,232,0,0,547,6,0,9,0,0,163,103,86,100,0,0,6,0,0,2,0,0,8,0,0,18,0,0,11,0,0,9,0,0,4,0,0,7,0,0,5,0,0,10,0,0,0,0,0,0,2,64,39,34,33,6,13,29,12,9,0,0,0,0,0,0,0,0,0,0,0,0,0,0,0,0,0,0,0,0,0,0,0,0,0,0,0,0,0,0,0,0,0,0,0,0,0,0,0,0,0,0,0,0,0,0,0,0,0,0,0,0,0,0,0,0,0,0,0,0,0,0,0,0,0,0,0,0,0,0,0,0,0,0,0,0,0,0,0,0,0,0,0,0,0,0,0,0,0,0,0,0,0,0,0,0,0,0,0,0,0,0,0,0,0,0,0,0,0,0,0,0,0,0,0,0,0,0,0,0,0,0,0,0,0,0,0,0,0,0,0,0,0,0,0,0,0,0,0,0,0,0,0,0,0,0,0,0,0,0,0,0,0,0,0,0]
[3,13,4,0,120,119,90,110,136,72,166,108,0,93,61,0,302,0,0,202,1,0,23,0,0,159,96,59,103,0,0,8,0,0,4,0,0,5,0,0,10,0,0,12,0,0,12,0,0,6,0,0,1,0,0,2,0,0,2,0,0,0,0,0,1,1,76,42,43,30,11,22,16,12,11,0,0,0,0,0,0,0,0,0,0,0,0,0,0,0,0,0,0,0,0,0,0,0,0,0,0,0,0,0,0,0,0,0,0,0,0,0,0,0,0,0,0,0,0,0,0,0,0,0,0,0,0,0,0,0,0,0,0,0,0,0,0,0,0,0,0,0,0,0,0,0,0,0,0,0,0,0,0,0,0,0,0,0,0,0,0,0,0,0,0,0,0,0,0,0,0,0,0,0,0,0,0,0,0,0,0,0,0,0,0,0,0,0,0,0,0,0,0,0,0,0,0,0,0,0,0,0,0,0,0,0,0,0,0,0,0,0,0,0,0,0,0,0,0,0,0,0,0,0,0,0,0,0,0,0,0]
[2,2,9,0,86,90,71,104,121,39,129,80,0,82,45,0,145,0,0,137,0,0,38,0,0,117,80,57,72,0,0,4,0,0,3,0,0,3,0,0,12,0,0,14,0,0,10,0,0,12,0,0,3,0,0,8,0,0,9,0,0,0,0,0,0,1,59,41,36,31,8,23,22,10,16,0,0,0,0,0,0,0,0,0,0,0,0,0,0,0,0,0,0,0,0,0,0,0,0,0,0,0,0,0,0,0,0,0,0,0,0,0,0,0,0,0,0,0,0,0,0,0,0,0,0,0,0,0,0,0,0,0,0,0,0,0,0,0,0,0,0,0,0,0,0,0,0,0,0,0,0,0,0,0,0,0,0,0,0,0,0,0,0,0,0,0,0,0,0,0,0,0,0,0,0,0,0,0,0,0,0,0,0,0,0,0,0,0,0,0,0,0,0,0,0,0,0,0,0,0,0,0,0,0,0,0,0,0,0,0,0,0,0,0,0,0,0,0,0,0,0,0,0,0,0,0,0,0,0,0,0]
[1,5,3,0,79,78,76,85,96,22,135,64,0,86,36,0,130,0,0,109,0,0,16,0,0,143,74,74,92,0,0,6,0,0,1,0,0,14,0,0,15,0,0,10,0,0,6,0,0,4,0,0,2,0,0,0,0,0,5,0,0,0,0,0,3,2,80,37,42,27,6,27,26,13,8,0,0,0,0,0,0,0,0,0,0,0,0,0,0,0,0,0,0,0,0,0,0,0,0,0,0,0,0,0,0,0,0,0,0,0,0,0,0,0,0,0,0,0,0,0,0,0,0,0,0,0,0,0,0,0,0,0,0,0,0,0,0,0,0,0,0,0,0,0,0,0,0,0,0,0,0,0,0,0,0,0,0,0,0,0,0,0,0,0,0,0,0,0,0,0,0,0,0,0,0,0,0,0,0,0,0,0,0,0,0,0,0,0,0,0,0,0,0,0,0,0,0,0,0,0,0,0,0,0,0,0,0,0,0,0,0,0,0,0,0,0,0,0,0,0,0,0,0,0,0,0,0,0,0,0,0]
["T",30,21,0,589,493,468,558,648,295,754,444,0,488,277,0,1219,0,0,1824,7,0,134,0,0,693,469,344,466,0,0,27,0,0,12,0,0,38,0,0,67,0,0,59,0,0,43,0,0,36,0,0,20,0,0,20,0,0,33,0,0,0,0,0,4,7,328,190,205,148,40,113,134,61,55,0,0,0,0,0,0,0,0,0,0,0,0,0,0,0,0,0,0,0,0,0,0,0,0,0,0,0,0,0,0,0,0,0,0,0,0,0,0,0,0,0,0,0,0,0,0,0,0,0,0,0,0,0,0,0,0,0,0,0,0,0,0,0,0,0,0,0,0,0,0,0,0,0,0,0,0,0,0,0,0,0,0,0,0,0,0,0,0,0,0,0,0,0,0,0,0,0,0,0,0,0,0,0,0,0,0,0,0,0,0,0,0,0,0,0,0,0,0,0,0,0,0,0,0,0,0,0,0,0,0,0,0,0,0,0,0,0,0,0,0,0,0,0,0,0,0,0,0,0,0,0,0,0,0,0,0]
[]
[]
[]
[]
[]
[]
[]
[]
[]
[]
[]
[]
["TOTAL"]
[{"$f":"COUNT(A97:A113)","v":5},{"$f":"SUM(B97:B113)","v":60},{"$f":"SUM(C97:C113)","v":42},0,1178,986,936,1116,1296,590,1508,888,0,976,554,0,2438,0,0,3648,14,0,268,0,0,1386,938,688,932,0,0,54,0,0,24,0,0,76,0,0,134,0,0,118,0,0,86,0,0,72,0,0,40,0,0,40,0,0,66,0,0,0,0,0,8,14,{"$f":"SUM(BO97:BO113)","v":656},380,410,296,80,226,268,122,110,0,0,0,0,0,0,0,0,0,0,0,0,0,0,0,0,0,0,0,0,0,0,0,0,0,0,0,0,0,0,0,0,0,0,0,0,0,0,0,0,0,0,0,0,0,0,0,0,0,0,0,0,0,0,0,{"$f":"SUM(EA97:EA113)","v":0},0,0,0,0,0,0,0,0,0,0,0,0,0,0,0,0,0,0,0,0,0,0,0,0,0,0,0,0,0,0,0,0,0,0,0,0,0,0,0,0,0,0,0,0,0,0,0,0,0,0,0,0,0,0,0,0,0,0,0,0,0,0,0,{"$f":"SUM(GM97:GM113)","v":0},0,0,0,0,0,0,0,0,0,0,0,0,0,0,0,0,0,0,0,0,0,0,0,0,0,0,0,0,0,0,0,0,0,0,0,0]
[{"$f":"CONCATENATE(A97,\"-\",A98,\"-\",A99,\"-\",A100,\"-\",A101,\"-\",A102,\"-\",A103,\"-\",A104,\"-\",A105,\"-\",A106,\"-\",A107,\"-\",A108)","v":"4-5-3-2-1-T------"}]
[null," BAS001"," BAS002"," BAS003"," BAS004"," BAS005"," BAS006"," BAS007"," BAS008"," BAS009"," BAS010"," BAS011"," BAS012"," BAS013"," BAS014"," BAS015"," BAS016"," BAS017"," BAS018"," BAS019"," BAS020"," BAS021"," BAS022"," BAS023"," BAS024"," BAS025"," BAS026"," BAS027"," BAS028"," BAS029"," BAS030"," BAS031"," BAS032"," BAS033"," BAS034"," BAS035"," BAS036"," BAS037"," BAS038"," BAS039"," BAS040"," BAS041"," BAS042"," BAS043"," BAS044"," BAS045"," BAS046"," BAS047"," BAS048"," BAS049"," BAS050"," BAS051"," BAS052"," BAS053"," BAS054"," BAS055"," BAS056"," BAS057"," BAS058"," BAS059"," BAS060"," BAS061"," BAS062"," BAS063"," BAS064"," BAS065"," BAS066"," BAS067"," BAS068"," BAS069"," BAS070"," BAS071"," BAS072"," BAS073"," BAS074"," BAS075"," BAS076"," BAS077"," BAS078"," BAS079"," BAS080"," BAS081"," BAS082"," BAS083"," BAS084"," BAS085"," BAS086"," BAS087"," BAS088"," BAS089"," BAS090"," BAS091"," BAS092"," BAS093"," BAS094"," BAS095"," BAS096"," BAS097"," BAS098"," BAS099"," BAS100"," BAS101"," BAS102"," BAS103"," BAS104"," BAS105"," BAS106"," BAS107"," BAS108"," BAS109"," BAS110"," BAS111"," BAS112"," BAS113"," BAS114"," BAS115"," BAS116"," BAS117"," BAS118"," BAS119"," BAS120"," BAS121"," BAS122"," BAS123"," BAS124"," BAS125"," BAS126"," BAS127"," BAS128"," BAS129"," BAS130"," BAS131"," BAS132"," BAS133"," BAS134"," BAS135"," BAS136"," BAS137"," BAS138"," BAS139"," BAS140"," BAS141"," BAS142"," BAS143"," BAS144"," BAS145"," BAS146"," BAS147"," BAS148"," BAS149"," BAS150"," BAS151"," BAS152"," BAS153"," BAS154"," BAS155"," BAS156"," BAS157"," BAS158"," BAS159"," BAS160"," BAS161"," BAS162"," BAS163"," BAS164"," BAS165"," BAS166"," BAS167"," BAS168"," BAS169"," BAS170"," BAS171"," BAS172"," BAS173"," BAS174"," BAS175"," BAS176"," BAS177"," BAS178"," BAS179"," BAS180"," BAS181"," BAS182"," BAS183"," BAS184"," BAS185"," BAS186"," BAS187"," BAS188"," BAS189"," BAS190"," BAS191"," BAS192"," BAS193"," BAS194"," BAS195"," BAS196"," BAS197"," BAS198"," BAS199"," BAS200"," BAS201"," BAS202"," BAS203"," BAS204"," BAS205"," BAS206"," BAS207"," BAS208"," BAS209"," BAS210"," BAS211"," BAS212"," BAS213"," BAS214"," BAS215"," BAS216"," BAS217"," BAS218"," BAS219"," BAS220"," BAS221"," BAS222"," BAS223"," BAS224"," BAS225"," BAS226"," BAS227"," BAS228"," BAS229"," BAS230"]
[null,{"$f":"IF(B118=B96,\"SI\",\"NO\")","v":"SI"},{"$f":"IF(C118=C96,\"SI\",\"NO\")","v":"SI"},"SI","SI","SI","SI","SI","SI","SI","SI","SI","SI","SI","SI","SI","SI","SI","SI","SI","SI","SI","SI","SI","SI","SI","SI","SI","SI","SI","SI","SI","SI","SI","SI","SI","SI","SI","SI","SI","SI","SI","SI","SI","SI","SI","SI","SI","SI","SI","SI","SI","SI","SI","SI","SI","SI","SI","SI","SI","SI","SI","SI","SI","SI","SI",{"$f":"IF(BO118=BO96,\"SI\",\"NO\")","v":"SI"},"SI","SI","SI","SI","SI","SI","SI","SI","SI","SI","SI","SI","SI","SI","SI","SI","SI","SI","SI","SI","SI","SI","SI","SI","SI","SI","SI","SI","SI","SI","SI","SI","SI","SI","SI","SI","SI","SI","SI","SI","SI","SI","SI","SI","SI","SI","SI","SI","SI","SI","SI","SI","SI","SI","SI","SI","SI","SI","SI","SI","SI","SI","SI",{"$f":"IF(EA118=EA96,\"SI\",\"NO\")","v":"SI"},"SI","SI","SI","SI","SI","SI","SI","SI","SI","SI","SI","SI","SI","SI","SI","SI","SI","SI","SI","SI","SI","SI","SI","SI","SI","SI","SI","SI","SI","SI","SI","SI","SI","SI","SI","SI","SI","SI","SI","SI","SI","SI","SI","SI","SI","SI","SI","SI","SI","SI","SI","SI","SI","SI","SI","SI","SI","SI","SI","SI","SI","SI","SI",{"$f":"IF(GM118=GM96,\"SI\",\"NO\")","v":"SI"},"SI","SI","SI","SI","SI","SI","SI","SI","SI","SI","SI","SI","SI","SI","SI","SI","SI","SI","SI","SI","SI","SI","SI","SI","SI","SI","SI","SI","SI","SI","SI","SI","SI","SI","SI","SI"]
[]
["ESANS_03"]
["anno",2025]
["cod_red","(Todas)"]
["codmic","(Todas)"]
["cod_prov","(Todas)"]
["coddist","(Todas)"]
["cod_estab","(Todas)"]
["cod_eje","(Todas)"]
[]
[null,"Valores"]
["Etiquetas de fila"," BAS001"," BAS002"," BAS003"," BAS004"," BAS005"," BAS006"," BAS007"," BAS008"," BAS009"," BAS010"," BAS011"," BAS012"," BAS013"," BAS014"," BAS015"," BAS016"," BAS017"," BAS018"," BAS019"," BAS020"," BAS021"," BAS022"," BAS023"," BAS024"," BAS025"," BAS026"," BAS027"," BAS028"," BAS029"," BAS030"," BAS031"," BAS032"," BAS033"," BAS034"," BAS035"," BAS036"," BAS037"," BAS038"," BAS039"," BAS040"," BAS041"," BAS042"," BAS043"," BAS044"," BAS045"," BAS046"," BAS047"," BAS048"," BAS049"," BAS050"," BAS051"," BAS052"," BAS053"," BAS054"," BAS055"," BAS056"," BAS057"," BAS058"," BAS059"," BAS060"," BAS061"," BAS062"," BAS063"," BAS064"," BAS065"," BAS066"," BAS067"," BAS068"," BAS069"," BAS070"," BAS071"," BAS072"," BAS073"," BAS074"," BAS075"," BAS076"," BAS077"," BAS078"," BAS079"," BAS080"," BAS081"," BAS082"," BAS083"," BAS084"," BAS085"," BAS086"," BAS087"," BAS088"," BAS089"," BAS090"," BAS091"," BAS092"," BAS093"," BAS094"," BAS095"," BAS096"," BAS097"," BAS098"," BAS099"," BAS100"," BAS101"," BAS102"," BAS103"," BAS104"," BAS105"," BAS106"," BAS107"," BAS108"," BAS109"," BAS110"," BAS111"," BAS112"," BAS113"," BAS114"," BAS115"," BAS116"," BAS117"," BAS118"," BAS119"," BAS120"," BAS121"," BAS122"," BAS123"," BAS124"," BAS125"," BAS126"," BAS127"," BAS128"," BAS129"," BAS130"," BAS131"," BAS132"," BAS133"," BAS134"," BAS135"," BAS136"," BAS137"," BAS138"," BAS139"," BAS140"," BAS141"," BAS142"," BAS143"," BAS144"," BAS145"," BAS146"," BAS147"," BAS148"," BAS149"," BAS150"," BAS151"," BAS152"," BAS153"," BAS154"," BAS155"," BAS156"," BAS157"," BAS158"," BAS159"," BAS160"," BAS161"," BAS162"," BAS163"," BAS164"," BAS165"," BAS166"," BAS167"," BAS168"," BAS169"," BAS170"," BAS171"," BAS172"," BAS173"," BAS174"," BAS175"," BAS176"," BAS177"," BAS178"," BAS179"," BAS180"," BAS181"," BAS182"," BAS183"," BAS184"," BAS185"," BAS186"," BAS187"," BAS188"," BAS189"," BAS190"," BAS191"," BAS192"," BAS193"," BAS194"," BAS195"," BAS196"," BAS197"," BAS198"," BAS199"," BAS200"," BAS201"," BAS202"," BAS203"," BAS204"," BAS205"," BAS206"," BAS207"," BAS208"," BAS209"," BAS210"," BAS211"," BAS212"," BAS213"," BAS214"," BAS215"," BAS216"," BAS217"," BAS218"," BAS219"," BAS220"," BAS221"," BAS222"," BAS223"," BAS224"," BAS225"," BAS226"," BAS227"," BAS228"," BAS229"," BAS230"]
[4,0,0,0,0,0,0,0,0,31,26,24,16,9,17,0,0,28,33,36,37,40,27,27,0,25,19,24,20,18,13,10,0,13,9,18,7,9,5,7,0,20,10,6,8,6,5,8,0,3,0,0,0,0,0,0,0,57,3,0,0,0,0,0,0,59,3,0,1,0,0,0,0,32,1,0,0,1,1,0,0,0,0,0,0,0,0,0,4,1,0,0,0,5,5,1,1,0,0,0,0,0,0,0,0,1,0,0,0,0,0,1,1,0,0,0,0,0,0,0,0,0,0,1,0,0,0,0,0,1,0,0,0,0,0,0,0,0,0,0,0,0,0,0,0,0,0,0,0,0,0,0,0,0,0,0,0,0,0,0,0,0,0,0,0,0,0,0,0,0,0,0,0,0,0,0,0,0,0,0,0,0,0,0,0,0,0,0,0,0,0,0,0,0,0,0,0,0,0,0,0,0,0,0,0,0,0,0,0,0,0,0,0,0,0,0,0,0,0,0,0,0,0,0,0,0,0,0,0,0,0]
[5,0,0,0,0,0,0,0,0,23,18,25,14,10,5,0,0,31,21,40,22,35,18,16,0,17,15,14,20,14,9,8,0,13,11,12,13,6,3,5,0,8,12,12,5,9,6,5,0,1,0,0,0,0,0,0,0,19,24,1,0,0,0,0,0,20,24,2,1,0,0,0,0,39,0,0,0,0,0,0,0,0,0,0,0,0,0,0,1,1,0,0,0,0,1,0,0,0,0,0,0,0,0,0,0,0,0,0,0,0,0,0,0,0,0,0,0,0,0,0,0,0,0,0,0,0,0,0,0,0,0,0,0,0,0,0,0,0,0,0,0,0,0,0,0,0,0,0,0,0,0,0,0,0,0,0,0,0,0,0,0,0,0,0,0,0,0,0,0,0,0,0,0,0,0,0,0,0,0,0,0,0,0,0,0,0,0,0,0,0,0,0,0,0,0,0,0,0,0,0,0,0,0,0,0,0,0,0,0,0,0,0,0,0,0,0,0,0,0,0,0,0,0,0,0,0,0,0,0,0,0]
[3,0,0,0,0,0,0,0,0,38,22,20,13,24,12,0,0,43,29,37,32,34,28,20,0,18,24,22,13,10,10,20,0,13,19,6,8,12,5,6,0,17,6,10,10,6,6,4,0,0,0,0,0,0,0,0,0,7,1,0,0,0,0,0,0,8,1,0,0,0,0,0,0,28,0,0,0,0,0,0,0,0,0,0,0,0,0,0,2,0,0,0,0,5,1,1,0,0,0,0,1,0,0,0,0,0,0,0,0,0,0,0,0,0,0,0,0,0,0,0,0,0,0,2,0,0,0,0,0,3,0,0,0,0,0,0,0,0,0,0,0,0,0,0,0,0,0,0,0,0,0,0,0,0,0,0,0,0,0,0,0,0,0,0,0,0,0,0,0,0,0,0,0,0,0,0,0,0,0,0,0,0,0,0,0,0,0,0,0,0,0,0,0,0,0,0,0,0,0,0,0,0,0,0,0,0,0,0,0,0,0,0,0,0,0,0,0,0,0,0,0,0,0,0,0,0,0,0,0,0,0]
[1,0,0,0,0,0,0,0,0,19,18,24,21,11,9,0,0,30,21,22,33,29,28,20,0,17,14,14,7,12,20,13,0,7,7,11,13,7,8,9,0,12,10,6,4,6,6,6,0,1,0,0,0,0,0,0,0,2,0,0,0,0,0,0,0,2,0,0,0,0,0,0,0,26,0,0,0,1,0,0,0,0,0,0,0,0,0,10,0,0,0,0,0,7,0,0,0,0,0,5,0,0,0,0,0,3,0,0,0,0,0,1,0,0,0,0,0,0,0,0,0,0,0,0,0,0,0,0,0,0,0,0,0,0,0,0,0,0,0,0,0,0,0,0,0,0,0,0,0,0,0,0,0,0,0,0,0,0,0,0,0,0,0,0,0,0,0,0,0,0,0,0,0,0,0,0,0,0,0,0,0,0,0,0,0,0,0,0,0,0,0,0,0,0,0,0,0,0,0,0,0,0,0,0,0,0,0,0,0,0,0,0,0,0,0,0,0,0,0,0,0,0,0,0,0,0,0,0,0,0,0]
[2,0,0,0,0,0,0,0,0,28,18,16,26,15,5,0,0,36,36,21,36,15,24,31,0,20,17,12,9,8,19,10,0,13,10,6,8,5,4,5,0,6,8,9,4,5,6,5,0,0,0,0,0,0,0,0,0,4,2,0,0,0,0,0,0,4,2,0,0,0,0,0,0,30,1,0,0,0,0,0,0,0,0,0,0,0,0,3,1,0,0,0,0,8,1,1,0,0,0,1,2,0,0,0,0,2,0,0,0,0,0,0,0,0,0,0,0,0,0,0,0,0,0,0,0,0,0,0,0,1,1,0,0,0,0,0,1,0,0,0,0,0,0,0,0,0,0,0,0,0,0,0,0,0,0,0,0,0,0,0,0,0,0,0,0,0,0,0,0,0,0,0,0,0,0,0,0,0,0,0,0,0,0,0,0,0,0,0,0,0,0,0,0,0,0,0,0,0,0,0,0,0,0,0,0,0,0,0,0,0,0,0,0,0,0,0,0,0,0,0,0,0,0,0,0,0,0,0,0,0,0]
["T",0,0,0,0,0,0,0,0,139,102,109,90,69,48,0,0,168,140,156,160,153,125,114,0,97,89,86,69,62,71,61,0,59,56,53,49,39,25,32,0,63,46,43,31,32,29,28,0,5,0,0,0,0,0,0,0,89,30,1,0,0,0,0,0,93,30,2,2,0,0,0,0,155,2,0,0,2,1,0,0,0,0,0,0,0,0,13,8,2,0,0,0,25,8,3,1,0,0,6,3,0,0,0,0,6,0,0,0,0,0,2,1,0,0,0,0,0,0,0,0,0,0,3,0,0,0,0,0,5,1,0,0,0,0,0,1,0,0,0,0,0,0,0,0,0,0,0,0,0,0,0,0,0,0,0,0,0,0,0,0,0,0,0,0,0,0,0,0,0,0,0,0,0,0,0,0,0,0,0,0,0,0,0,0,0,0,0,0,0,0,0,0,0,0,0,0,0,0,0,0,0,0,0,0,0,0,0,0,0,0,0,0,0,0,0,0,0,0,0,0,0,0,0,0,0,0,0,0,0,0]
[]
[]
[]
[]
[]
[]
[]
[]
[]
[]
[]
[]
["TOTAL"]
[{"$f":"COUNT(A132:A148)","v":5},{"$f":"SUM(B132:B148)","v":0},{"$f":"SUM(C132:C148)","v":0},0,0,0,0,0,0,278,204,218,180,138,96,0,0,336,280,312,320,306,250,228,0,194,178,172,138,124,142,122,0,118,112,106,98,78,50,64,0,126,92,86,62,64,58,56,0,10,0,0,0,0,0,0,0,178,60,2,0,0,0,0,0,186,{"$f":"SUM(BO132:BO148)","v":60},4,4,0,0,0,0,310,4,0,0,4,2,0,0,0,0,0,0,0,0,26,16,4,0,0,0,50,16,6,2,0,0,12,6,0,0,0,0,12,0,0,0,0,0,4,2,0,0,0,0,0,0,0,0,0,0,6,0,0,0,0,0,10,{"$f":"SUM(EA132:EA148)","v":2},0,0,0,0,0,2,0,0,0,0,0,0,0,0,0,0,0,0,0,0,0,0,0,0,0,0,0,0,0,0,0,0,0,0,0,0,0,0,0,0,0,0,0,0,0,0,0,0,0,0,0,0,0,0,0,0,0,0,0,0,0,0,0,{"$f":"SUM(GM132:GM148)","v":0},0,0,0,0,0,0,0,0,0,0,0,0,0,0,0,0,0,0,0,0,0,0,0,0,0,0,0,0,0,0,0,0,0,0,0,0]
[{"$f":"CONCATENATE(A132,\"-\",A133,\"-\",A134,\"-\",A135,\"-\",A136,\"-\",A137,\"-\",A138,\"-\",A139,\"-\",A140,\"-\",A141,\"-\",A142,\"-\",A143)","v":"4-5-3-1-2-T------"}]
[null," BAS001"," BAS002"," BAS003"," BAS004"," BAS005"," BAS006"," BAS007"," BAS008"," BAS009"," BAS010"," BAS011"," BAS012"," BAS013"," BAS014"," BAS015"," BAS016"," BAS017"," BAS018"," BAS019"," BAS020"," BAS021"," BAS022"," BAS023"," BAS024"," BAS025"," BAS026"," BAS027"," BAS028"," BAS029"," BAS030"," BAS031"," BAS032"," BAS033"," BAS034"," BAS035"," BAS036"," BAS037"," BAS038"," BAS039"," BAS040"," BAS041"," BAS042"," BAS043"," BAS044"," BAS045"," BAS046"," BAS047"," BAS048"," BAS049"," BAS050"," BAS051"," BAS052"," BAS053"," BAS054"," BAS055"," BAS056"," BAS057"," BAS058"," BAS059"," BAS060"," BAS061"," BAS062"," BAS063"," BAS064"," BAS065"," BAS066"," BAS067"," BAS068"," BAS069"," BAS070"," BAS071"," BAS072"," BAS073"," BAS074"," BAS075"," BAS076"," BAS077"," BAS078"," BAS079"," BAS080"," BAS081"," BAS082"," BAS083"," BAS084"," BAS085"," BAS086"," BAS087"," BAS088"," BAS089"," BAS090"," BAS091"," BAS092"," BAS093"," BAS094"," BAS095"," BAS096"," BAS097"," BAS098"," BAS099"," BAS100"," BAS101"," BAS102"," BAS103"," BAS104"," BAS105"," BAS106"," BAS107"," BAS108"," BAS109"," BAS110"," BAS111"," BAS112"," BAS113"," BAS114"," BAS115"," BAS116"," BAS117"," BAS118"," BAS119"," BAS120"," BAS121"," BAS122"," BAS123"," BAS124"," BAS125"," BAS126"," BAS127"," BAS128"," BAS129"," BAS130"," BAS131"," BAS132"," BAS133"," BAS134"," BAS135"," BAS136"," BAS137"," BAS138"," BAS139"," BAS140"," BAS141"," BAS142"," BAS143"," BAS144"," BAS145"," BAS146"," BAS147"," BAS148"," BAS149"," BAS150"," BAS151"," BAS152"," BAS153"," BAS154"," BAS155"," BAS156"," BAS157"," BAS158"," BAS159"," BAS160"," BAS161"," BAS162"," BAS163"," BAS164"," BAS165"," BAS166"," BAS167"," BAS168"," BAS169"," BAS170"," BAS171"," BAS172"," BAS173"," BAS174"," BAS175"," BAS176"," BAS177"," BAS178"," BAS179"," BAS180"," BAS181"," BAS182"," BAS183"," BAS184"," BAS185"," BAS186"," BAS187"," BAS188"," BAS189"," BAS190"," BAS191"," BAS192"," BAS193"," BAS194"," BAS195"," BAS196"," BAS197"," BAS198"," BAS199"," BAS200"," BAS201"," BAS202"," BAS203"," BAS204"," BAS205"," BAS206"," BAS207"," BAS208"," BAS209"," BAS210"," BAS211"," BAS212"," BAS213"," BAS214"," BAS215"," BAS216"," BAS217"," BAS218"," BAS219"," BAS220"," BAS221"," BAS222"," BAS223"," BAS224"," BAS225"," BAS226"," BAS227"," BAS228"," BAS229"," BAS230"]
[null,{"$f":"IF(B153=B131,\"SI\",\"NO\")","v":"SI"},{"$f":"IF(C153=C131,\"SI\",\"NO\")","v":"SI"},"SI","SI","SI","SI","SI","SI","SI","SI","SI","SI","SI","SI","SI","SI","SI","SI","SI","SI","SI","SI","SI","SI","SI","SI","SI","SI","SI","SI","SI","SI","SI","SI","SI","SI","SI","SI","SI","SI","SI","SI","SI","SI","SI","SI","SI","SI","SI","SI","SI","SI","SI","SI","SI","SI","SI","SI","SI","SI","SI","SI","SI","SI","SI",{"$f":"IF(BO153=BO131,\"SI\",\"NO\")","v":"SI"},"SI","SI","SI","SI","SI","SI","SI","SI","SI","SI","SI","SI","SI","SI","SI","SI","SI","SI","SI","SI","SI","SI","SI","SI","SI","SI","SI","SI","SI","SI","SI","SI","SI","SI","SI","SI","SI","SI","SI","SI","SI","SI","SI","SI","SI","SI","SI","SI","SI","SI","SI","SI","SI","SI","SI","SI","SI","SI","SI","SI","SI","SI","SI",{"$f":"IF(EA153=EA131,\"SI\",\"NO\")","v":"SI"},"SI","SI","SI","SI","SI","SI","SI","SI","SI","SI","SI","SI","SI","SI","SI","SI","SI","SI","SI","SI","SI","SI","SI","SI","SI","SI","SI","SI","SI","SI","SI","SI","SI","SI","SI","SI","SI","SI","SI","SI","SI","SI","SI","SI","SI","SI","SI","SI","SI","SI","SI","SI","SI","SI","SI","SI","SI","SI","SI","SI","SI","SI","SI",{"$f":"IF(GM153=GM131,\"SI\",\"NO\")","v":"SI"},"SI","SI","SI","SI","SI","SI","SI","SI","SI","SI","SI","SI","SI","SI","SI","SI","SI","SI","SI","SI","SI","SI","SI","SI","SI","SI","SI","SI","SI","SI","SI","SI","SI","SI","SI","SI"]
[]
[]
[]
[]
["ESANS_04"]
["anno",2025]
["cod_red","(Todas)"]
["codmic","(Todas)"]
["cod_prov","(Todas)"]
["coddist","(Todas)"]
["cod_estab","(Todas)"]
["cod_eje","(Todas)"]
[]
[null,"Valores"]
["Etiquetas de fila"," BAS001"," BAS002"," BAS003"," BAS004"," BAS005"," BAS006"," BAS007"," BAS008"," BAS009"," BAS010"," BAS011"," BAS012"," BAS013"," BAS014"," BAS015"," BAS016"," BAS017"," BAS018"," BAS019"," BAS020"," BAS021"," BAS022"," BAS023"," BAS024"," BAS025"," BAS026"," BAS027"," BAS028"," BAS029"," BAS030"," BAS031"," BAS032"," BAS033"," BAS034"," BAS035"," BAS036"," BAS037"," BAS038"," BAS039"," BAS040"," BAS041"," BAS042"," BAS043"," BAS044"," BAS045"," BAS046"," BAS047"," BAS048"," BAS049"," BAS050"," BAS051"," BAS052"," BAS053"," BAS054"," BAS055"," BAS056"," BAS057"," BAS058"," BAS059"," BAS060"," BAS061"," BAS062"," BAS063"," BAS064"," BAS065"," BAS066"," BAS067"," BAS068"," BAS069"," BAS070"," BAS071"," BAS072"," BAS073"," BAS074"," BAS075"," BAS076"," BAS077"," BAS078"," BAS079"," BAS080"," BAS081"," BAS082"," BAS083"," BAS084"," BAS085"," BAS086"," BAS087"," BAS088"," BAS089"," BAS090"," BAS091"," BAS092"," BAS093"," BAS094"," BAS095"," BAS096"," BAS097"," BAS098"," BAS099"," BAS100"," BAS101"," BAS102"," BAS103"," BAS104"," BAS105"," BAS106"," BAS107"," BAS108"," BAS109"," BAS110"," BAS111"," BAS112"," BAS113"," BAS114"," BAS115"," BAS116"," BAS117"," BAS118"," BAS119"," BAS120"," BAS121"," BAS122"," BAS123"," BAS124"," BAS125"," BAS126"," BAS127"," BAS128"," BAS129"," BAS130"," BAS131"," BAS132"," BAS133"," BAS134"," BAS135"," BAS136"," BAS137"," BAS138"," BAS139"," BAS140"," BAS141"," BAS142"," BAS143"," BAS144"," BAS145"," BAS146"," BAS147"," BAS148"," BAS149"," BAS150"," BAS151"," BAS152"," BAS153"," BAS154"," BAS155"," BAS156"," BAS157"," BAS158"," BAS159"," BAS160"," BAS161"," BAS162"," BAS163"," BAS164"," BAS165"," BAS166"," BAS167"," BAS168"," BAS169"," BAS170"," BAS171"," BAS172"," BAS173"," BAS174"," BAS175"," BAS176"," BAS177"," BAS178"," BAS179"," BAS180"," BAS181"," BAS182"," BAS183"," BAS184"," BAS185"," BAS186"," BAS187"," BAS188"," BAS189"," BAS190"," BAS191"," BAS192"," BAS193"," BAS194"," BAS195"," BAS196"," BAS197"," BAS198"," BAS199"," BAS200"," BAS201"," BAS202"," BAS203"," BAS204"," BAS205"," BAS206"," BAS207"," BAS208"," BAS209"," BAS210"," BAS211"," BAS212"," BAS213"," BAS214"," BAS215"," BAS216"," BAS217"," BAS218"," BAS219"," BAS220"," BAS221"," BAS222"," BAS223"," BAS224"," BAS225"," BAS226"," BAS227"," BAS228"," BAS229"," BAS230"]
[4,24,15,12,1,0,0,22,22,30,6,21,0,15,19,13,2,9,0,16,7,13,11,0,0,1,1,3,2,0,0,2,0,0,0,0,0,2,0,1,0,0,0,0,0,0,0,0,0,0,0,1,0,0,0,0,0,0,0,0,0,0,0,0,0,0,0,0,0,0,0,0,0,0,0,0,0,0,0,0,0,0,0,0,0,0,0,0,0,0,0,0,0,0,0,0,0,0,0,0,0,0,0,0,0,0,0,0,0,0,0,0,0,0,0,0,0,0,0,0,0,0,0,0,0,0,0,0,0,0,0,0,0,0,0,0,0,0,0,0,0,0,0,0,0,0,0,0,0,0,0,0,0,0,0,0,0,0,0,0,0,0,0,0,0,0,0,0,0,0,0,0,0,0,0,0,0,0,0,0,0,0,0,0,0,0,0,0,0,0,0,0,0,0,0,0,0,0,0,0,0,0,0,0,0,0,0,0,0,0,0,0,0,0,0,0,0,0,0,0,0,0,0,0,0,0,0,0,0,0,0]
[5,15,20,8,1,0,0,15,27,12,6,14,0,10,9,17,3,8,0,15,4,10,10,0,0,4,3,0,0,0,0,7,0,0,0,0,0,7,1,1,0,0,0,0,1,0,0,0,0,0,0,1,0,0,0,0,0,0,0,0,0,0,0,0,0,0,0,0,0,0,0,0,0,0,0,0,0,0,0,0,0,0,0,0,0,0,0,0,0,0,0,0,0,0,0,0,0,0,0,0,0,0,0,0,0,0,0,0,0,0,0,0,0,0,0,0,0,0,0,0,0,0,0,0,0,0,0,0,0,0,0,0,0,0,0,0,0,0,0,0,0,0,0,0,0,0,0,0,0,0,0,0,0,0,0,0,0,0,0,0,0,0,0,0,0,0,0,0,0,0,0,0,0,0,0,0,0,0,0,0,0,0,0,0,0,0,0,0,0,0,0,0,0,0,0,0,0,0,0,0,0,0,0,0,0,0,0,0,0,0,0,0,0,0,0,0,0,0,0,0,0,0,0,0,0,0,0,0,0,0,0]
[3,11,16,8,1,0,0,22,24,25,6,16,0,22,15,11,1,19,0,22,8,15,5,0,0,4,0,1,0,0,0,0,0,0,0,0,0,0,0,0,0,0,0,0,0,0,0,0,0,0,0,0,0,0,0,0,0,0,0,0,0,0,0,0,0,0,0,0,0,0,0,0,0,0,0,0,0,0,0,0,0,0,0,0,0,0,0,0,0,0,0,0,0,0,0,0,0,0,0,0,0,0,0,0,0,0,0,0,0,0,0,0,0,0,0,0,0,0,0,0,0,0,0,0,0,0,0,0,0,0,0,0,0,0,0,0,0,0,0,0,0,0,0,0,0,0,0,0,0,0,0,0,0,0,0,0,0,0,0,0,0,0,0,0,0,0,0,0,0,0,0,0,0,0,0,0,0,0,0,0,0,0,0,0,0,0,0,0,0,0,0,0,0,0,0,0,0,0,0,0,0,0,0,0,0,0,0,0,0,0,0,0,0,0,0,0,0,0,0,0,0,0,0,0,0,0,0,0,0,0,0]
[2,14,7,22,1,0,0,25,9,23,0,17,0,13,10,7,1,9,0,11,5,11,10,0,0,6,0,0,1,0,0,0,0,0,0,0,0,0,0,0,0,0,0,0,0,0,0,0,0,0,0,0,0,0,0,0,0,0,0,0,0,0,0,0,0,0,0,0,0,0,0,0,0,0,0,0,0,0,0,0,0,0,0,0,0,0,0,0,0,0,0,0,0,0,0,0,0,0,0,0,0,0,0,0,0,0,0,0,0,0,0,0,0,0,0,0,0,0,0,0,0,0,0,0,0,0,0,0,0,0,0,0,0,0,0,0,0,0,0,0,0,0,0,0,0,0,0,0,0,0,0,0,0,0,0,0,0,0,0,0,0,0,0,0,0,0,0,0,0,0,0,0,0,0,0,0,0,0,0,0,0,0,0,0,0,0,0,0,0,0,0,0,0,0,0,0,0,0,0,0,0,0,0,0,0,0,0,0,0,0,0,0,0,0,0,0,0,0,0,0,0,0,0,0,0,0,0,0,0,0,0]
[1,11,10,9,0,0,0,9,12,21,5,11,0,13,6,4,2,9,0,11,3,11,11,0,0,3,1,0,0,0,0,0,0,0,0,0,0,0,0,0,0,0,0,0,0,0,0,0,0,0,0,0,0,0,0,0,0,0,0,0,0,0,0,0,0,0,0,0,0,0,0,0,0,0,0,0,0,0,0,0,0,0,0,0,0,0,0,0,0,0,0,0,0,0,0,0,0,0,0,0,0,0,0,0,0,0,0,0,0,0,0,0,0,0,0,0,0,0,0,0,0,0,0,0,0,0,0,0,0,0,0,0,0,0,0,0,0,0,0,0,0,0,0,0,0,0,0,0,0,0,0,0,0,0,0,0,0,0,0,0,0,0,0,0,0,0,0,0,0,0,0,0,0,0,0,0,0,0,0,0,0,0,0,0,0,0,0,0,0,0,0,0,0,0,0,0,0,0,0,0,0,0,0,0,0,0,0,0,0,0,0,0,0,0,0,0,0,0,0,0,0,0,0,0,0,0,0,0,0,0,0]
["T",75,68,59,4,0,0,93,94,111,23,79,0,73,59,52,9,54,0,75,27,60,47,0,0,18,5,4,3,0,0,9,0,0,0,0,0,9,1,2,0,0,0,0,1,0,0,0,0,0,0,2,0,0,0,0,0,0,0,0,0,0,0,0,0,0,0,0,0,0,0,0,0,0,0,0,0,0,0,0,0,0,0,0,0,0,0,0,0,0,0,0,0,0,0,0,0,0,0,0,0,0,0,0,0,0,0,0,0,0,0,0,0,0,0,0,0,0,0,0,0,0,0,0,0,0,0,0,0,0,0,0,0,0,0,0,0,0,0,0,0,0,0,0,0,0,0,0,0,0,0,0,0,0,0,0,0,0,0,0,0,0,0,0,0,0,0,0,0,0,0,0,0,0,0,0,0,0,0,0,0,0,0,0,0,0,0,0,0,0,0,0,0,0,0,0,0,0,0,0,0,0,0,0,0,0,0,0,0,0,0,0,0,0,0,0,0,0,0,0,0,0,0,0,0,0,0,0,0,0,0]
[]
[]
[]
[]
[]
[]
[]
[]
[]
[]
[]
[]
["TOTAL"]
[{"$f":"COUNT(A170:A186)","v":5},{"$f":"SUM(B170:B186)","v":150},{"$f":"SUM(C170:C186)","v":136},118,8,0,0,186,188,222,46,158,0,146,118,104,18,108,0,150,54,120,94,0,0,36,10,8,6,0,0,18,0,0,0,0,0,18,2,4,0,0,0,0,2,0,0,0,0,0,0,4,0,0,0,0,0,0,0,0,0,0,0,0,0,0,{"$f":"SUM(BO170:BO186)","v":0},0,0,0,0,0,0,0,0,0,0,0,0,0,0,0,0,0,0,0,0,0,0,0,0,0,0,0,0,0,0,0,0,0,0,0,0,0,0,0,0,0,0,0,0,0,0,0,0,0,0,0,0,0,0,0,0,0,0,0,0,0,0,0,{"$f":"SUM(EA170:EA186)","v":0},0,0,0,0,0,0,0,0,0,0,0,0,0,0,0,0,0,0,0,0,0,0,0,0,0,0,0,0,0,0,0,0,0,0,0,0,0,0,0,0,0,0,0,0,0,0,0,0,0,0,0,0,0,0,0,0,0,0,0,0,0,0,0,{"$f":"SUM(GM170:GM186)","v":0},0,0,0,0,0,0,0,0,0,0,0,0,0,0,0,0,0,0,0,0,0,0,0,0,0,0,0,0,0,0,0,0,0,0,0,0]
[{"$f":"CONCATENATE(A170,\"-\",A171,\"-\",A172,\"-\",A173,\"-\",A174,\"-\",A175,\"-\",A176,\"-\",A177,\"-\",A178,\"-\",A179,\"-\",A180,\"-\",A181)","v":"4-5-3-2-1-T------"}]
[null," BAS001"," BAS002"," BAS003"," BAS004"," BAS005"," BAS006"," BAS007"," BAS008"," BAS009"," BAS010"," BAS011"," BAS012"," BAS013"," BAS014"," BAS015"," BAS016"," BAS017"," BAS018"," BAS019"," BAS020"," BAS021"," BAS022"," BAS023"," BAS024"," BAS025"," BAS026"," BAS027"," BAS028"," BAS029"," BAS030"," BAS031"," BAS032"," BAS033"," BAS034"," BAS035"," BAS036"," BAS037"," BAS038"," BAS039"," BAS040"," BAS041"," BAS042"," BAS043"," BAS044"," BAS045"," BAS046"," BAS047"," BAS048"," BAS049"," BAS050"," BAS051"," BAS052"," BAS053"," BAS054"," BAS055"," BAS056"," BAS057"," BAS058"," BAS059"," BAS060"," BAS061"," BAS062"," BAS063"," BAS064"," BAS065"," BAS066"," BAS067"," BAS068"," BAS069"," BAS070"," BAS071"," BAS072"," BAS073"," BAS074"," BAS075"," BAS076"," BAS077"," BAS078"," BAS079"," BAS080"," BAS081"," BAS082"," BAS083"," BAS084"," BAS085"," BAS086"," BAS087"," BAS088"," BAS089"," BAS090"," BAS091"," BAS092"," BAS093"," BAS094"," BAS095"," BAS096"," BAS097"," BAS098"," BAS099"," BAS100"," BAS101"," BAS102"," BAS103"," BAS104"," BAS105"," BAS106"," BAS107"," BAS108"," BAS109"," BAS110"," BAS111"," BAS112"," BAS113"," BAS114"," BAS115"," BAS116"," BAS117"," BAS118"," BAS119"," BAS120"," BAS121"," BAS122"," BAS123"," BAS124"," BAS125"," BAS126"," BAS127"," BAS128"," BAS129"," BAS130"," BAS131"," BAS132"," BAS133"," BAS134"," BAS135"," BAS136"," BAS137"," BAS138"," BAS139"," BAS140"," BAS141"," BAS142"," BAS143"," BAS144"," BAS145"," BAS146"," BAS147"," BAS148"," BAS149"," BAS150"," BAS151"," BAS152"," BAS153"," BAS154"," BAS155"," BAS156"," BAS157"," BAS158"," BAS159"," BAS160"," BAS161"," BAS162"," BAS163"," BAS164"," BAS165"," BAS166"," BAS167"," BAS168"," BAS169"," BAS170"," BAS171"," BAS172"," BAS173"," BAS174"," BAS175"," BAS176"," BAS177"," BAS178"," BAS179"," BAS180"," BAS181"," BAS182"," BAS183"," BAS184"," BAS185"," BAS186"," BAS187"," BAS188"," BAS189"," BAS190"," BAS191"," BAS192"," BAS193"," BAS194"," BAS195"," BAS196"," BAS197"," BAS198"," BAS199"," BAS200"," BAS201"," BAS202"," BAS203"," BAS204"," BAS205"," BAS206"," BAS207"," BAS208"," BAS209"," BAS210"," BAS211"," BAS212"," BAS213"," BAS214"," BAS215"," BAS216"," BAS217"," BAS218"," BAS219"," BAS220"," BAS221"," BAS222"," BAS223"," BAS224"," BAS225"," BAS226"," BAS227"," BAS228"," BAS229"," BAS230"]
[null,{"$f":"IF(B191=B169,\"SI\",\"NO\")","v":"SI"},{"$f":"IF(C191=C169,\"SI\",\"NO\")","v":"SI"},"SI","SI","SI","SI","SI","SI","SI","SI","SI","SI","SI","SI","SI","SI","SI","SI","SI","SI","SI","SI","SI","SI","SI","SI","SI","SI","SI","SI","SI","SI","SI","SI","SI","SI","SI","SI","SI","SI","SI","SI","SI","SI","SI","SI","SI","SI","SI","SI","SI","SI","SI","SI","SI","SI","SI","SI","SI","SI","SI","SI","SI","SI","SI",{"$f":"IF(BO191=BO169,\"SI\",\"NO\")","v":"SI"},"SI","SI","SI","SI","SI","SI","SI","SI","SI","SI","SI","SI","SI","SI","SI","SI","SI","SI","SI","SI","SI","SI","SI","SI","SI","SI","SI","SI","SI","SI","SI","SI","SI","SI","SI","SI","SI","SI","SI","SI","SI","SI","SI","SI","SI","SI","SI","SI","SI","SI","SI","SI","SI","SI","SI","SI","SI","SI","SI","SI","SI","SI","SI",{"$f":"IF(EA191=EA169,\"SI\",\"NO\")","v":"SI"},"SI","SI","SI","SI","SI","SI","SI","SI","SI","SI","SI","SI","SI","SI","SI","SI","SI","SI","SI","SI","SI","SI","SI","SI","SI","SI","SI","SI","SI","SI","SI","SI","SI","SI","SI","SI","SI","SI","SI","SI","SI","SI","SI","SI","SI","SI","SI","SI","SI","SI","SI","SI","SI","SI","SI","SI","SI","SI","SI","SI","SI","SI","SI",{"$f":"IF(GM191=GM169,\"SI\",\"NO\")","v":"SI"},"SI","SI","SI","SI","SI","SI","SI","SI","SI","SI","SI","SI","SI","SI","SI","SI","SI","SI","SI","SI","SI","SI","SI","SI","SI","SI","SI","SI","SI","SI","SI","SI","SI","SI","SI","SI"]

{"sheet":"Datos","index":2,"n_rows":455,"n_cols":32,"rows_kept":455,"cut":false,"hidden":true,"merged":[]}
[]
[]
[]
[]
[]
[]
[]
[]
[null,"ANO",null,"MESES",null,"COD_RED","DESC_RED","CONCATENAR",null,"COD_RED","COD_MIC","DESC_MICRO","CONCATENAR",null,"COD_ESTAB","DESC_ESTAB","COD_RED","COD_MIC","COD_PROV","COD_DIST","REDMIC","CONCATENAR",null,"COD_PROV","DESC_PROV","CONCATENAR",null,"COD_PROV","COD_DIST","DESC_DIST","PROVDIST","CONCATENAR"]
[null,2025,null,"01-Enero",null,"00","NO TIENE ASIGNADO NINGUNA RED",{"$f":"CONCATENATE(F10,\" - \",G10)","v":"00 - NO TIENE ASIGNADO NINGUNA RED"},null,"00","00","NO PERTENECE A NINGUNA MICRORED                                                                     ",{"$f":"CONCATENATE(J10,K10,\" - \",L10)","v":"0000 - NO PERTENECE A NINGUNA MICRORED                                                                     "},null,"000000000","(All)","00","00",null,null,{"$f":"CONCATENATE(Q10,R10)","v":"0000"},{"$f":"CONCATENATE(O10,\" - \",P10)","v":"000000000 - (All)"},null,"00","(All)",{"$f":"CONCATENATE(X10,\" - \",Y10)","v":"00 - (All)"},null,"01","00","(All)",{"$f":"CONCATENATE(AB10,AC10)","v":"0100"},{"$f":"CONCATENATE(AB10,AC10,\" - \",AD10)","v":"0100 - (All)"}]
[null,null,null,"02-Febrero",null,"01","CUSCO SUR",{"$f":"CONCATENATE(F11,\" - \",G11)","v":"01 - CUSCO SUR"},null,"00","99","(All)","0099 - (All)",1,"000002289","HOSPITAL DE APOYO DEPARTAMENTAL CUSCO","00","00","01","01",{"$f":"CONCATENATE(Q11,R11)","v":"0000"},{"$f":"CONCATENATE(O11,\" - \",P11)","v":"000002289 - HOSPITAL DE APOYO DEPARTAMENTAL CUSCO"},null,"01","CUSCO",{"$f":"CONCATENATE(X11,\" - \",Y11)","v":"01 - CUSCO"},null,"01","01","CUSCO",{"$f":"CONCATENATE(AB11,AC11)","v":"0101"},{"$f":"CONCATENATE(AB11,AC11,\" - \",AD11)","v":"0101 - CUSCO"}]
[null,null,null,"03-Marzo",null,"02","CUSCO NORTE","02 - CUSCO NORTE",null,"01","00","NO PERTENECE A NINGUNA MICRORED                                                                     ","0100 - NO PERTENECE A NINGUNA MICRORED                                                                     ",{"$f":"+N11+1","v":2},"000002305","ANTONIO LORENA DEL CUSCO","00","00","01","06","0000","000002305 - ANTONIO LORENA DEL CUSCO",null,"02","ACOMAYO",{"$f":"CONCATENATE(X12,\" - \",Y12)","v":"02 - ACOMAYO"},null,"01","02","CCORCA","0102","0102 - CCORCA"]
[null,null,null,"04-Abril",null,"03","LA CONVENCION","03 - LA CONVENCION",null,"01","16","CUSCO                                                                                               ","0116 - CUSCO                                                                                               ",{"$f":"+N12+1","v":3},"999999999","(All)","00","99",null,null,"0099","999999999 - (All)",null,"03","ANTA","03 - ANTA",null,"01","03","POROY","0103","0103 - POROY"]
[null,null,null,"05-Mayo",null,"04","CANAS-CANCHIS-ESPINAR","04 - CANAS-CANCHIS-ESPINAR",null,"01","03","PARURO                                                                                              ","0103 - PARURO                                                                                              ",null,"000025210","TUPAC AMARU","01","00","01","05","0100","000025210 - TUPAC AMARU",null,"04","CALCA","04 - CALCA",null,"01","04","SAN JERONIMO","0104","0104 - SAN JERONIMO"]
[null,null,null,"06-Junio",null,"05","KIMBIRI PICHARI","05 - KIMBIRI PICHARI",null,"01","06","PAUCARTAMBO                                                                                         ","0106 - PAUCARTAMBO                                                                                         ",{"$f":"+N13+1","v":4},"000000000","(All)","01","03",null,null,"0103","000000000 - (All)",null,"05","CANAS","05 - CANAS",null,"01","05","SAN SEBASTIAN","0105","0105 - SAN SEBASTIAN"]
[null,null,null,"07-Julio",null,"06","CHUMBIVILCAS","06 - CHUMBIVILCAS",null,"01","12","URCOS                                                                                               ","0112 - URCOS                                                                                               ",null,"000002499","PARURO","01","03","10","01","0103","000002499 - PARURO",null,"06","CANCHIS","06 - CANCHIS",null,"01","06","SANTIAGO","0106","0106 - SANTIAGO"]
[null,null,null,"08-Agosto",null,"99","(All)","99 - (All)",null,"01","13","ACOMAYO                                                                                             ","0113 - ACOMAYO                                                                                             ",{"$f":"+N15+1","v":5},"000002500","ACCHA","01","03","10","02","0103","000002500 - ACCHA",null,"07","CHUMBIVILCAS","07 - CHUMBIVILCAS",null,"01","07","SAYLLA","0107","0107 - SAYLLA"]
[null,null,null,"09-Setiembre",null,null,null,null,null,"01","15","OCONGATE                                                                                            ","0115 - OCONGATE                                                                                            ",6,"000002501","CCAPI","01","03","10","03","0103","000002501 - CCAPI",null,"08","ESPINAR","08 - ESPINAR",null,"01","08","WANCHAQ","0108","0108 - WANCHAQ"]
[null,null,null,"10-Octubre",null,null,null,null,null,"01","99","(All)","0199 - (All)",7,"000002502","CCOYABAMBA","01","03","10","03","0103","000002502 - CCOYABAMBA",null,"09","LA CONVENCION","09 - LA CONVENCION",null,"02","00","(All)","0200","0200 - (All)"]
[null,null,null,"11-Noviembre",null,"EJECUTORAS",null,null,null,"02","01","BELEMPAMPA                                                                                          ","0201 - BELEMPAMPA                                                                                          ",8,"000002503","COLCHA","01","03","10","04","0103","000002503 - COLCHA",null,"10","PARURO","10 - PARURO",null,"02","01","ACOMAYO","0201","0201 - ACOMAYO"]
[null,null,null,"12-Diciembre",null,"COD_RED","DESC_RED","CONCATENAR",null,"02","02","WANCHAQ                                                                                             ","0202 - WANCHAQ                                                                                             ",9,"000006978","CCOCHIRIHUAY","01","03","10","04","0103","000006978 - CCOCHIRIHUAY",null,"11","PAUCARTAMBO","11 - PAUCARTAMBO",null,"02","02","ACOPIA","0202","0202 - ACOPIA"]
[null,null,null,null,null,"01","HOSPITAL REGIONAL CUSCO",{"$f":"CONCATENATE(F22,\" - \",G22)","v":"01 - HOSPITAL REGIONAL CUSCO"},null,"02","03","ANTA                                                                                                ","0203 - ANTA                                                                                                ",10,"000002504","HUANOQUITE","01","03","10","05","0103","000002504 - HUANOQUITE",null,"12","QUISPICANCHI","12 - QUISPICANCHI",null,"02","03","ACOS","0203","0203 - ACOS"]
[null,null,null,null,null,"02","HOSPITAL ANTONIO LORENA",{"$f":"CONCATENATE(F23,\" - \",G23)","v":"02 - HOSPITAL ANTONIO LORENA"},null,"02","04","LIMATAMBO                                                                                           ","0204 - LIMATAMBO                                                                                           ",11,"000002505","OMACHA","01","03","10","06","0103","000002505 - OMACHA",null,"13","URUBAMBA","13 - URUBAMBA",null,"02","04","MOSOC LLACTA","0204","0204 - MOSOC LLACTA"]
[null,null,null,null,null,"03","CUSCO NORTE","03 - CUSCO NORTE",null,"02","05","PISAC                                                                                               ","0205 - PISAC                                                                                               ",12,"000002506","ANTAPALLPA","01","03","10","06","0103","000002506 - ANTAPALLPA",null,null,null,null,null,"02","05","POMACANCHI","0205","0205 - POMACANCHI"]
[null,null,null,null,null,"04","CUSCO SUR","04 - CUSCO SUR",null,"02","06","CALCA                                                                                               ","0206 - CALCA                                                                                               ",13,"000007147","PUESTO DE SALUD DE HUASQUILLAY","01","03","10","06","0103","000007147 - PUESTO DE SALUD DE HUASQUILLAY",null,null,null,null,null,"02","06","RONDOCAN","0206","0206 - RONDOCAN"]
[null,null,null,null,null,"05","LA CONVENCION","05 - LA CONVENCION",null,"02","07","URUBAMBA                                                                                            ","0207 - URUBAMBA                                                                                            ",14,"000012924","SAHUA SAHUA","01","03","10","06","0103","000012924 - SAHUA SAHUA",null,null,null,null,null,"02","07","SANGARARA","0207","0207 - SANGARARA"]
[null,null,null,null,null,"06","HOSPITAL QUILLABAMBA","06 - HOSPITAL QUILLABAMBA",null,"02","08","YANATILE                                                                                            ","0208 - YANATILE                                                                                            ",15,"000002507","PACCARECTAMBO","01","03","10","07","0103","000002507 - PACCARECTAMBO",null,null,null,null,null,"03","00","(All)","0300","0300 - (All)"]
[null,null,null,null,null,"07","CANAS CANCHIS ESPINAR","07 - CANAS CANCHIS ESPINAR",null,"02","09","SIETE CUARTONES                                                                                     ","0209 - SIETE CUARTONES                                                                                     ",16,"000002509","YAURISQUE","01","03","10","09","0103","000002509 - YAURISQUE",null,null,null,null,null,"03","01","ANTA","0301","0301 - ANTA"]
[null,null,null,null,null,"08","HOSPITAL SICUANI","08 - HOSPITAL SICUANI",null,"02","99","(All)","0299 - (All)",17,"000000000","(All)","01","06",null,null,"0106","000000000 - (All)",null,null,null,null,null,"03","02","ANCAHUASI","0302","0302 - ANCAHUASI"]
[null,null,null,null,null,"09","HOSPITAL ESPINAR","09 - HOSPITAL ESPINAR",null,"03","00","NO PERTENECE A NINGUNA MICRORED                                                                     ","0300 - NO PERTENECE A NINGUNA MICRORED                                                                     ",null,"000002520","HUANCARANI","01","06","11","05","0106","000002520 - HUANCARANI",null,null,null,null,null,"03","03","CACHIMAYO","0303","0303 - CACHIMAYO"]
[null,null,null,null,null,"10","KIMBIRI PICHARI","10 - KIMBIRI PICHARI",null,"03","01","SANTA ANA                                                                                           ","0301 - SANTA ANA                                                                                           ",{"$f":"+N29+1","v":18},"000002521","PILCOPATA","01","06","11","06","0106","000002521 - PILCOPATA",null,null,null,null,null,"03","04","CHINCHAYPUJIO","0304","0304 - CHINCHAYPUJIO"]
[null,null,null,null,null,"11","CHUMBIVILCAS","11 - CHUMBIVILCAS",null,"03","02","MARANURA                                                                                            ","0302 - MARANURA                                                                                            ",19,"000002522","PATRIA","01","06","11","06","0106","000002522 - PATRIA",null,null,null,null,null,"03","05","HUAROCONDO","0305","0305 - HUAROCONDO"]
[null,null,null,null,null,"99","(ALL)",{"$f":"CONCATENATE(F33,\" - \",G33)","v":"99 - (ALL)"},null,"03","03","QUELLOUNO                                                                                           ","0303 - QUELLOUNO                                                                                           ",20,"000002510","PAUCARTAMBO","01","06","11","01","0106","000002510 - PAUCARTAMBO",null,null,null,null,null,"03","06","LIMATAMBO","0306","0306 - LIMATAMBO"]
[null,null,null,null,null,null,null,null,null,"03","04","KITENI                                                                                              ","0304 - KITENI                                                                                              ",21,"000002511","MOLLOMARCA","01","06","11","01","0106","000002511 - MOLLOMARCA",null,null,null,null,null,"03","07","MOLLEPATA","0307","0307 - MOLLEPATA"]
[null,null,null,null,null,null,null,null,null,"03","05","KAMISEA                                                                                             ","0305 - KAMISEA                                                                                             ",22,"000010077","PAUCARTAMBO -ESSALUD","01","06","11","01","0106","000010077 - PAUCARTAMBO -ESSALUD",null,null,null,null,null,"03","08","PUCYURA","0308","0308 - PUCYURA"]
[null,null,null,null,null,"SECTORES",null,null,null,"03","06","PUCYURA                                                                                             ","0306 - PUCYURA                                                                                             ",23,"000033777","MENTAL COMUNITARIO VIRGEN DEL ROSARIO","01","06","11","01","0106","000033777 - MENTAL COMUNITARIO VIRGEN DEL ROSARIO",null,null,null,null,null,"03","09","ZURITE","0309","0309 - ZURITE"]
[null,null,null,null,null,"COD_SECTOR","DESC_RED","CONCATENAR",null,"03","07","PALMA REAL","0307 - PALMA REAL",24,"000002512","CAICAY","01","06","11","02","0106","000002512 - CAICAY",null,null,null,null,null,"04","00","(All)","0400","0400 - (All)"]
[null,null,null,null,null,"1","GORE",{"$f":"CONCATENATE(F38,\" - \",G38)","v":"1 - GORE"},null,"03","99","(All)","0399 - (All)",25,"000002513","HUASAC","01","06","11","02","0106","000002513 - HUASAC",null,null,null,null,null,"04","01","CALCA","0401","0401 - CALCA"]
[null,null,null,null,null,"2","ESSALUD",{"$f":"CONCATENATE(F39,\" - \",G39)","v":"2 - ESSALUD"},null,"04","00","NO PERTENECE A NINGUNA MICRORED                                                                     ","0400 - NO PERTENECE A NINGUNA MICRORED                                                                     ",26,"000002514","CHALLABAMBA","01","06","11","03","0106","000002514 - CHALLABAMBA",null,null,null,null,null,"04","02","COYA","0402","0402 - COYA"]
[null,null,null,null,null,"3","OTROS",{"$f":"CONCATENATE(F40,\" - \",G40)","v":"3 - OTROS"},null,"04","01","YANAOCA                                                                                             ","0401 - YANAOCA                                                                                             ",27,"000002516","COLQUEPATA","01","06","11","04","0106","000002516 - COLQUEPATA",null,null,null,null,null,"04","03","LAMAY","0403","0403 - LAMAY"]
[null,null,null,null,null,"99","(ALL)",{"$f":"CONCATENATE(F41,\" - \",G41)","v":"99 - (ALL)"},null,"04","02","EL DESCANSO                                                                                         ","0402 - EL DESCANSO                                                                                         ",28,"000002517","PICHIHUA COLQUEPATA","01","06","11","04","0106","000002517 - PICHIHUA COLQUEPATA",null,null,null,null,null,"04","04","LARES","0404","0404 - LARES"]
[null,null,null,null,null,null,null,null,null,"04","03","COMBAPATA                                                                                           ","0403 - COMBAPATA                                                                                           ",29,"000002518","VIZCOCHONI","01","06","11","04","0106","000002518 - VIZCOCHONI",null,null,null,null,null,"04","05","PISAC","0405","0405 - PISAC"]
[null,null,null,null,null,null,null,null,null,"04","04","TECHO OBRERO                                                                                        ","0404 - TECHO OBRERO                                                                                        ",30,"000002519","AYRE","01","06","11","04","0106","000002519 - AYRE",null,null,null,null,null,"04","06","SAN SALVADOR","0406","0406 - SAN SALVADOR"]
[null,null,null,null,null,null,null,null,null,"04","05","PAMPAPHALLA                                                                                         ","0405 - PAMPAPHALLA                                                                                         ",31,"000006979","TOCRA","01","06","11","04","0106","000006979 - TOCRA",null,null,null,null,null,"04","07","TARAY","0407","0407 - TARAY"]
[null,null,null,null,null,null,null,null,null,"04","06","YAURI                                                                                               ","0406 - YAURI                                                                                               ",32,"000000000","(All)","01","12",null,null,"0112","000000000 - (All)",null,null,null,null,null,"04","08","YANATILE","0408","0408 - YANATILE"]
[null,null,null,null,null,null,null,null,null,"04","99","(All)","0499 - (All)",null,"000002523","URCOS","01","12","12","01","0112","000002523 - URCOS",null,null,null,null,null,"05","00","(All)","0500","0500 - (All)"]
[null,null,null,null,null,null,null,null,null,"05","00","NO PERTENECE A NINGUNA MICRORED                                                                     ","0500 - NO PERTENECE A NINGUNA MICRORED                                                                     ",{"$f":"+N45+1","v":33},"000026385","ESSALUD-URCOS","01","12","12","01","0112","000026385 - ESSALUD-URCOS",null,null,null,null,null,"05","01","YANAOCA","0501","0501 - YANAOCA"]
[null,null,null,null,null,null,null,null,null,"05","01","KIMBIRI                                                                                             ","0501 - KIMBIRI                                                                                             ",34,"000002525","ANDAHUAYLILLAS","01","12","12","02","0112","000002525 - ANDAHUAYLILLAS",null,null,null,null,null,"05","02","CHECCA","0502","0502 - CHECCA"]
[null,null,null,null,null,null,null,null,null,"05","02","PICHARI                                                                                             ","0502 - PICHARI                                                                                             ",35,"000008911","HUARA HUARA","01","12","12","05","0112","000008911 - HUARA HUARA",null,null,null,null,null,"05","03","KUNTURKANKI","0503","0503 - KUNTURKANKI"]
[null,null,null,null,null,null,null,null,null,"05","99","(All)","0599 - (All)",36,"000002530","CUSIPATA","01","12","12","06","0112","000002530 - CUSIPATA",null,null,null,null,null,"05","04","LANGUI","0504","0504 - LANGUI"]
[null,null,null,null,null,null,null,null,null,"06","00","NO PERTENECE A NINGUNA MICRORED                                                                     ","0600 - NO PERTENECE A NINGUNA MICRORED                                                                     ",37,"000006980","CHILLIHUANI","01","12","12","06","0112","000006980 - CHILLIHUANI",null,null,null,null,null,"05","05","LAYO","0505","0505 - LAYO"]
[null,null,null,null,null,null,null,null,null,"06","09","SANTO TOMAS                                                                                         ","0609 - SANTO TOMAS                                                                                         ",38,"000002532","HUARO","01","12","12","07","0112","000002532 - HUARO",null,null,null,null,null,"05","06","PAMPAMARCA","0506","0506 - PAMPAMARCA"]
[null,null,null,null,null,null,null,null,null,"06","01","LIVITACA                                                                                            ","0601 - LIVITACA                                                                                            ",39,"000002533","URPAY","01","12","12","07","0112","000002533 - URPAY",null,null,null,null,null,"05","07","QUEHUE","0507","0507 - QUEHUE"]
[null,null,null,null,null,null,null,null,null,"06","99","(All)","0699 - (All)",40,"000011747","POSTA MEDICA POLICIAL PUCUTO","01","12","12","07","0112","000011747 - POSTA MEDICA POLICIAL PUCUTO",null,null,null,null,null,"05","08","TUPAC AMARU","0508","0508 - TUPAC AMARU"]
[null,null,null,null,null,null,null,null,null,"99","99","(All)","9999 - (All)",41,"000030708","MENTAL COMUNITARIO HUARO","01","12","12","07","0112","000030708 - MENTAL COMUNITARIO HUARO",null,null,null,null,null,"06","00","(All)","0600","0600 - (All)"]
[null,null,null,null,null,null,null,null,null,null,null,null,null,42,"000002534","LUCRE","01","12","12","08","0112","000002534 - LUCRE",null,null,null,null,null,"06","01","SICUANI","0601","0601 - SICUANI"]
[null,null,null,null,null,null,null,null,null,null,null,null,null,43,"000002537","OROPESA","01","12","12","11","0112","000002537 - OROPESA",null,null,null,null,null,"06","02","CHECACUPE","0602","0602 - CHECACUPE"]
[null,null,null,null,null,null,null,null,null,null,null,null,null,44,"000002538","QUIQUIJANA","01","12","12","12","0112","000002538 - QUIQUIJANA",null,null,null,null,null,"06","03","COMBAPATA","0603","0603 - COMBAPATA"]
[null,null,null,null,null,null,null,null,null,null,null,null,null,45,"000002539","CCOLCA","01","12","12","12","0112","000002539 - CCOLCA",null,null,null,null,null,"06","04","MARANGANI","0604","0604 - MARANGANI"]
[null,null,null,null,null,null,null,null,null,null,null,null,null,46,"000000000","(All)","01","13",null,null,"0113","000000000 - (All)",null,null,null,null,null,"06","05","PITUMARCA","0605","0605 - PITUMARCA"]
[null,null,null,null,null,null,null,null,null,null,null,null,null,null,"000002317","ACOMAYO","01","13","02","01","0113","000002317 - ACOMAYO",null,null,null,null,null,"06","06","SAN PABLO","0606","0606 - SAN PABLO"]
[null,null,null,null,null,null,null,null,null,null,null,null,null,{"$f":"+N60+1","v":47},"000010076","ACOMAYO - ESSALUD","01","13","02","01","0113","000010076 - ACOMAYO - ESSALUD",null,null,null,null,null,"06","07","SAN PEDRO","0607","0607 - SAN PEDRO"]
[null,null,null,null,null,null,null,null,null,null,null,null,null,48,"000002318","ACOPIA","01","13","02","02","0113","000002318 - ACOPIA",null,null,null,null,null,"06","08","TINTA","0608","0608 - TINTA"]
[null,null,null,null,null,null,null,null,null,null,null,null,null,49,"000002319","ACOS","01","13","02","03","0113","000002319 - ACOS",null,null,null,null,null,"07","00","(All)","0700","0700 - (All)"]
[null,null,null,null,null,null,null,null,null,null,null,null,null,50,"000002321","POMACANCHI","01","13","02","05","0113","000002321 - POMACANCHI",null,null,null,null,null,"07","01","SANTO TOMAS","0701","0701 - SANTO TOMAS"]
[null,null,null,null,null,null,null,null,null,null,null,null,null,51,"000002322","SAN JUAN DE POMACANCHI","01","13","02","05","0113","000002322 - SAN JUAN DE POMACANCHI",null,null,null,null,null,"07","02","CAPACMARCA","0702","0702 - CAPACMARCA"]
[null,null,null,null,null,null,null,null,null,null,null,null,null,52,"000012926","SANTA LUCIA","01","13","02","05","0113","000012926 - SANTA LUCIA",null,null,null,null,null,"07","03","CHAMACA","0703","0703 - CHAMACA"]
[null,null,null,null,null,null,null,null,null,null,null,null,null,53,"000002324","PUESTO DE SALUD SANGARARA","01","13","02","07","0113","000002324 - PUESTO DE SALUD SANGARARA",null,null,null,null,null,"07","04","COLQUEMARCA","0704","0704 - COLQUEMARCA"]
[null,null,null,null,null,null,null,null,null,null,null,null,null,54,"000002325","PUESTO DE SALUD MARCACONGA","01","13","02","07","0113","000002325 - PUESTO DE SALUD MARCACONGA",null,null,null,null,null,"07","05","LIVITACA","0705","0705 - LIVITACA"]
[null,null,null,null,null,null,null,null,null,null,null,null,null,55,"000002508","PILLPINTO","01","13","10","08","0113","000002508 - PILLPINTO",null,null,null,null,null,"07","06","LLUSCO","0706","0706 - LLUSCO"]
[null,null,null,null,null,null,null,null,null,null,null,null,null,56,"000000000","(All)","01","15",null,null,"0115","000000000 - (All)",null,null,null,null,null,"07","07","QUIÑOTA","0707","0707 - QUIÑOTA"]
[null,null,null,null,null,null,null,null,null,null,null,null,null,null,"000002526","QUINCE MIL","01","15","12","03","0115","000002526 - QUINCE MIL",null,null,null,null,null,"07","08","VELILLE","0708","0708 - VELILLE"]
[null,null,null,null,null,null,null,null,null,null,null,null,null,{"$f":"+N71+1","v":57},"000002527","CCARHUAYO","01","15","12","04","0115","000002527 - CCARHUAYO",null,null,null,null,null,"08","00","(All)","0800","0800 - (All)"]
[null,null,null,null,null,null,null,null,null,null,null,null,null,58,"000002524","PAMPACAMARA","01","15","12","05","0115","000002524 - PAMPACAMARA",null,null,null,null,null,"08","01","ESPINAR","0801","0801 - ESPINAR"]
[null,null,null,null,null,null,null,null,null,null,null,null,null,59,"000002528","CCATCCA","01","15","12","05","0115","000002528 - CCATCCA",null,null,null,null,null,"08","02","CONDOROMA",{"$f":"CONCATENATE(AB75,AC75)","v":"0802"},{"$f":"CONCATENATE(AB75,AC75,\" - \",AD75)","v":"0802 - CONDOROMA"}]
[null,null,null,null,null,null,null,null,null,null,null,null,null,60,"000002529","KCAURY","01","15","12","05","0115","000002529 - KCAURY",null,null,null,null,null,"08","03","COPORAQUE","0803","0803 - COPORAQUE"]
[null,null,null,null,null,null,null,null,null,null,null,null,null,{"$f":"+N76+1","v":61},"000012931","CHICHINA","01","15","12","05","0115","000012931 - CHICHINA",null,null,null,null,null,"08","04","OCORURO","0804","0804 - OCORURO"]
[null,null,null,null,null,null,null,null,null,null,null,null,null,62,"000016335","CCAPANA","01","15","12","05","0115","000016335 - CCAPANA",null,null,null,null,null,"08","05","PALLPATA","0805","0805 - PALLPATA"]
[null,null,null,null,null,null,null,null,null,null,null,null,null,63,"000002535","MARCAPATA","01","15","12","09","0115","000002535 - MARCAPATA",null,null,null,null,null,"08","06","PICHIGUA","0806","0806 - PICHIGUA"]
[null,null,null,null,null,null,null,null,null,null,null,null,null,64,"000007110","INCACANCHA","01","15","12","09",{"$f":"CONCATENATE(Q80,R80)","v":"0115"},{"$f":"CONCATENATE(O80,\" - \",P80)","v":"000007110 - INCACANCHA"},null,null,null,null,null,"08","07","SUYCKUTAMBO","0807","0807 - SUYCKUTAMBO"]
[null,null,null,null,null,null,null,null,null,null,null,null,null,65,"000002536","OCONGATE","01","15","12","10","0115","000002536 - OCONGATE",null,null,null,null,null,"08","08","ALTO PICHIGUA","0808","0808 - ALTO PICHIGUA"]
[null,null,null,null,null,null,null,null,null,null,null,null,null,66,"000006977","TINKI","01","15","12","10","0115","000006977 - TINKI",null,null,null,null,null,"09","00","(All)","0900","0900 - (All)"]
[null,null,null,null,null,null,null,null,null,null,null,null,null,67,"000000000","(All)","01","16",null,null,"0116","000000000 - (All)",null,null,null,null,null,"09","01","SANTA ANA","0901","0901 - SANTA ANA"]
[null,null,null,null,null,null,null,null,null,null,null,null,null,null,"000002300","SAN JERONIMO","01","16","01","04","0116","000002300 - SAN JERONIMO",null,null,null,null,null,"09","02","ECHARATE","0902","0902 - ECHARATE"]
[null,null,null,null,null,null,null,null,null,null,null,null,null,{"$f":"+N83+1","v":68},"000007699","CONCHACALLE","01","16","01","04","0116","000007699 - CONCHACALLE",null,null,null,null,null,"09","03","HUAYOPATA","0903","0903 - HUAYOPATA"]
[null,null,null,null,null,null,null,null,null,null,null,null,null,69,"000018926","ESTABLECIMIENTO PENITENCIARIO CUSCO VARONES","01","16","01","04","0116","000018926 - ESTABLECIMIENTO PENITENCIARIO CUSCO VARONES",null,null,null,null,null,"09","04","MARANURA","0904","0904 - MARANURA"]
[null,null,null,null,null,null,null,null,null,null,null,null,null,70,"000021187","ESTABLECIMIENTO PENITENCIARIO CUSCO MUJERES","01","16","01","04","0116","000021187 - ESTABLECIMIENTO PENITENCIARIO CUSCO MUJERES",null,null,null,null,null,"09","05","OCOBAMBA","0905","0905 - OCOBAMBA"]
[null,null,null,null,null,null,null,null,null,null,null,null,null,71,"000030727","PATRÓN SAN SEBASTIAN","01","16","01","04","0116","000030727 - PATRÓN SAN SEBASTIAN",null,null,null,null,null,"09","06","QUELLOUNO","0906","0906 - QUELLOUNO"]
[null,null,null,null,null,null,null,null,null,null,null,null,null,72,"000002301","SAN SEBASTIAN","01","16","01","05","0116","000002301 - SAN SEBASTIAN",null,null,null,null,null,"09","07","KIMBIRI","0907","0907 - KIMBIRI"]
[null,null,null,null,null,null,null,null,null,null,null,null,null,73,"000002303","SANTA ROSA","01","16","01","05","0116","000002303 - SANTA ROSA",null,null,null,null,null,"09","08","SANTA TERESA","0908","0908 - SANTA TERESA"]
[null,null,null,null,null,null,null,null,null,null,null,null,null,74,"000010065","SAN SEBASTIAN ESSALUD","01","16","01","05","0116","000010065 - SAN SEBASTIAN ESSALUD",null,null,null,null,null,"09","09","VILCABAMBA","0909","0909 - VILCABAMBA"]
[null,null,null,null,null,null,null,null,null,null,null,null,null,75,"000011743","POLICIAL \"SANTA ROSA\"  CUSCO","01","16","01","05","0116","000011743 - POLICIAL \"SANTA ROSA\"  CUSCO",null,null,null,null,null,"09","10","PICHARI","0910","0910 - PICHARI"]
[null,null,null,null,null,null,null,null,null,null,null,null,null,76,"000026181","MENTAL SAN SEBASTIAN","01","16","01","05","0116","000026181 - MENTAL SAN SEBASTIAN",null,null,null,null,null,"09","11","INKAWASI                                ","0911","0911 - INKAWASI                                "]
[null,null,null,null,null,null,null,null,null,null,null,null,null,77,"000002314","SAYLLA","01","16","01","07","0116","000002314 - SAYLLA",null,null,null,null,null,"09","12","VILLA VIRGEN","0912","0912 - VILLA VIRGEN"]
[null,null,null,null,null,null,null,null,null,null,null,null,null,78,"000002323","RONDOCAN","01","16","02","06","0116","000002323 - RONDOCAN",null,null,null,null,null,"09","13","VILLA KINTIARINA","0913","0913 - VILLA KINTIARINA"]
[null,null,null,null,null,null,null,null,null,null,null,null,null,79,"999999999","(All)","01","99",null,null,"0199","999999999 - (All)",null,null,null,null,null,"09","14","MEGANTONI","0914","0914 - MEGANTONI"]
[null,null,null,null,null,null,null,null,null,null,null,null,null,null,"000000000","(All)","02","01",null,null,"0201","000000000 - (All)",null,null,null,null,null,"09","15","KUMPIRUSHIATO","0915","0915 - KUMPIRUSHIATO"]
[null,null,null,null,null,null,null,null,null,null,null,null,null,null,"000002292","INDEPENDENCIA","02","01","01","01","0201","000002292 - INDEPENDENCIA",null,null,null,null,null,"09","16","CIELO PUNCO","0916","0916 - CIELO PUNCO"]
[null,null,null,null,null,null,null,null,null,null,null,null,null,{"$f":"+N96+1","v":80},"000002297","CCORCCA","02","01","01","02","0201","000002297 - CCORCCA",null,null,null,null,null,"09","17","MANITEA","0917","0917 - MANITEA"]
[null,null,null,null,null,null,null,null,null,null,null,null,null,81,"000002306","BELEMPAMPA","02","01","01","06","0201","000002306 - BELEMPAMPA",null,null,null,null,null,"09","18","UNION ASHANINKA","0918","0918 - UNION ASHANINKA"]
[null,null,null,null,null,null,null,null,null,null,null,null,null,82,"000002308","ZARZUELA ALTA","02","01","01","06","0201","000002308 - ZARZUELA ALTA",null,null,null,null,null,"09","00","(All)","0900","0900 - (All)"]
[null,null,null,null,null,null,null,null,null,null,null,null,null,83,"000002309","DIGNIDAD NACIONAL","02","01","01","06","0201","000002309 - DIGNIDAD NACIONAL",null,null,null,null,null,"10","01","PARURO","1001","1001 - PARURO"]
[null,null,null,null,null,null,null,null,null,null,null,null,null,84,"000002313","OCCOPATA","02","01","01","06","0201","000002313 - OCCOPATA",null,null,null,null,null,"10","02","ACCHA","1002","1002 - ACCHA"]
[null,null,null,null,null,null,null,null,null,null,null,null,null,85,"000010920","QUINTA BRIGADA DE MONTAÑA","02","01","01","06","0201","000010920 - QUINTA BRIGADA DE MONTAÑA",null,null,null,null,null,"10","03","CCAPI","1003","1003 - CCAPI"]
[null,null,null,null,null,null,null,null,null,null,null,null,null,86,"000026182","MENTAL SANTIAGO","02","01","01","06","0201","000026182 - MENTAL SANTIAGO",null,null,null,null,null,"10","04","COLCHA","1004","1004 - COLCHA"]
[null,null,null,null,null,null,null,null,null,null,null,null,null,87,"000034933","SANTIAGO ESSALUD","02","01","01","06","0201","000034933 - SANTIAGO ESSALUD",null,null,null,null,null,"10","05","HUANOQUITE","1005","1005 - HUANOQUITE"]
[null,null,null,null,null,null,null,null,null,null,null,null,null,88,"000023721","EJERCITO-PERUANO 5TA BM","02","01","01","06","0201","000023721 - EJERCITO-PERUANO 5TA BM",null,null,null,null,null,"10","06","OMACHA","1006","1006 - OMACHA"]
[null,null,null,null,null,null,null,null,null,null,null,null,null,null,"000000000","(All)","02","02",null,null,"0202","000000000 - (All)",null,null,null,null,null,"10","07","PACCARITAMBO","1007","1007 - PACCARITAMBO"]
[null,null,null,null,null,null,null,null,null,null,null,null,null,{"$f":"+N107+1","v":89},"000034419","MENTAL COMUNITARIO CUSCO","02","02","01","01","0202","000034419 - MENTAL COMUNITARIO CUSCO",null,null,null,null,null,"10","08","PILLPINTO","1008","1008 - PILLPINTO"]
[null,null,null,null,null,null,null,null,null,null,null,null,null,90,"000002302","CCORAO","02","02","01","05","0202","000002302 - CCORAO",null,null,null,null,null,"10","09","YAURISQUE","1009","1009 - YAURISQUE"]
[null,null,null,null,null,null,null,null,null,null,null,null,null,91,"000002307","MANCO CAPAC","02","02","01","06","0202","000002307 - MANCO CAPAC",null,null,null,null,null,"11","00","(All)","1100","1100 - (All)"]
[null,null,null,null,null,null,null,null,null,null,null,null,null,92,"000002310","CHOCCO","02","02","01","06","0202","000002310 - CHOCCO",null,null,null,null,null,"11","01","PAUCARTAMBO","1101","1101 - PAUCARTAMBO"]
[null,null,null,null,null,null,null,null,null,null,null,null,null,93,"000002315","WANCHAQ","02","02","01","08","0202","000002315 - WANCHAQ",null,null,null,null,null,"11","02","CAICAY","1102","1102 - CAICAY"]
[null,null,null,null,null,null,null,null,null,null,null,null,null,94,"000002316","TTIO","02","02","01","08","0202","000002316 - TTIO",null,null,null,null,null,"11","03","CHALLABAMBA","1103","1103 - CHALLABAMBA"]
[null,null,null,null,null,null,null,null,null,null,null,null,null,95,"000010041","ADOLFO GUEVARA VELASCO","02","02","01","08","0202","000010041 - ADOLFO GUEVARA VELASCO",null,null,null,null,null,"11","04","COLQUEPATA","1104","1104 - COLQUEPATA"]
[null,null,null,null,null,null,null,null,null,null,null,null,null,96,"000026183","METROPOLITANO","02","02","01","08","0202","000026183 - METROPOLITANO",null,null,null,null,null,"11","05","HUANCARANI","1105","1105 - HUANCARANI"]
[null,null,null,null,null,null,null,null,null,null,null,null,null,null,"000030730","PATRON SANTIAGO","02","02","01","08","0202","000030730 - PATRON SANTIAGO",null,null,null,null,null,"11","06","KOSÑIPATA","1106","1106 - KOSÑIPATA"]
[null,null,null,null,null,null,null,null,null,null,null,null,null,{"$f":"+N116+1","v":97},"000000000","(All)","02","03",null,null,"0203","000000000 - (All)",null,null,null,null,null,"12","00","(All)","1200","1200 - (All)"]
[null,null,null,null,null,null,null,null,null,null,null,null,null,98,"000002326","ANTA","02","03","03","01","0203","000002326 - ANTA",null,null,null,null,null,"12","01","URCOS","1201","1201 - URCOS"]
[null,null,null,null,null,null,null,null,null,null,null,null,null,99,"000002328","COMPONE","02","03","03","01","0203","000002328 - COMPONE",null,null,null,null,null,"12","02","ANDAHUAYLILLAS","1202","1202 - ANDAHUAYLILLAS"]
[null,null,null,null,null,null,null,null,null,null,null,null,null,100,"000002329","CONCHACALLA","02","03","03","01","0203","000002329 - CONCHACALLA",null,null,null,null,null,"12","03","CAMANTI","1203","1203 - CAMANTI"]
[null,null,null,null,null,null,null,null,null,null,null,null,null,101,"000027790","MENTAL COMUNITARIO ANTA","02","03","03","01","0203","000027790 - MENTAL COMUNITARIO ANTA",null,null,null,null,null,"12","04","CCARHUAYO","1204","1204 - CCARHUAYO"]
[null,null,null,null,null,null,null,null,null,null,null,null,null,102,"000029514","ESSALUD ANTA","02","03","03","01","0203","000029514 - ESSALUD ANTA",null,null,null,null,null,"12","05","CCATCA","1205","1205 - CCATCA"]
[null,null,null,null,null,null,null,null,null,null,null,null,null,103,"000002330","ANCAHUASI","02","03","03","02","0203","000002330 - ANCAHUASI",null,null,null,null,null,"12","06","CUSIPATA","1206","1206 - CUSIPATA"]
[null,null,null,null,null,null,null,null,null,null,null,null,null,104,"000002331","CACHIMAYO","02","03","03","03","0203","000002331 - CACHIMAYO",null,null,null,null,null,"12","07","HUARO","1207","1207 - HUARO"]
[null,null,null,null,null,null,null,null,null,null,null,null,null,105,"000006972","PANTIPATA","02","03","03","04","0203","000006972 - PANTIPATA",null,null,null,null,null,"12","08","LUCRE","1208","1208 - LUCRE"]
[null,null,null,null,null,null,null,null,null,null,null,null,null,106,"000036240","CHINCHAYPUJIO","02","03","03","04","0203","000036240 - CHINCHAYPUJIO",null,null,null,null,null,"12","09","MARCAPATA","1209","1209 - MARCAPATA"]
[null,null,null,null,null,null,null,null,null,null,null,null,null,107,"000035838","PARCCOTICA","02","03","03","04","0203","000035838 - PARCCOTICA",null,null,null,null,null,"12","10","OCONGATE","1210","1210 - OCONGATE"]
[null,null,null,null,null,null,null,null,null,null,null,null,null,108,"000002333","HUAROCONDO","02","03","03","05","0203","000002333 - HUAROCONDO",null,null,null,null,null,"12","11","OROPESA","1211","1211 - OROPESA"]
[null,null,null,null,null,null,null,null,null,null,null,null,null,109,"000002334","HUAYLLACOCHA","02","03","03","05","0203","000002334 - HUAYLLACOCHA",null,null,null,null,null,"12","12","QUIQUIJANA","1212","1212 - QUIQUIJANA"]
[null,null,null,null,null,null,null,null,null,null,null,null,null,110,"000002339","PUCYURA ANTA","02","03","03","08","0203","000002339 - PUCYURA ANTA",null,null,null,null,null,"13","00","(All)","1300","1300 - (All)"]
[null,null,null,null,null,null,null,null,null,null,null,null,null,null,"000002340","ZURITE","02","03","03","09","0203","000002340 - ZURITE",null,null,null,null,null,"13","01","URUBAMBA","1301","1301 - URUBAMBA"]
[null,null,null,null,null,null,null,null,null,null,null,null,null,{"$f":"+N131+1","v":111},"000002327","CHACAN","02","03","03","01","0203","000002327 - CHACAN",null,null,null,null,null,"13","02","CHINCHERO","1302","1302 - CHINCHERO"]
[null,null,null,null,null,null,null,null,null,null,null,null,null,112,"000000000","(All)","02","04",null,null,"0204","000000000 - (All)",null,null,null,null,null,"13","03","HUAYLLABAMBA","1303","1303 - HUAYLLABAMBA"]
[null,null,null,null,null,null,null,null,null,null,null,null,null,113,"000002336","LIMATAMBO","02","04","03","06","0204","000002336 - LIMATAMBO",null,null,null,null,null,"13","04","MACHUPICCHU","1304","1304 - MACHUPICCHU"]
[null,null,null,null,null,null,null,null,null,null,null,null,null,114,"000002337","PAMPACONGA","02","04","03","06","0204","000002337 - PAMPACONGA",null,null,null,null,null,"13","05","MARAS","1305","1305 - MARAS"]
[null,null,null,null,null,null,null,null,null,null,null,null,null,115,"000010761","URATARI","02","04","03","06","0204","000010761 - URATARI",null,null,null,null,null,"13","06","OLLANTAYTAMBO","1306","1306 - OLLANTAYTAMBO"]
[null,null,null,null,null,null,null,null,null,null,null,null,null,null,"000002338","MOLLEPATA","02","04","03","07","0204","000002338 - MOLLEPATA",null,null,null,null,null,"13","07","YUCAY",{"$f":"CONCATENATE(AB138,AC138)","v":"1307"},"1307 - YUCAY"]
[null,null,null,null,null,null,null,null,null,null,null,null,null,{"$f":"+N137+1","v":116},"000021061","HUAMANPATA","02","04","03","07","0204","000021061 - HUAMANPATA",null,null,null,null,null,"00","00","(All)",{"$f":"CONCATENATE(AB139,AC139)","v":"0000"},"0000 - (All)"]
[null,null,null,null,null,null,null,null,null,null,null,null,null,117,"000000000","(All)","02","05",null,null,"0205","000000000 - (All)"]
[null,null,null,null,null,null,null,null,null,null,null,null,null,{"$f":"+N140+1","v":118},"000002343","COYA","02","05","04","02","0205","000002343 - COYA"]
[null,null,null,null,null,null,null,null,null,null,null,null,null,119,"000002344","LAMAY","02","05","04","03","0205","000002344 - LAMAY"]
[null,null,null,null,null,null,null,null,null,null,null,null,null,120,"000006975","SAYLLAFAYA","02","05","04","03","0205","000006975 - SAYLLAFAYA"]
[null,null,null,null,null,null,null,null,null,null,null,null,null,121,"000007145","HUAMA","02","05","04","03","0205","000007145 - HUAMA"]
[null,null,null,null,null,null,null,null,null,null,null,null,null,122,"000007146","POQUES","02","05","04","03","0205","000007146 - POQUES"]
[null,null,null,null,null,null,null,null,null,null,null,null,null,123,"000036012","HUARQUI","02","05","04","03","0205","000036012 - HUARQUI"]
[null,null,null,null,null,null,null,null,null,null,null,null,null,124,"000002348","PISAC","02","05","04","05","0205","000002348 - PISAC"]
[null,null,null,null,null,null,null,null,null,null,null,null,null,125,"000002349","CUYO CHICO","02","05","04","05","0205","000002349 - CUYO CHICO"]
[null,null,null,null,null,null,null,null,null,null,null,null,null,126,"000002350","CUYO GRANDE","02","05","04","05","0205","000002350 - CUYO GRANDE"]
[null,null,null,null,null,null,null,null,null,null,null,null,null,127,"000002351","QUELLO QUELLO","02","05","04","05",{"$f":"CONCATENATE(Q150,R150)","v":"0205"},{"$f":"CONCATENATE(O150,\" - \",P150)","v":"000002351 - QUELLO QUELLO"}]
[null,null,null,null,null,null,null,null,null,null,null,null,null,128,"000002352","SAN SALVADOR","02","05","04","06","0205","000002352 - SAN SALVADOR"]
[null,null,null,null,null,null,null,null,null,null,null,null,null,129,"000036087","TIRACANCHA","02","05","04","06","0205","000036087 - TIRACANCHA"]
[null,null,null,null,null,null,null,null,null,null,null,null,null,null,"000002353","TARAY","02","05","04","07","0205","000002353 - TARAY"]
[null,null,null,null,null,null,null,null,null,null,null,null,null,{"$f":"+N152+1","v":130},"000002354","HUANCALLE","02","05","04","07","0205","000002354 - HUANCALLE"]
[null,null,null,null,null,null,null,null,null,null,null,null,null,131,"000000000","(All)","02","06",null,null,"0206","000000000 - (All)"]
[null,null,null,null,null,null,null,null,null,null,null,null,null,132,"000002341","CALCA","02","06","04","01","0206","000002341 - CALCA"]
[null,null,null,null,null,null,null,null,null,null,null,null,null,133,"000010069","ESSALUD CALCA","02","06","04","01","0206","000010069 - ESSALUD CALCA"]
[null,null,null,null,null,null,null,null,null,null,null,null,null,134,"000010759","HUARAN","02","06","04","01","0206","000010759 - HUARAN"]
[null,null,null,null,null,null,null,null,null,null,null,null,null,135,"000010762","ACCHA ALTA - PAMPALLACTA","02","06","04","01","0206","000010762 - ACCHA ALTA - PAMPALLACTA"]
[null,null,null,null,null,null,null,null,null,null,null,null,null,136,"000026273","MENTAL COMUNITARIO VIRGEN ASUNTA DE CALCA","02","06","04","01","0206","000026273 - MENTAL COMUNITARIO VIRGEN ASUNTA DE CALCA"]
[null,null,null,null,null,null,null,null,null,null,null,null,null,137,"000002342","AMPARAES","02","06","04","04","0206","000002342 - AMPARAES"]
[null,null,null,null,null,null,null,null,null,null,null,null,null,138,"000002345","CCACHIN","02","06","04","04","0206","000002345 - CCACHIN"]
[null,null,null,null,null,null,null,null,null,null,null,null,null,139,"000002346","CHOQUECANCHA","02","06","04","04","0206","000002346 - CHOQUECANCHA"]
[null,null,null,null,null,null,null,null,null,null,null,null,null,140,"000002347","LARES","02","06","04","04","0206","000002347 - LARES"]
[null,null,null,null,null,null,null,null,null,null,null,null,null,141,"000002361","SUYO","02","06","04","04","0206","000002361 - SUYO"]
[null,null,null,null,null,null,null,null,null,null,null,null,null,142,"000007144","PATABAMBA","02","06","04","07","0206","000007144 - PATABAMBA"]
[null,null,null,null,null,null,null,null,null,null,null,null,null,143,"000002515","PAROBAMBA","02","06","11","03","0206","000002515 - PAROBAMBA"]
[null,null,null,null,null,null,null,null,null,null,null,null,null,144,"000007143","OTOCANI","02","06","11","03","0206","000007143 - OTOCANI"]
[null,null,null,null,null,null,null,null,null,null,null,null,null,145,"000000000","(All)","02","07",null,null,"0207","000000000 - (All)"]
[null,null,null,null,null,null,null,null,null,null,null,null,null,146,"000002540","URUBAMBA","02","07","13","01","0207","000002540 - URUBAMBA"]
[null,null,null,null,null,null,null,null,null,null,null,null,null,147,"000002541","YANAHUARA","02","07","13","01","0207","000002541 - YANAHUARA"]
[null,null,null,null,null,null,null,null,null,null,null,null,null,148,"000010060","CAS URUBAMBA -ESSALUD","02","07","13","01","0207","000010060 - CAS URUBAMBA -ESSALUD"]
[null,null,null,null,null,null,null,null,null,null,null,null,null,149,"000030666","MENTAL COMUNITARIO URUBAMBA","02","07","13","01","0207","000030666 - MENTAL COMUNITARIO URUBAMBA"]
[null,null,null,null,null,null,null,null,null,null,null,null,null,150,"000035851","URUBAMBA - ESSALUD","02","07","13","01","0207","000035851 - URUBAMBA - ESSALUD"]
[null,null,null,null,null,null,null,null,null,null,null,null,null,151,"000002543","CHINCHERO","02","07","13","02","0207","000002543 - CHINCHERO"]
[null,null,null,null,null,null,null,null,null,null,null,null,null,152,"000002544","OCCOTUAN","02","07","13","02","0207","000002544 - OCCOTUAN"]
[null,null,null,null,null,null,null,null,null,null,null,null,null,153,"000002545","HUAYLLABAMBA","02","07","13","03","0207","000002545 - HUAYLLABAMBA"]
[null,null,null,null,null,null,null,null,null,null,null,null,null,154,"000002546","MACHUPICCHU","02","07","13","04","0207","000002546 - MACHUPICCHU"]
[null,null,null,null,null,null,null,null,null,null,null,null,null,155,"000002547","COLLPANI","02","07","13","04","0207","000002547 - COLLPANI"]
[null,null,null,null,null,null,null,null,null,null,null,null,null,156,"000006974","CAMINO INCA HUAYLLABAMBA","02","07","13","04","0207","000006974 - CAMINO INCA HUAYLLABAMBA"]
[null,null,null,null,null,null,null,null,null,null,null,null,null,157,"000010073","MACHU PICCHU - ESSALUD","02","07","13","04","0207","000010073 - MACHU PICCHU - ESSALUD"]
[null,null,null,null,null,null,null,null,null,null,null,null,null,158,"000002548","MARAS","02","07","13","05","0207","000002548 - MARAS"]
[null,null,null,null,null,null,null,null,null,null,null,null,null,159,"000010758","CRUZPATA","02","07","13","05","0207","000010758 - CRUZPATA"]
[null,null,null,null,null,null,null,null,null,null,null,null,null,160,"000002549","OLLANTAYTAMBO","02","07","13","06","0207","000002549 - OLLANTAYTAMBO"]
[null,null,null,null,null,null,null,null,null,null,null,null,null,161,"000002550","CHILLCA","02","07","13","06","0207","000002550 - CHILLCA"]
[null,null,null,null,null,null,null,null,null,null,null,null,null,162,"000010760","PATACANCHA","02","07","13","06","0207","000010760 - PATACANCHA"]
[null,null,null,null,null,null,null,null,null,null,null,null,null,163,"000002551","YUCAY","02","07","13","07","0207","000002551 - YUCAY"]
[null,null,null,null,null,null,null,null,null,null,null,null,null,164,"000000000","(All)","02","08",null,null,"0208","000000000 - (All)"]
[null,null,null,null,null,null,null,null,null,null,null,null,null,165,"000002355","LA QUEBRADA","02","08","04","08","0208","000002355 - LA QUEBRADA"]
[null,null,null,null,null,null,null,null,null,null,null,null,null,166,"000002356","CCORIMAYO","02","08","04","08","0208","000002356 - CCORIMAYO"]
[null,null,null,null,null,null,null,null,null,null,null,null,null,167,"000002357","COLCCA YANATILE","02","08","04","08","0208","000002357 - COLCCA YANATILE"]
[null,null,null,null,null,null,null,null,null,null,null,null,null,168,"000002358","MUYUPAY","02","08","04","08","0208","000002358 - MUYUPAY"]
[null,null,null,null,null,null,null,null,null,null,null,null,null,169,"000002359","PUTUCUSI","02","08","04","08","0208","000002359 - PUTUCUSI"]
[null,null,null,null,null,null,null,null,null,null,null,null,null,170,"000002360","QUESQUENTO","02","08","04","08","0208","000002360 - QUESQUENTO"]
[null,null,null,null,null,null,null,null,null,null,null,null,null,171,"000002362","HUACHIBAMBA","02","08","04","08","0208","000002362 - HUACHIBAMBA"]
[null,null,null,null,null,null,null,null,null,null,null,null,null,172,"000006971","COMBAPATA YANATILE","02","08","04","08","0208","000006971 - COMBAPATA YANATILE"]
[null,null,null,null,null,null,null,null,null,null,null,null,null,173,"000006973","BELLAVISTA","02","08","04","08","0208","000006973 - BELLAVISTA"]
[null,null,null,null,null,null,null,null,null,null,null,null,null,174,"000007142","CHANCAMAYO","02","08","04","08","0208","000007142 - CHANCAMAYO"]
[null,null,null,null,null,null,null,null,null,null,null,null,null,175,"000002464","VERSALLES","02","08","09","05","0208","000002464 - VERSALLES"]
[null,null,null,null,null,null,null,null,null,null,null,null,null,176,"000002467","PUENTE SANTIAGO","02","08","09","06","0208","000002467 - PUENTE SANTIAGO"]
[null,null,null,null,null,null,null,null,null,null,null,null,null,177,"000000000","(All)","02","09",null,null,"0209","000000000 - (All)"]
[null,null,null,null,null,null,null,null,null,null,null,null,null,178,"000002290","SAN PEDRO CUSCO","02","09","01","01","0209","000002290 - SAN PEDRO CUSCO"]
[null,null,null,null,null,null,null,null,null,null,null,null,null,179,"000002291","SIETE CUARTONES","02","09","01","01","0209","000002291 - SIETE CUARTONES"]
[null,null,null,null,null,null,null,null,null,null,null,null,null,180,"000002293","MIRAFLORES","02","09","01","01","0209","000002293 - MIRAFLORES"]
[null,null,null,null,null,null,null,null,null,null,null,null,null,{"$f":"+N204+1","v":181},"000002294","PICCHU LA RINCONADA","02","09","01","01","0209","000002294 - PICCHU LA RINCONADA"]
[null,null,null,null,null,null,null,null,null,null,null,null,null,182,"000002295","BUENA VISTA","02","09","01","01","0209","000002295 - BUENA VISTA"]
[null,null,null,null,null,null,null,null,null,null,null,null,null,183,"000002299","POROY","02","09","01","03","0209","000002299 - POROY"]
[null,null,null,null,null,null,null,null,null,null,null,null,null,184,"999999999","(All)","02","99",null,null,"0299","999999999 - (All)"]
[null,null,null,null,null,null,null,null,null,null,null,null,null,185,"000002421","QUILLABAMBA","03","00","09","01","0300","000002421 - QUILLABAMBA"]
[null,null,null,null,null,null,null,null,null,null,null,null,null,186,"000000000","(All)","03","01",null,null,"0301","000000000 - (All)"]
[null,null,null,null,null,null,null,null,null,null,null,null,null,187,"000002422","HUAYANAY","03","01","09","01","0301","000002422 - HUAYANAY"]
[null,null,null,null,null,null,null,null,null,null,null,null,null,188,"000002423","IDMA","03","01","09","01","0301","000002423 - IDMA"]
[null,null,null,null,null,null,null,null,null,null,null,null,null,189,"000002424","POTRERO","03","01","09","01","0301","000002424 - POTRERO"]
[null,null,null,null,null,null,null,null,null,null,null,null,null,190,"000008910","SANTA ANA","03","01","09","01","0301","000008910 - SANTA ANA"]
[null,null,null,null,null,null,null,null,null,null,null,null,null,191,"000010062","QUILLABAMBA - ESSALUD","03","01","09","01","0301","000010062 - QUILLABAMBA - ESSALUD"]
[null,null,null,null,null,null,null,null,null,null,null,null,null,192,"000011744","POSTA MEDICO POLICIAL LA CONVENCION - QUILLABAMBA","03","01","09","01","0301","000011744 - POSTA MEDICO POLICIAL LA CONVENCION - QUILLABAMBA"]
[null,null,null,null,null,null,null,null,null,null,null,null,null,193,"000015842","PAVAYOC","03","01","09","01",{"$f":"CONCATENATE(Q217,R217)","v":"0301"},{"$f":"CONCATENATE(O217,\" - \",P217)","v":"000015842 - PAVAYOC"}]
[null,null,null,null,null,null,null,null,null,null,null,null,null,194,"000024653","INPE QUILLABAMBA","03","01","09","01","0301","000024653 - INPE QUILLABAMBA"]
[null,null,null,null,null,null,null,null,null,null,null,null,null,195,"000026386","MENTAL QUILLABAMBA","03","01","09","01","0301","000026386 - MENTAL QUILLABAMBA"]
[null,null,null,null,null,null,null,null,null,null,null,null,null,196,"000002425","ECHARATE","03","01","09","02","0301","000002425 - ECHARATE"]
[null,null,null,null,null,null,null,null,null,null,null,null,null,197,"000002430","PAMPA CONCEPCION","03","01","09","02","0301","000002430 - PAMPA CONCEPCION"]
[null,null,null,null,null,null,null,null,null,null,null,null,null,198,"000002446","CHACCO","03","01","09","02","0301","000002446 - CHACCO"]
[null,null,null,null,null,null,null,null,null,null,null,null,null,199,"000002451","CHAHUARES","03","01","09","02","0301","000002451 - CHAHUARES"]
[null,null,null,null,null,null,null,null,null,null,null,null,null,200,"000033273","SAN ISIDRO LABRADOR - ECHARATI","03","01","09","02","0301","000033273 - SAN ISIDRO LABRADOR - ECHARATI"]
[null,null,null,null,null,null,null,null,null,null,null,null,null,201,"000024296","EJERCITO-MIARIA 334","03","01","09","02","0301","000024296 - EJERCITO-MIARIA 334"]
[null,null,null,null,null,null,null,null,null,null,null,null,null,202,"000000000","(All)","03","02",null,null,"0302","000000000 - (All)"]
[null,null,null,null,null,null,null,null,null,null,null,null,null,203,"000002453","HUYRO","03","02","09","03","0302","000002453 - HUYRO"]
[null,null,null,null,null,null,null,null,null,null,null,null,null,204,"000002454","ALFAMAYO","03","02","09","03","0302","000002454 - ALFAMAYO"]
[null,null,null,null,null,null,null,null,null,null,null,null,null,205,"000002455","HUAYOPATA","03","02","09","03","0302","000002455 - HUAYOPATA"]
[null,null,null,null,null,null,null,null,null,null,null,null,null,206,"000002456","AMAYBAMBA","03","02","09","03","0302","000002456 - AMAYBAMBA"]
[null,null,null,null,null,null,null,null,null,null,null,null,null,207,"000002457","SAN PABLO HUAYOPATA","03","02","09","03","0302","000002457 - SAN PABLO HUAYOPATA"]
[null,null,null,null,null,null,null,null,null,null,null,null,null,208,"000010075","CAP HUYRO - ESSALUD","03","02","09","03","0302","000010075 - CAP HUYRO - ESSALUD"]
[null,null,null,null,null,null,null,null,null,null,null,null,null,209,"000002458","MARANURA","03","02","09","04","0302","000002458 - MARANURA"]
[null,null,null,null,null,null,null,null,null,null,null,null,null,210,"000002460","SANTA MARIA","03","02","09","04","0302","000002460 - SANTA MARIA"]
[null,null,null,null,null,null,null,null,null,null,null,null,null,211,"000002461","UCHUMAYO","03","02","09","04","0302","000002461 - UCHUMAYO"]
[null,null,null,null,null,null,null,null,null,null,null,null,null,212,"000002476","SANTA TERESA","03","02","09","08","0302","000002476 - SANTA TERESA"]
[null,null,null,null,null,null,null,null,null,null,null,null,null,213,"000002477","SULLUCUYOC","03","02","09","08","0302","000002477 - SULLUCUYOC"]
[null,null,null,null,null,null,null,null,null,null,null,null,null,214,"000002478","TOTORA","03","02","09","08","0302","000002478 - TOTORA"]
[null,null,null,null,null,null,null,null,null,null,null,null,null,215,"000000000","(All)","03","03",null,null,"0303","000000000 - (All)"]
[null,null,null,null,null,null,null,null,null,null,null,null,null,216,"000002363","TUPAC AMARU QUELLOUNO","03","03","04","08","0303","000002363 - TUPAC AMARU QUELLOUNO"]
[null,null,null,null,null,null,null,null,null,null,null,null,null,217,"000002462","OCCOBAMBA LACONVENCION","03","03","09","05","0303","000002462 - OCCOBAMBA LACONVENCION"]
[null,null,null,null,null,null,null,null,null,null,null,null,null,218,"000002463","CHINGANILLA","03","03","09","05","0303","000002463 - CHINGANILLA"]
[null,null,null,null,null,null,null,null,null,null,null,null,null,219,"000002465","QUELLOUNO","03","03","09","06","0303","000002465 - QUELLOUNO"]
[null,null,null,null,null,null,null,null,null,null,null,null,null,220,"000002466","HUILLCAPAMPA","03","03","09","06","0303","000002466 - HUILLCAPAMPA"]
[null,null,null,null,null,null,null,null,null,null,null,null,null,221,"000002468","SAN MARTIN","03","03","09","06","0303","000002468 - SAN MARTIN"]
[null,null,null,null,null,null,null,null,null,null,null,null,null,222,"000008906","ESTRELLA","03","03","09","06","0303","000008906 - ESTRELLA"]
[null,null,null,null,null,null,null,null,null,null,null,null,null,223,"000008907","MATORIATO","03","03","09","06","0303","000008907 - MATORIATO"]
[null,null,null,null,null,null,null,null,null,null,null,null,null,224,"000008908","CHIRUMBIA","03","03","09","06","0303","000008908 - CHIRUMBIA"]
[null,null,null,null,null,null,null,null,null,null,null,null,null,225,"000008909","CHAPO BOYERO","03","03","09","06","0303","000008909 - CHAPO BOYERO"]
[null,null,null,null,null,null,null,null,null,null,null,null,null,226,"000000000","(All)","03","04",null,null,"0304","000000000 - (All)"]
[null,null,null,null,null,null,null,null,null,null,null,null,null,227,"000002427","KITENI","03","04","09","02","0304","000002427 - KITENI"]
[null,null,null,null,null,null,null,null,null,null,null,null,null,228,"000002431","IVOCHOTE","03","04","09","02","0304","000002431 - IVOCHOTE"]
[null,null,null,null,null,null,null,null,null,null,null,null,null,229,"000002438","PACHIRI","03","04","09","02","0304","000002438 - PACHIRI"]
[null,null,null,null,null,null,null,null,null,null,null,null,null,230,"000002440","PANGOA","03","04","09","02","0304","000002440 - PANGOA"]
[null,null,null,null,null,null,null,null,null,null,null,null,null,231,"000002443","SANIRIATO","03","04","09","02","0304","000002443 - SANIRIATO"]
[null,null,null,null,null,null,null,null,null,null,null,null,null,232,"000002447","KAMANQUIRIATO","03","04","09","02","0304","000002447 - KAMANQUIRIATO"]
[null,null,null,null,null,null,null,null,null,null,null,null,null,233,"000014531","CAP I ECHARATE - KITENI","03","04","09","02","0304","000014531 - CAP I ECHARATE - KITENI"]
[null,null,null,null,null,null,null,null,null,null,null,null,null,234,"000024583","BCT N° 314 - KEPASHIATO","03","04","09","02","0304","000024583 - BCT N° 314 - KEPASHIATO"]
[null,null,null,null,null,null,null,null,null,null,null,null,null,235,"000002489","YUVENI","03","04","09","09","0304","000002489 - YUVENI"]
[null,null,null,null,null,null,null,null,null,null,null,null,null,236,"000002493","SELVA ALEGRE","03","04","09","09","0304","000002493 - SELVA ALEGRE"]
[null,null,null,null,null,null,null,null,null,null,null,null,null,237,"000006976","CHONTABAMBA","03","04","09","09","0304","000006976 - CHONTABAMBA"]
[null,null,null,null,null,null,null,null,null,null,null,null,null,238,"000002432","KEPASHIATO","03","04","09","15","0304","000002432 - KEPASHIATO"]
[null,null,null,null,null,null,null,null,null,null,null,null,null,239,"000002434","MATERIATO","03","04","09","15","0304","000002434 - MATERIATO"]
[null,null,null,null,null,null,null,null,null,null,null,null,null,240,"000013068","TRIO RIO","03","04","09","15","0304","000013068 - TRIO RIO"]
[null,null,null,null,null,null,null,null,null,null,null,null,null,241,"000013069","PUGUIENTIMARI","03","04","09","15","0304","000013069 - PUGUIENTIMARI"]
[null,null,null,null,null,null,null,null,null,null,null,null,null,242,"000000000","(All)","03","05",null,null,"0305","000000000 - (All)"]
[null,null,null,null,null,null,null,null,null,null,null,null,null,243,"000002426","KIRIGUETI","03","05","09","14","0305","000002426 - KIRIGUETI"]
[null,null,null,null,null,null,null,null,null,null,null,null,null,244,"000002428","CHOCORIARI","03","05","09","14","0305","000002428 - CHOCORIARI"]
[null,null,null,null,null,null,null,null,null,null,null,null,null,{"$f":"+N268+1","v":245},"000002435","MIARIA","03","05","09","14","0305","000002435 - MIARIA"]
[null,null,null,null,null,null,null,null,null,null,null,null,null,246,"000002436","NUEVA LUZ","03","05","09","14","0305","000002436 - NUEVA LUZ"]
[null,null,null,null,null,null,null,null,null,null,null,null,null,247,"000002437","NUEVO MUNDO","03","05","09","14","0305","000002437 - NUEVO MUNDO"]
[null,null,null,null,null,null,null,null,null,null,null,null,null,248,"000002441","PUERTO HUALLANA","03","05","09","14","0305","000002441 - PUERTO HUALLANA"]
[null,null,null,null,null,null,null,null,null,null,null,null,null,249,"000002442","PUERTO RICO","03","05","09","14","0305","000002442 - PUERTO RICO"]
[null,null,null,null,null,null,null,null,null,null,null,null,null,250,"000002444","SENSA","03","05","09","14","0305","000002444 - SENSA"]
[null,null,null,null,null,null,null,null,null,null,null,null,null,251,"000002445","TIMPIA","03","05","09","14","0305","000002445 - TIMPIA"]
[null,null,null,null,null,null,null,null,null,null,null,null,null,252,"000002448","KAMISEA","03","05","09","14","0305","000002448 - KAMISEA"]
[null,null,null,null,null,null,null,null,null,null,null,null,null,253,"000002452","SHIVANKORENI","03","05","09","14","0305","000002452 - SHIVANKORENI"]
[null,null,null,null,null,null,null,null,null,null,null,null,null,254,"000013066","MONTETONI","03","05","09","14","0305","000013066 - MONTETONI"]
[null,null,null,null,null,null,null,null,null,null,null,null,null,255,"000013067","TANGOSHIARI","03","05","09","14","0305","000013067 - TANGOSHIARI"]
[null,null,null,null,null,null,null,null,null,null,null,null,null,256,"000015235","NUEVA VIDA","03","05","09","14","0305","000015235 - NUEVA VIDA"]
[null,null,null,null,null,null,null,null,null,null,null,null,null,257,"000015843","CASHIRIARI","03","05","09","14",{"$f":"CONCATENATE(Q281,R281)","v":"0305"},{"$f":"CONCATENATE(O281,\" - \",P281)","v":"000015843 - CASHIRIARI"}]
[null,null,null,null,null,null,null,null,null,null,null,null,null,258,"000015844","CAMANA","03","05","09","14","0305","000015844 - CAMANA"]
[null,null,null,null,null,null,null,null,null,null,null,null,null,259,"000000000","(All)","03","06",null,null,"0306","000000000 - (All)"]
[null,null,null,null,null,null,null,null,null,null,null,null,null,260,"000002480","PUCYURA","03","06","09","09","0306","000002480 - PUCYURA"]
[null,null,null,null,null,null,null,null,null,null,null,null,null,261,"000002484","OYARA","03","06","09","09","0306","000002484 - OYARA"]
[null,null,null,null,null,null,null,null,null,null,null,null,null,262,"000002486","PAMPACONAS","03","06","09","09","0306","000002486 - PAMPACONAS"]
[null,null,null,null,null,null,null,null,null,null,null,null,null,263,"000002490","ARMA","03","06","09","09","0306","000002490 - ARMA"]
[null,null,null,null,null,null,null,null,null,null,null,null,null,264,"000002492","PALTAYBAMBA","03","06","09","09","0306","000002492 - PALTAYBAMBA"]
[null,null,null,null,null,null,null,null,null,null,null,null,null,265,"000002481","CCARCCO","03","06","09","11","0306","000002481 - CCARCCO"]
[null,null,null,null,null,null,null,null,null,null,null,null,null,266,"000002482","INCAHUASI","03","06","09","11","0306","000002482 - INCAHUASI"]
[null,null,null,null,null,null,null,null,null,null,null,null,null,267,"000002485","PACCAYBAMBA","03","06","09","11","0306","000002485 - PACCAYBAMBA"]
[null,null,null,null,null,null,null,null,null,null,null,null,null,268,"000002487","CHOQUETIRA","03","06","09","11","0306","000002487 - CHOQUETIRA"]
[null,null,null,null,null,null,null,null,null,null,null,null,null,269,"000002491","LUCMAHUAYCO","03","06","09","11","0306","000002491 - LUCMAHUAYCO"]
[null,null,null,null,null,null,null,null,null,null,null,null,null,270,"000035520","CHANCAVINE","03","06","09","12","0306","000035520 - CHANCAVINE"]
[null,null,null,null,null,null,null,null,null,null,null,null,null,271,"000000000","(All)","03","07",null,null,"0307","000000000 - (All)"]
[null,null,null,null,null,null,null,null,null,null,null,null,null,272,"000002429","CIRIALO","03","07","09","02","0307","000002429 - CIRIALO"]
[null,null,null,null,null,null,null,null,null,null,null,null,null,273,"000002433","KORIBENI","03","07","09","02","0307","000002433 - KORIBENI"]
[null,null,null,null,null,null,null,null,null,null,null,null,null,274,"000002439","PALMA REAL","03","07","09","02","0307","000002439 - PALMA REAL"]
[null,null,null,null,null,null,null,null,null,null,null,null,null,275,"000002449","ICHIQUIATO","03","07","09","02","0307","000002449 - ICHIQUIATO"]
[null,null,null,null,null,null,null,null,null,null,null,null,null,276,"000002450","SAN ANTONIO","03","07","09","02","0307","000002450 - SAN ANTONIO"]
[null,null,null,null,null,null,null,null,null,null,null,null,null,277,"999999999","(All)","03","99",null,null,"0399","999999999 - (All)"]
[null,null,null,null,null,null,null,null,null,null,null,null,null,278,"000000000","(All)","04","00",null,null,"0400","000000000 - (All)"]
[null,null,null,null,null,null,null,null,null,null,null,null,null,279,"000002378","SICUANI","04","00","06","01","0400","000002378 - SICUANI"]
[null,null,null,null,null,null,null,null,null,null,null,null,null,280,"000007135","ESPINAR","04","00","08","01","0400","000007135 - ESPINAR"]
[null,null,null,null,null,null,null,null,null,null,null,null,null,281,"000000000","(All)","04","01",null,null,"0401","000000000 - (All)"]
[null,null,null,null,null,null,null,null,null,null,null,null,null,282,"000002364","YANAOCA","04","01","05","01","0401","000002364 - YANAOCA"]
[null,null,null,null,null,null,null,null,null,null,null,null,null,283,"000002365","PONGOÑA","04","01","05","01","0401","000002365 - PONGOÑA"]
[null,null,null,null,null,null,null,null,null,null,null,null,null,284,"000018241","HAMPATURA","04","01","05","01","0401","000018241 - HAMPATURA"]
[null,null,null,null,null,null,null,null,null,null,null,null,null,285,"000002367","CHITIBAMBA","04","01","05","02","0401","000002367 - CHITIBAMBA"]
[null,null,null,null,null,null,null,null,null,null,null,null,null,286,"000002372","PAMPAMARCA","04","01","05","06","0401","000002372 - PAMPAMARCA"]
[null,null,null,null,null,null,null,null,null,null,null,null,null,287,"000002373","QUEHUE","04","01","05","07","0401","000002373 - QUEHUE"]
[null,null,null,null,null,null,null,null,null,null,null,null,null,288,"000002374","HUINCHIRI","04","01","05","07","0401","000002374 - HUINCHIRI"]
[null,null,null,null,null,null,null,null,null,null,null,null,null,289,"000034449","CHAUPIBANDA","04","01","05","07","0401","000034449 - CHAUPIBANDA"]
[null,null,null,null,null,null,null,null,null,null,null,null,null,290,"000002375","SURIMANA","04","01","05","08","0401","000002375 - SURIMANA"]
[null,null,null,null,null,null,null,null,null,null,null,null,null,291,"000002376","TUNGASUCA","04","01","05","08","0401","000002376 - TUNGASUCA"]
[null,null,null,null,null,null,null,null,null,null,null,null,null,292,"000002377","TOCCOCCORI","04","01","05","08","0401","000002377 - TOCCOCCORI"]
[null,null,null,null,null,null,null,null,null,null,null,null,null,293,"000032339","CCOCHAPATA","04","01","05","08","0401","000032339 - CCOCHAPATA"]
[null,null,null,null,null,null,null,null,null,null,null,null,null,294,"000000000","(All)","04","02",null,null,"0402","000000000 - (All)"]
[null,null,null,null,null,null,null,null,null,null,null,null,null,295,"000002366","CHECCA","04","02","05","02","0402","000002366 - CHECCA"]
[null,null,null,null,null,null,null,null,null,null,null,null,null,296,"000007700","EL DESCANSO","04","02","05","03","0402","000007700 - EL DESCANSO"]
[null,null,null,null,null,null,null,null,null,null,null,null,null,297,"000002369","LANGUI","04","02","05","04","0402","000002369 - LANGUI"]
[null,null,null,null,null,null,null,null,null,null,null,null,null,298,"000002370","CONDEVILUYO","04","02","05","04","0402","000002370 - CONDEVILUYO"]
[null,null,null,null,null,null,null,null,null,null,null,null,null,299,"000002371","LAYO","04","02","05","05","0402","000002371 - LAYO"]
[null,null,null,null,null,null,null,null,null,null,null,null,null,300,"000000000","(All)","04","03",null,null,"0403","000000000 - (All)"]
[null,null,null,null,null,null,null,null,null,null,null,null,null,301,"000002320","MOSOCLLACTA","04","03","02","04","0403","000002320 - MOSOCLLACTA"]
[null,null,null,null,null,null,null,null,null,null,null,null,null,302,"000034929","CHECACUPE","04","03","06","02","0403","000034929 - CHECACUPE"]
[null,null,null,null,null,null,null,null,null,null,null,null,null,303,"000002386","COMBAPATA CANCHIS","04","03","06","03","0403","000002386 - COMBAPATA CANCHIS"]
[null,null,null,null,null,null,null,null,null,null,null,null,null,304,"000034448","CHIARA","04","03","06","03","0403","000034448 - CHIARA"]
[null,null,null,null,null,null,null,null,null,null,null,null,null,305,"000034887","PITUMARCA","04","03","06","05","0403","000034887 - PITUMARCA"]
[null,null,null,null,null,null,null,null,null,null,null,null,null,306,"000002397","TINTA","04","03","06","08","0403","000002397 - TINTA"]
[null,null,null,null,null,null,null,null,null,null,null,null,null,307,"000000000","(All)","04","04",null,null,"0404","000000000 - (All)"]
[null,null,null,null,null,null,null,null,null,null,null,null,null,308,"000002379","HERCCA","04","04","06","01","0404","000002379 - HERCCA"]
[null,null,null,null,null,null,null,null,null,null,null,null,null,{"$f":"+N332+1","v":309},"000002380","TECHO OBRERO","04","04","06","01","0404","000002380 - TECHO OBRERO"]
[null,null,null,null,null,null,null,null,null,null,null,null,null,310,"000010063","ESSALUD SICUANI","04","04","06","01","0404","000010063 - ESSALUD SICUANI"]
[null,null,null,null,null,null,null,null,null,null,null,null,null,311,"000024639","INPE SICUANI","04","04","06","01","0404","000024639 - INPE SICUANI"]
[null,null,null,null,null,null,null,null,null,null,null,null,null,312,"000024663","SANIDAD PNP  SICUANI","04","04","06","01","0404","000024663 - SANIDAD PNP  SICUANI"]
[null,null,null,null,null,null,null,null,null,null,null,null,null,313,"000002388","MARANGANI","04","04","06","04","0404","000002388 - MARANGANI"]
[null,null,null,null,null,null,null,null,null,null,null,null,null,314,"000002389","CHECTUYOC","04","04","06","04","0404","000002389 - CHECTUYOC"]
[null,null,null,null,null,null,null,null,null,null,null,null,null,315,"000002390","CCUYO","04","04","06","04","0404","000002390 - CCUYO"]
[null,null,null,null,null,null,null,null,null,null,null,null,null,316,"000002391","OCCOBAMBA MARANGANI","04","04","06","04","0404","000002391 - OCCOBAMBA MARANGANI"]
[null,null,null,null,null,null,null,null,null,null,null,null,null,317,"000000000","(All)","04","05",null,null,"0405","000000000 - (All)"]
[null,null,null,null,null,null,null,null,null,null,null,null,null,318,"000002381","QUEHUAR","04","05","06","01","0405","000002381 - QUEHUAR"]
[null,null,null,null,null,null,null,null,null,null,null,null,null,319,"000002382","UZCUPATA","04","05","06","01","0405","000002382 - UZCUPATA"]
[null,null,null,null,null,null,null,null,null,null,null,null,null,320,"000002383","LA FLORIDA","04","05","06","01","0405","000002383 - LA FLORIDA"]
[null,null,null,null,null,null,null,null,null,null,null,null,null,321,"000026387","MENTAL COMUNITARIO SICUANI","04","05","06","01","0405","000026387 - MENTAL COMUNITARIO SICUANI"]
[null,null,null,null,null,null,null,null,null,null,null,null,null,322,"000032923","SR DE PAMPACUCHO-SICUANI","04","05","06","01","0405","000032923 - SR DE PAMPACUCHO-SICUANI"]
[null,null,null,null,null,null,null,null,null,null,null,null,null,323,"000035845","PAMPAPHALLA","04","05","06","01","0405","000035845 - PAMPAPHALLA"]
[null,null,null,null,null,null,null,null,null,null,null,null,null,324,"000035848","MENTAL COMUNITARIO SICUANI","04","05","06","01",{"$f":"CONCATENATE(Q348,R348)","v":"0405"},{"$f":"CONCATENATE(O348,\" - \",P348)","v":"000035848 - MENTAL COMUNITARIO SICUANI"}]
[null,null,null,null,null,null,null,null,null,null,null,null,null,325,"000002393","PHINAYA","04","05","06","05","0405","000002393 - PHINAYA"]
[null,null,null,null,null,null,null,null,null,null,null,null,null,326,"000002394","SAN PABLO CANCHIS","04","05","06","06","0405","000002394 - SAN PABLO CANCHIS"]
[null,null,null,null,null,null,null,null,null,null,null,null,null,327,"000002395","SANTA BARBARA","04","05","06","06","0405","000002395 - SANTA BARBARA"]
[null,null,null,null,null,null,null,null,null,null,null,null,null,328,"000002396","SAN PEDRO CANCHIS","04","05","06","07","0405","000002396 - SAN PEDRO CANCHIS"]
[null,null,null,null,null,null,null,null,null,null,null,null,null,329,"000000000","(All)","04","06",null,null,"0406","000000000 - (All)"]
[null,null,null,null,null,null,null,null,null,null,null,null,null,330,"000002410","YAURI","04","06","08","01","0406","000002410 - YAURI"]
[null,null,null,null,null,null,null,null,null,null,null,null,null,331,"000006745","TINTAYA MARQUIRI","04","06","08","01","0406","000006745 - TINTAYA MARQUIRI"]
[null,null,null,null,null,null,null,null,null,null,null,null,null,332,"000010061","ESPINAR - ESSALUD","04","06","08","01","0406","000010061 - ESPINAR - ESSALUD"]
[null,null,null,null,null,null,null,null,null,null,null,null,null,333,"000030366","MENTAL COMUNITARIO ESPINAR \"MUSUQ KAWSAY\"","04","06","08","01","0406","000030366 - MENTAL COMUNITARIO ESPINAR \"MUSUQ KAWSAY\""]
[null,null,null,null,null,null,null,null,null,null,null,null,null,334,"000002411","CONDOROMA","04","06","08","02","0406","000002411 - CONDOROMA"]
[null,null,null,null,null,null,null,null,null,null,null,null,null,335,"000002412","COPORAQUE","04","06","08","03","0406","000002412 - COPORAQUE"]
[null,null,null,null,null,null,null,null,null,null,null,null,null,336,"000002413","URINSAYA","04","06","08","03","0406","000002413 - URINSAYA"]
[null,null,null,null,null,null,null,null,null,null,null,null,null,337,"000002414","HUAYHUAHUASI","04","06","08","03","0406","000002414 - HUAYHUAHUASI"]
[null,null,null,null,null,null,null,null,null,null,null,null,null,338,"000002415","OCCORURO","04","06","08","04","0406","000002415 - OCCORURO"]
[null,null,null,null,null,null,null,null,null,null,null,null,null,339,"000002416","PALLPATA","04","06","08","05","0406","000002416 - PALLPATA"]
[null,null,null,null,null,null,null,null,null,null,null,null,null,340,"000002418","SAN MIGUEL","04","06","08","06","0406","000002418 - SAN MIGUEL"]
[null,null,null,null,null,null,null,null,null,null,null,null,null,341,"000034450","PICHIGUA ESPINAR","04","06","08","06","0406","000034450 - PICHIGUA ESPINAR"]
[null,null,null,null,null,null,null,null,null,null,null,null,null,342,"000002419","SUYKUTAMBO","04","06","08","07","0406","000002419 - SUYKUTAMBO"]
[null,null,null,null,null,null,null,null,null,null,null,null,null,343,"000002420","ACCOCUNCA","04","06","08","08","0406","000002420 - ACCOCUNCA"]
[null,null,null,null,null,null,null,null,null,null,null,null,null,344,"999999999","(All)","04","99",null,null,"0499","999999999 - (All)"]
[null,null,null,null,null,null,null,null,null,null,null,null,null,345,"000002469","SAN JUAN DE KIMBIRI-VRAEM","05","00","09","07","0500","000002469 - SAN JUAN DE KIMBIRI-VRAEM"]
[null,null,null,null,null,null,null,null,null,null,null,null,null,346,"000000000","(All)","05","01",null,null,"0501","000000000 - (All)"]
[null,null,null,null,null,null,null,null,null,null,null,null,null,347,"000002472","MAPITUNARI","05","01","09","07","0501","000002472 - MAPITUNARI"]
[null,null,null,null,null,null,null,null,null,null,null,null,null,348,"000002474","SAMANIATO","05","01","09","07","0501","000002474 - SAMANIATO"]
[null,null,null,null,null,null,null,null,null,null,null,null,null,349,"000002475","KIMBIRI ALTO","05","01","09","07","0501","000002475 - KIMBIRI ALTO"]
[null,null,null,null,null,null,null,null,null,null,null,null,null,350,"000008285","ANGELES","05","01","09","07","0501","000008285 - ANGELES"]
[null,null,null,null,null,null,null,null,null,null,null,null,null,351,"000002479","VILLA VIRGEN","05","01","09","12","0501","000002479 - VILLA VIRGEN"]
[null,null,null,null,null,null,null,null,null,null,null,null,null,352,"000024957","BTC LA OROYA  N°34 VILLA VIRGEN","05","01","09","12","0501","000024957 - BTC LA OROYA  N°34 VILLA VIRGEN"]
[null,null,null,null,null,null,null,null,null,null,null,null,null,353,"000002488","VILLA KINTIARINA","05","01","09","13","0501","000002488 - VILLA KINTIARINA"]
[null,null,null,null,null,null,null,null,null,null,null,null,null,354,"000008283","PUEBLO LIBRE","05","01","09","13","0501","000008283 - PUEBLO LIBRE"]
[null,null,null,null,null,null,null,null,null,null,null,null,null,355,"000002470","CHIRUMPIARI","05","01","09","16","0501","000002470 - CHIRUMPIARI"]
[null,null,null,null,null,null,null,null,null,null,null,null,null,356,"000002471","LOBO TAHUANTINSUYO","05","01","09","17","0501","000002471 - LOBO TAHUANTINSUYO"]
[null,null,null,null,null,null,null,null,null,null,null,null,null,357,"000002473","UNION ROSALES","05","01","09","17","0501","000002473 - UNION ROSALES"]
[null,null,null,null,null,null,null,null,null,null,null,null,null,358,"000008284","MANITEA ALTA","05","01","09","17","0501","000008284 - MANITEA ALTA"]
[null,null,null,null,null,null,null,null,null,null,null,null,null,359,"000000000","(All)","05","02",null,null,"0502","000000000 - (All)"]
[null,null,null,null,null,null,null,null,null,null,null,null,null,360,"000002496","OMAYA","05","02","09","10","0502","000002496 - OMAYA"]
[null,null,null,null,null,null,null,null,null,null,null,null,null,361,"000002497","OTARI","05","02","09","10","0502","000002497 - OTARI"]
[null,null,null,null,null,null,null,null,null,null,null,null,null,362,"000002498","PUERTO MAYO","05","02","09","10","0502","000002498 - PUERTO MAYO"]
[null,null,null,null,null,null,null,null,null,null,null,null,null,363,"000007113","NATIVIDAD","05","02","09","10","0502","000007113 - NATIVIDAD"]
[null,null,null,null,null,null,null,null,null,null,null,null,null,364,"000007114","QUISTO CENTRAL","05","02","09","10","0502","000007114 - QUISTO CENTRAL"]
[null,null,null,null,null,null,null,null,null,null,null,null,null,365,"000015104","TAMBO DEL ENE","05","02","09","10","0502","000015104 - TAMBO DEL ENE"]
[null,null,null,null,null,null,null,null,null,null,null,null,null,366,"000015170","PICHARI BAJA","05","02","09","10","0502","000015170 - PICHARI BAJA"]
[null,null,null,null,null,null,null,null,null,null,null,null,null,367,"000024638","MILITAR PICHARI","05","02","09","10","0502","000024638 - MILITAR PICHARI"]
[null,null,null,null,null,null,null,null,null,null,null,null,null,368,"000027230","MEDICA POLICIAL PICHARI","05","02","09","10","0502","000027230 - MEDICA POLICIAL PICHARI"]
[null,null,null,null,null,null,null,null,null,null,null,null,null,369,"000027948","ESSALUD PICHARI","05","02","09","10","0502","000027948 - ESSALUD PICHARI"]
[null,null,null,null,null,null,null,null,null,null,null,null,null,370,"000032211","NUEVO PROGRESO","05","02","09","10","0502","000032211 - NUEVO PROGRESO"]
[null,null,null,null,null,null,null,null,null,null,null,null,null,371,"000033988","MENTAL COMUNITARIO PICHARI","05","02","09","10","0502","000033988 - MENTAL COMUNITARIO PICHARI"]
[null,null,null,null,null,null,null,null,null,null,null,null,null,372,"000034418","PICHARI VRAEM","05","02","09","10","0502","000034418 - PICHARI VRAEM"]
[null,null,null,null,null,null,null,null,null,null,null,null,null,{"$f":"+N396+1","v":373},"000024637","EJERCITO-INCAHUASI 331","05","02","09","10","0502","000024637 - EJERCITO-INCAHUASI 331"]
[null,null,null,null,null,null,null,null,null,null,null,null,null,374,"000034417","CAP I ECHARATE - KITENI","05","02","09","10","0502","000034417 - CAP I ECHARATE - KITENI"]
[null,null,null,null,null,null,null,null,null,null,null,null,null,375,"000002495","MANTARO","05","02","09","18","0502","000002495 - MANTARO"]
[null,null,null,null,null,null,null,null,null,null,null,null,null,376,"000015169","PITIRINQUINI","05","02","09","18","0502","000015169 - PITIRINQUINI"]
[null,null,null,null,null,null,null,null,null,null,null,null,null,377,"999999999","(All)","05","99",null,null,"0599","999999999 - (All)"]
[null,null,null,null,null,null,null,null,null,null,null,null,null,378,"000002398","SANTO TOMAS","06","00","07","01","0600","000002398 - SANTO TOMAS"]
[null,null,null,null,null,null,null,null,null,null,null,null,null,379,"000000000","(All)","06","01",null,null,"0601","000000000 - (All)"]
[null,null,null,null,null,null,null,null,null,null,null,null,null,380,"000035864","CANGALLE","06","01","07","01","0601","000035864 - CANGALLE"]
[null,null,null,null,null,null,null,null,null,null,null,null,null,381,"000002402","CHAMACA","06","01","07","03","0601","000002402 - CHAMACA"]
[null,null,null,null,null,null,null,null,null,null,null,null,null,382,"000002403","AÑAHUICHI","06","01","07","03","0601","000002403 - AÑAHUICHI"]
[null,null,null,null,null,null,null,null,null,null,null,null,null,383,"000016328","UCCHUCCARCCO","06","01","07","03","0601","000016328 - UCCHUCCARCCO"]
[null,null,null,null,null,null,null,null,null,null,null,null,null,384,"000016329","INGATA","06","01","07","03","0601","000016329 - INGATA"]
[null,null,null,null,null,null,null,null,null,null,null,null,null,385,"000016330","CCONCHACCOLLO","06","01","07","03","0601","000016330 - CCONCHACCOLLO"]
[null,null,null,null,null,null,null,null,null,null,null,null,null,386,"000035861","CCACHO","06","01","07","03","0601","000035861 - CCACHO"]
[null,null,null,null,null,null,null,null,null,null,null,null,null,387,"000035863","TINCURCA","06","01","07","03","0601","000035863 - TINCURCA"]
[null,null,null,null,null,null,null,null,null,null,null,null,null,388,"000002406","LIVITACA","06","01","07","05","0601","000002406 - LIVITACA"]
[null,null,null,null,null,null,null,null,null,null,null,null,null,389,"000016325","CHILLOROYA - LIVITACA","06","01","07","05","0601","000016325 - CHILLOROYA - LIVITACA"]
[null,null,null,null,null,null,null,null,null,null,null,null,null,390,"000016327","AUSANTA","06","01","07","05","0601","000016327 - AUSANTA"]
[null,null,null,null,null,null,null,null,null,null,null,null,null,391,"000016332","PATAQUEÑA - LIVITACA","06","01","07","05","0601","000016332 - PATAQUEÑA - LIVITACA"]
[null,null,null,null,null,null,null,null,null,null,null,null,null,392,"000016334","KISIO","06","01","07","05","0601","000016334 - KISIO"]
[null,null,null,null,null,null,null,null,null,null,null,null,null,393,"000025739","PISQUICOCHA","06","01","07","05","0601","000025739 - PISQUICOCHA"]
[null,null,null,null,null,null,null,null,null,null,null,null,null,394,"000025740","TOTORA - REYNA DE LOS ANGELES","06","01","07","05","0601","000025740 - TOTORA - REYNA DE LOS ANGELES"]
[null,null,null,null,null,null,null,null,null,null,null,null,null,395,"000035860","KAYNO","06","01","07","05",{"$f":"CONCATENATE(Q419,R419)","v":"0601"},{"$f":"CONCATENATE(O419,\" - \",P419)","v":"000035860 - KAYNO"}]
[null,null,null,null,null,null,null,null,null,null,null,null,null,396,"000035862","SANTA ISABEL JALCCO","06","01","07","05","0601","000035862 - SANTA ISABEL JALCCO"]
[null,null,null,null,null,null,null,null,null,null,null,null,null,397,"000000000","(All)","06","09",null,null,"0609","000000000 - (All)"]
[null,null,null,null,null,null,null,null,null,null,null,null,null,398,"000002399","PULPERA","06","09","07","01","0609","000002399 - PULPERA"]
[null,null,null,null,null,null,null,null,null,null,null,null,null,399,"000002400","ALHUACCHULLO","06","09","07","01","0609","000002400 - ALHUACCHULLO"]
[null,null,null,null,null,null,null,null,null,null,null,null,null,400,"000006746","LLIQUE","06","09","07","01","0609","000006746 - LLIQUE"]
[null,null,null,null,null,null,null,null,null,null,null,null,null,401,"000006981","CCOYO","06","09","07","01","0609","000006981 - CCOYO"]
[null,null,null,null,null,null,null,null,null,null,null,null,null,402,"000006982","MELLOTOTORA","06","09","07","01","0609","000006982 - MELLOTOTORA"]
[null,null,null,null,null,null,null,null,null,null,null,null,null,403,"000006983","ORCCOMA","06","09","07","01","0609","000006983 - ORCCOMA"]
[null,null,null,null,null,null,null,null,null,null,null,null,null,404,"000007111","YAVINA","06","09","07","01","0609","000007111 - YAVINA"]
[null,null,null,null,null,null,null,null,null,null,null,null,null,405,"000008915","PFULLPURI CONDEPAMPA","06","09","07","01","0609","000008915 - PFULLPURI CONDEPAMPA"]
[null,null,null,null,null,null,null,null,null,null,null,null,null,406,"000013185","CAP I SANTO TOMÁS  ESSALUD","06","09","07","01","0609","000013185 - CAP I SANTO TOMÁS  ESSALUD"]
[null,null,null,null,null,null,null,null,null,null,null,null,null,407,"000030940","ARCANGEL SAN MIGUEL DE ESQUINA CONGUNYA","06","09","07","01","0609","000030940 - ARCANGEL SAN MIGUEL DE ESQUINA CONGUNYA"]
[null,null,null,null,null,null,null,null,null,null,null,null,null,408,"000002401","CCAPACMARCA","06","09","07","02","0609","000002401 - CCAPACMARCA"]
[null,null,null,null,null,null,null,null,null,null,null,null,null,409,"000009963","CANCAHUANI","06","09","07","02","0609","000009963 - CANCAHUANI"]
[null,null,null,null,null,null,null,null,null,null,null,null,null,410,"000027009","TAHUAY","06","09","07","02","0609","000027009 - TAHUAY"]
[null,null,null,null,null,null,null,null,null,null,null,null,null,411,"000002404","COLQUEMARCA","06","09","07","04","0609","000002404 - COLQUEMARCA"]
[null,null,null,null,null,null,null,null,null,null,null,null,null,412,"000002405","CHARAMURAY","06","09","07","04","0609","000002405 - CHARAMURAY"]
[null,null,null,null,null,null,null,null,null,null,null,null,null,413,"000008913","HUARACO","06","09","07","04","0609","000008913 - HUARACO"]
[null,null,null,null,null,null,null,null,null,null,null,null,null,414,"000008914","HUAYLLANI","06","09","07","04","0609","000008914 - HUAYLLANI"]
[null,null,null,null,null,null,null,null,null,null,null,null,null,415,"000012932","YANQUE","06","09","07","04","0609","000012932 - YANQUE"]
[null,null,null,null,null,null,null,null,null,null,null,null,null,416,"000002407","LLUSCO","06","09","07","06","0609","000002407 - LLUSCO"]
[null,null,null,null,null,null,null,null,null,null,null,null,null,417,"000006747","LUTTO","06","09","07","06","0609","000006747 - LUTTO"]
[null,null,null,null,null,null,null,null,null,null,null,null,null,418,"000006748","COLLPA","06","09","07","06","0609","000006748 - COLLPA"]
[null,null,null,null,null,null,null,null,null,null,null,null,null,419,"000006985","TOTORAPALLCA","06","09","07","06","0609","000006985 - TOTORAPALLCA"]
[null,null,null,null,null,null,null,null,null,null,null,null,null,420,"000027008","ANTUYO","06","09","07","06","0609","000027008 - ANTUYO"]
[null,null,null,null,null,null,null,null,null,null,null,null,null,421,"000002408","QUIÑOTA","06","09","07","07","0609","000002408 - QUIÑOTA"]
[null,null,null,null,null,null,null,null,null,null,null,null,null,422,"000006984","CCOLLANA","06","09","07","07","0609","000006984 - CCOLLANA"]
[null,null,null,null,null,null,null,null,null,null,null,null,null,423,"000007112","YORENCCA","06","09","07","07","0609","000007112 - YORENCCA"]
[null,null,null,null,null,null,null,null,null,null,null,null,null,424,"000025369","PUMALLACTA","06","09","07","07","0609","000025369 - PUMALLACTA"]
[null,null,null,null,null,null,null,null,null,null,null,null,null,425,"000002409","VELILLE","06","09","07","08","0609","000002409 - VELILLE"]
[null,null,null,null,null,null,null,null,null,null,null,null,null,426,"000008912","ALCCA VICTORIA","06","09","07","08","0609","000008912 - ALCCA VICTORIA"]
[null,null,null,null,null,null,null,null,null,null,null,null,null,427,"000025371","TUNTUMA","06","09","07","08","0609","000025371 - TUNTUMA"]
[null,null,null,null,null,null,null,null,null,null,null,null,null,428,"000027011","AYACCASI","06","09","07","08","0609","000027011 - AYACCASI"]
[null,null,null,null,null,null,null,null,null,null,null,null,null,429,"000027016","HUAYCUÑUTA - URCURUTA","06","09","07","08","0609","000027016 - HUAYCUÑUTA - URCURUTA"]
[null,null,null,null,null,null,null,null,null,null,null,null,null,430,"000000000","(All)","06","99",null,null,"0699","000000000 - (All)"]
[null,null,null,null,null,null,null,null,null,null,null,null,null,null,"999999999","(All)","99","99",null,null,"9999","999999999 - (All)"]

{"sheet":"SUPLEMENTACION","index":3,"n_rows":108,"n_cols":98,"rows_kept":108,"cut":false,"hidden":false,"merged":[[7,6,7,7],[8,1,8,2],[8,4,8,5],[8,6,8,7],[0,0,0,12],[1,0,1,12],[2,0,2,12],[3,0,3,12],[5,1,5,2],[5,4,5,5],[5,6,5,9],[6,1,6,2],[6,4,6,5],[7,1,7,2],[7,4,7,5],[9,1,9,2],[9,4,9,5],[9,6,9,7],[10,1,10,2],[11,1,11,2],[25,7,26,7],[36,0,37,0],[36,1,36,6],[36,7,37,7],[15,0,15,12],[17,0,18,0],[17,1,18,1],[17,2,17,5],[19,0,20,0],[21,0,21,1],[12,1,12,2],[60,0,61,0],[60,5,60,6],[61,5,61,6],[25,0,26,0],[25,1,25,6],[49,0,50,0],[49,1,49,6],[49,7,50,7],[58,5,58,6],[59,5,59,6],[73,0,74,0],[73,1,73,3],[74,5,74,6],[66,0,67,0],[62,0,63,0],[62,5,62,6],[63,5,63,6],[64,0,65,0],[64,5,64,6],[65,5,65,6],[68,0,69,0],[66,5,66,6],[67,5,67,6],[68,5,68,6],[69,5,69,6],[89,0,90,0],[89,1,89,3],[75,5,75,6],[76,5,76,6],[77,5,77,6],[78,5,78,6],[79,5,79,6],[80,5,80,6],[81,5,81,6],[82,5,82,6],[83,5,83,6],[84,5,84,6],[85,5,85,6]]}
["GERENCIA REGIONAL DE SALUD CUSCO"]
["DIRECCION DE ESTADISTICA E INFORMATICA Y TELECOMUNICACION"]
["Estrategia Sanitaria Alimentación y Nutricion Saludable"]
["Informe Mensual de Suplementación Preventiva y Terapeutica"]
[]
["DIRESA","CUSCO",null,null,"EJECUTORA",null,{"$f":"+TABLAS!O14","v":""}]
[]
["RED DE SALUD ",{"$f":"+TABLAS!O9","v":""},null,null,"PROVINCIA",null,{"$f":"+TABLAS!O12","v":""}]
[]
["MICRO RED",{"$f":"+TABLAS!O10","v":""},null,null,"DISTRITO",null,{"$f":"+TABLAS!O13","v":""}]
[]
["EE.SS.",{"$f":"+TABLAS!O11","v":""}]
[]
[null,null,null,null,null,"AÑO",{"$f":"+TABLAS!J16","v":"2025"},"MES",{"$f":"+TABLAS!N26","v":"ENE - MAY"}]
[]
["1. SUPLEMENTACION PREVENTIVA  EN NIÑOS MENORES DE 6 MESES",null,null,null,null,null,null,null,null,null,null,null,null,null,null,null,null,null,null,null,null,null,null,null,null,null,null,null,null,null,null,null,null,null,null,null,null,{"$f":"+GETPIVOTDATA(\" BAS001\",TABLAS!$A$59)","v":19}]
[]
["Actividades \nOperativas ","Edad Meses"," Mes de Suplementaciòn  de hierro",null,null,null,null,null,null,null,null,null,null,null,null,null,null,null,null,null,null,null,null,null,null,null,null,null,null,null,null,null,null,null,null,null,null,"=+IMPORTARDATOSDINAMICOS(\" BAS"]
[null,null,"1 Entrega","2 Entrega","3 Entrega","TA",null,null,null,null,null,null,null,null,null,null,null,null,null,null,null,null,null,null,null,null,null,null,null,null,null,null,null,null,null,null,null,"\";TABLAS!$A$59)"]
["Suplementación en < 6 meses",null,{"$f":"+GETPIVOTDATA(\" BAS001\",TABLAS!$A$59)","v":19},{"$f":"+GETPIVOTDATA(\" BAS002\",TABLAS!$A$59)","v":17},null,{"$f":"+GETPIVOTDATA(\" BAS003\",TABLAS!$A$59)","v":5},null,null,null,null,null,null,null,null,null,null,null,null,null,null,null,null,null,null,null,null,null,1,{"$f":"+AB20+1","v":2},null,{"$f":"+AC20+1","v":3},null,null,null,null,null,null,{"$f":"IF(AB20<9,CONCATENATE($AL$18,\"00\",AB20,$AL$19),IF(AND(AB20>9,AB20<100),CONCATENATE($AL$18,\"0\",AB20,$AL$19),IF(AB20>99,CONCATENATE($AL$18,AB20,$AL$19))))","v":"=+IMPORTARDATOSDINAMICOS(\" BAS001\";TABLAS!$A$59)"},{"$f":"IF(AC20<9,CONCATENATE($AL$18,\"00\",AC20,$AL$19),IF(AND(AC20>9,AC20<100),CONCATENATE($AL$18,\"0\",AC20,$AL$19),IF(AC20>99,CONCATENATE($AL$18,AC20,$AL$19))))","v":"=+IMPORTARDATOSDINAMICOS(\" BAS002\";TABLAS!$A$59)"},null,"=+IMPORTARDATOSDINAMICOS(\" BAS003\";TABLAS!$A$59)"]
[null,null,{"$f":"+GETPIVOTDATA(\" BAS004\",TABLAS!$A$59)","v":44},{"$f":"+GETPIVOTDATA(\" BAS005\",TABLAS!$A$59)","v":0},null,{"$f":"+GETPIVOTDATA(\" BAS006\",TABLAS!$A$59)","v":577},null,null,null,null,null,null,null,null,null,null,null,null,null,null,null,null,null,null,null,null,null,{"$f":"+AE20+1","v":4},{"$f":"+AB21+1","v":5},null,{"$f":"+AC21+1","v":6},null,null,null,null,null,null,{"$f":"IF(AB21<9,CONCATENATE($AL$18,\"00\",AB21,$AL$19),IF(AND(AB21>9,AB21<100),CONCATENATE($AL$18,\"0\",AB21,$AL$19),IF(AB21>99,CONCATENATE($AL$18,AB21,$AL$19))))","v":"=+IMPORTARDATOSDINAMICOS(\" BAS004\";TABLAS!$A$59)"},{"$f":"IF(AC21<9,CONCATENATE($AL$18,\"00\",AC21,$AL$19),IF(AND(AC21>9,AC21<100),CONCATENATE($AL$18,\"0\",AC21,$AL$19),IF(AC21>99,CONCATENATE($AL$18,AC21,$AL$19))))","v":"=+IMPORTARDATOSDINAMICOS(\" BAS005\";TABLAS!$A$59)"},null,{"$f":"IF(AE21<9,CONCATENATE($AL$18,\"00\",AE21,$AL$19),IF(AND(AE21>9,AE21<100),CONCATENATE($AL$18,\"0\",AE21,$AL$19),IF(AE21>99,CONCATENATE($AL$18,AE21,$AL$19))))","v":"=+IMPORTARDATOSDINAMICOS(\" BAS006\";TABLAS!$A$59)"}]
["TOTAL",null,{"$f":"SUM(C20:C21)","v":63},null,{"$f":"SUM(E20:E21)","v":0},0]
[]
["2. SUPLEMENTACION PREVENTIVA  CON MULTIMICRONUTRIENTE  A NIÑOS DE 6 A 59 MESES DE EDAD"]
[]
["Actividades \nOperativas ",null,null,null,null,null,null,"TA"]
[null,"1 Entrega","2 Entrega","3 Entrega","4 Entrega","5 Entrega","6 Entrega",null,null,null,null,null,null,null,null,null,null,null,null,null,null,null,null,null,null,null,null,"1 Entrega","2 Entrega","3 Entrega","4 Entrega","5 Entrega","6 Entrega","ta",null,null,null,"A",null,null,null,null,null,"F"]
["De 6 a 11 meses",{"$f":"+GETPIVOTDATA(\" BAS007\",TABLAS!$A$59)","v":4},{"$f":"+GETPIVOTDATA(\" BAS008\",TABLAS!$A$59)","v":4},{"$f":"+GETPIVOTDATA(\" BAS009\",TABLAS!$A$59)","v":4},{"$f":"+GETPIVOTDATA(\" BAS010\",TABLAS!$A$59)","v":2},{"$f":"+GETPIVOTDATA(\" BAS011\",TABLAS!$A$59)","v":0},{"$f":"+GETPIVOTDATA(\" BAS012\",TABLAS!$A$59)","v":0},{"$f":"+GETPIVOTDATA(\" BAS013\",TABLAS!$A$59)","v":0},null,null,null,null,null,null,null,null,null,null,null,null,null,null,null,null,null,null,null,{"$f":"+AE21+1","v":7},{"$f":"+AB28+1","v":8},{"$f":"+AC28+1","v":9},10,11,12,13,null,null,null,{"$f":"IF(AB28<9,CONCATENATE($AL$18,\"00\",AB28,$AL$19),IF(AND(AB28>9,AB28<100),CONCATENATE($AL$18,\"0\",AB28,$AL$19),IF(AB28>99,CONCATENATE($AL$18,AB28,$AL$19))))","v":"=+IMPORTARDATOSDINAMICOS(\" BAS007\";TABLAS!$A$59)"},{"$f":"IF(AC28<9,CONCATENATE($AL$18,\"00\",AC28,$AL$19),IF(AND(AC28>9,AC28<100),CONCATENATE($AL$18,\"0\",AC28,$AL$19),IF(AC28>99,CONCATENATE($AL$18,AC28,$AL$19))))","v":"=+IMPORTARDATOSDINAMICOS(\" BAS008\";TABLAS!$A$59)"},false,"=+IMPORTARDATOSDINAMICOS(\" BAS010\";TABLAS!$A$59)","=+IMPORTARDATOSDINAMICOS(\" BAS011\";TABLAS!$A$59)","=+IMPORTARDATOSDINAMICOS(\" BAS012\";TABLAS!$A$59)","=+IMPORTARDATOSDINAMICOS(\" BAS013\";TABLAS!$A$59)"]
["De 1 año",{"$f":"+GETPIVOTDATA(\" BAS014\",TABLAS!$A$59)","v":8},{"$f":"+GETPIVOTDATA(\" BAS015\",TABLAS!$A$59)","v":3},{"$f":"+GETPIVOTDATA(\" BAS016\",TABLAS!$A$59)","v":4},{"$f":"+GETPIVOTDATA(\" BAS017\",TABLAS!$A$59)","v":2},{"$f":"+GETPIVOTDATA(\" BAS018\",TABLAS!$A$59)","v":1},{"$f":"+GETPIVOTDATA(\" BAS019\",TABLAS!$A$59)","v":1},{"$f":"+GETPIVOTDATA(\" BAS020\",TABLAS!$A$59)","v":1},null,null,null,null,null,null,null,null,null,null,null,null,null,null,null,null,null,null,null,{"$f":"+AH28+1","v":14},{"$f":"+AB29+1","v":15},16,17,18,19,20,null,null,null,{"$f":"IF(AB29<9,CONCATENATE($AL$18,\"00\",AB29,$AL$19),IF(AND(AB29>9,AB29<100),CONCATENATE($AL$18,\"0\",AB29,$AL$19),IF(AB29>99,CONCATENATE($AL$18,AB29,$AL$19))))","v":"=+IMPORTARDATOSDINAMICOS(\" BAS014\";TABLAS!$A$59)"},{"$f":"IF(AC29<9,CONCATENATE($AL$18,\"00\",AC29,$AL$19),IF(AND(AC29>9,AC29<100),CONCATENATE($AL$18,\"0\",AC29,$AL$19),IF(AC29>99,CONCATENATE($AL$18,AC29,$AL$19))))","v":"=+IMPORTARDATOSDINAMICOS(\" BAS015\";TABLAS!$A$59)"},{"$f":"IF(AD29<9,CONCATENATE($AL$18,\"00\",AD29,$AL$19),IF(AND(AD29>9,AD29<100),CONCATENATE($AL$18,\"0\",AD29,$AL$19),IF(AD29>99,CONCATENATE($AL$18,AD29,$AL$19))))","v":"=+IMPORTARDATOSDINAMICOS(\" BAS016\";TABLAS!$A$59)"},{"$f":"IF(AE29<9,CONCATENATE($AL$18,\"00\",AE29,$AL$19),IF(AND(AE29>9,AE29<100),CONCATENATE($AL$18,\"0\",AE29,$AL$19),IF(AE29>99,CONCATENATE($AL$18,AE29,$AL$19))))","v":"=+IMPORTARDATOSDINAMICOS(\" BAS017\";TABLAS!$A$59)"},{"$f":"IF(AF29<9,CONCATENATE($AL$18,\"00\",AF29,$AL$19),IF(AND(AF29>9,AF29<100),CONCATENATE($AL$18,\"0\",AF29,$AL$19),IF(AF29>99,CONCATENATE($AL$18,AF29,$AL$19))))","v":"=+IMPORTARDATOSDINAMICOS(\" BAS018\";TABLAS!$A$59)"},{"$f":"IF(AG29<9,CONCATENATE($AL$18,\"00\",AG29,$AL$19),IF(AND(AG29>9,AG29<100),CONCATENATE($AL$18,\"0\",AG29,$AL$19),IF(AG29>99,CONCATENATE($AL$18,AG29,$AL$19))))","v":"=+IMPORTARDATOSDINAMICOS(\" BAS019\";TABLAS!$A$59)"},{"$f":"IF(AH29<9,CONCATENATE($AL$18,\"00\",AH29,$AL$19),IF(AND(AH29>9,AH29<100),CONCATENATE($AL$18,\"0\",AH29,$AL$19),IF(AH29>99,CONCATENATE($AL$18,AH29,$AL$19))))","v":"=+IMPORTARDATOSDINAMICOS(\" BAS020\";TABLAS!$A$59)"}]
["De 2 año",{"$f":"+GETPIVOTDATA(\" BAS021\",TABLAS!$A$59)","v":30},{"$f":"+GETPIVOTDATA(\" BAS022\",TABLAS!$A$59)","v":20},{"$f":"+GETPIVOTDATA(\" BAS023\",TABLAS!$A$59)","v":16},{"$f":"+GETPIVOTDATA(\" BAS024\",TABLAS!$A$59)","v":10},{"$f":"+GETPIVOTDATA(\" BAS025\",TABLAS!$A$59)","v":15},{"$f":"+GETPIVOTDATA(\" BAS026\",TABLAS!$A$59)","v":6},{"$f":"+GETPIVOTDATA(\" BAS027\",TABLAS!$A$59)","v":2},null,null,null,null,null,null,null,null,null,null,null,null,null,null,null,null,null,null,null,{"$f":"+AH29+1","v":21},{"$f":"+AB30+1","v":22},23,24,25,26,27,null,null,null,"=+IMPORTARDATOSDINAMICOS(\" BAS021\";TABLAS!$A$59)","=+IMPORTARDATOSDINAMICOS(\" BAS022\";TABLAS!$A$59)","=+IMPORTARDATOSDINAMICOS(\" BAS023\";TABLAS!$A$59)","=+IMPORTARDATOSDINAMICOS(\" BAS024\";TABLAS!$A$59)","=+IMPORTARDATOSDINAMICOS(\" BAS025\";TABLAS!$A$59)","=+IMPORTARDATOSDINAMICOS(\" BAS026\";TABLAS!$A$59)","=+IMPORTARDATOSDINAMICOS(\" BAS027\";TABLAS!$A$59)"]
["De 3 año",{"$f":"+GETPIVOTDATA(\" BAS028\",TABLAS!$A$59)","v":22},{"$f":"+GETPIVOTDATA(\" BAS029\",TABLAS!$A$59)","v":18},{"$f":"+GETPIVOTDATA(\" BAS030\",TABLAS!$A$59)","v":5},{"$f":"+GETPIVOTDATA(\" BAS031\",TABLAS!$A$59)","v":2},{"$f":"+GETPIVOTDATA(\" BAS032\",TABLAS!$A$59)","v":0},{"$f":"+GETPIVOTDATA(\" BAS033\",TABLAS!$A$59)","v":0},{"$f":"+GETPIVOTDATA(\" BAS034\",TABLAS!$A$59)","v":2},null,null,null,null,null,null,null,null,null,null,null,null,null,null,null,null,null,null,null,28,29,30,31,32,33,34,null,null,null,"=+IMPORTARDATOSDINAMICOS(\" BAS028\";TABLAS!$A$59)","=+IMPORTARDATOSDINAMICOS(\" BAS029\";TABLAS!$A$59)","=+IMPORTARDATOSDINAMICOS(\" BAS030\";TABLAS!$A$59)","=+IMPORTARDATOSDINAMICOS(\" BAS031\";TABLAS!$A$59)","=+IMPORTARDATOSDINAMICOS(\" BAS032\";TABLAS!$A$59)","=+IMPORTARDATOSDINAMICOS(\" BAS033\";TABLAS!$A$59)","=+IMPORTARDATOSDINAMICOS(\" BAS034\";TABLAS!$A$59)"]
["De 4 año",{"$f":"+GETPIVOTDATA(\" BAS035\",TABLAS!$A$59)","v":14},{"$f":"+GETPIVOTDATA(\" BAS036\",TABLAS!$A$59)","v":7},{"$f":"+GETPIVOTDATA(\" BAS037\",TABLAS!$A$59)","v":2},{"$f":"+GETPIVOTDATA(\" BAS038\",TABLAS!$A$59)","v":0},{"$f":"+GETPIVOTDATA(\" BAS039\",TABLAS!$A$59)","v":0},{"$f":"+GETPIVOTDATA(\" BAS040\",TABLAS!$A$59)","v":0},{"$f":"+GETPIVOTDATA(\" BAS041\",TABLAS!$A$59)","v":8},null,null,null,null,null,null,null,null,null,null,null,null,null,null,null,null,null,null,null,35,36,37,38,39,40,41,null,null,null,"=+IMPORTARDATOSDINAMICOS(\" BAS035\";TABLAS!$A$59)","=+IMPORTARDATOSDINAMICOS(\" BAS036\";TABLAS!$A$59)","=+IMPORTARDATOSDINAMICOS(\" BAS037\";TABLAS!$A$59)","=+IMPORTARDATOSDINAMICOS(\" BAS038\";TABLAS!$A$59)","=+IMPORTARDATOSDINAMICOS(\" BAS039\";TABLAS!$A$59)","=+IMPORTARDATOSDINAMICOS(\" BAS040\";TABLAS!$A$59)","=+IMPORTARDATOSDINAMICOS(\" BAS041\";TABLAS!$A$59)"]
["Total  ",{"$f":"SUM(B28:B31)","v":64},45,29,16,16,7,{"$f":"SUM(H29:H32)","v":13}]
[]
["3. SUPLEMENTACION  PREVENTIVA CON  SULFATO  FERROSO O  POLIMALTOSADO DE 6 MESES A 17 AÑOS"]
[]
["Actividades \nOperativas ","SUPLEMENTACION CON SULFATO FERROSO O POLIMALTOSADO",null,null,null,null,null,"TA"]
[null,"1 Entrega","2 Entrega","3 Entrega","4 Entrega","5 Entrega","6 Entrega",null,null,null,null,null,null,null,null,null,null,null,null,null,null,null,null,null,null,null,null,null,null,null,null,null,null,null,null,null,null,"A",null,null,null,null,null,"G"]
["De 6 a 11 meses",{"$f":"+GETPIVOTDATA(\" BAS042\",TABLAS!$A$59)","v":660},{"$f":"+GETPIVOTDATA(\" BAS043\",TABLAS!$A$59)","v":623},{"$f":"+GETPIVOTDATA(\" BAS044\",TABLAS!$A$59)","v":577},{"$f":"+GETPIVOTDATA(\" BAS045\",TABLAS!$A$59)","v":131},{"$f":"+GETPIVOTDATA(\" BAS046\",TABLAS!$A$59)","v":90},{"$f":"+GETPIVOTDATA(\" BAS047\",TABLAS!$A$59)","v":67},{"$f":"+GETPIVOTDATA(\" BAS048\",TABLAS!$A$59)","v":588},null,null,null,null,null,null,null,null,null,null,null,null,null,null,null,null,null,null,null,{"$f":"+AH32+1","v":42},{"$f":"+AB39+1","v":43},{"$f":"+AC39+1","v":44},45,46,47,48,null,null,null,{"$f":"IF(AB39<9,CONCATENATE($AL$18,\"00\",AB39,$AL$19),IF(AND(AB39>9,AB39<100),CONCATENATE($AL$18,\"0\",AB39,$AL$19),IF(AB39>99,CONCATENATE($AL$18,AB39,$AL$19))))","v":"=+IMPORTARDATOSDINAMICOS(\" BAS042\";TABLAS!$A$59)"},{"$f":"IF(AC39<9,CONCATENATE($AL$18,\"00\",AC39,$AL$19),IF(AND(AC39>9,AC39<100),CONCATENATE($AL$18,\"0\",AC39,$AL$19),IF(AC39>99,CONCATENATE($AL$18,AC39,$AL$19))))","v":"=+IMPORTARDATOSDINAMICOS(\" BAS043\";TABLAS!$A$59)"},{"$f":"IF(AD39<9,CONCATENATE($AL$18,\"00\",AD39,$AL$19),IF(AND(AD39>9,AD39<100),CONCATENATE($AL$18,\"0\",AD39,$AL$19),IF(AD39>99,CONCATENATE($AL$18,AD39,$AL$19))))","v":"=+IMPORTARDATOSDINAMICOS(\" BAS044\";TABLAS!$A$59)"},{"$f":"IF(AE39<9,CONCATENATE($AL$18,\"00\",AE39,$AL$19),IF(AND(AE39>9,AE39<100),CONCATENATE($AL$18,\"0\",AE39,$AL$19),IF(AE39>99,CONCATENATE($AL$18,AE39,$AL$19))))","v":"=+IMPORTARDATOSDINAMICOS(\" BAS045\";TABLAS!$A$59)"},{"$f":"IF(AF39<9,CONCATENATE($AL$18,\"00\",AF39,$AL$19),IF(AND(AF39>9,AF39<100),CONCATENATE($AL$18,\"0\",AF39,$AL$19),IF(AF39>99,CONCATENATE($AL$18,AF39,$AL$19))))","v":"=+IMPORTARDATOSDINAMICOS(\" BAS046\";TABLAS!$A$59)"},{"$f":"IF(AG39<9,CONCATENATE($AL$18,\"00\",AG39,$AL$19),IF(AND(AG39>9,AG39<100),CONCATENATE($AL$18,\"0\",AG39,$AL$19),IF(AG39>99,CONCATENATE($AL$18,AG39,$AL$19))))","v":"=+IMPORTARDATOSDINAMICOS(\" BAS047\";TABLAS!$A$59)"},{"$f":"IF(AH39<9,CONCATENATE($AL$18,\"00\",AH39,$AL$19),IF(AND(AH39>9,AH39<100),CONCATENATE($AL$18,\"0\",AH39,$AL$19),IF(AH39>99,CONCATENATE($AL$18,AH39,$AL$19))))","v":"=+IMPORTARDATOSDINAMICOS(\" BAS048\";TABLAS!$A$59)"}]
["De 1 año",{"$f":"+GETPIVOTDATA(\" BAS049\",TABLAS!$A$59)","v":776},{"$f":"+GETPIVOTDATA(\" BAS050\",TABLAS!$A$59)","v":698},{"$f":"+GETPIVOTDATA(\" BAS051\",TABLAS!$A$59)","v":636},{"$f":"+GETPIVOTDATA(\" BAS052\",TABLAS!$A$59)","v":538},{"$f":"+GETPIVOTDATA(\" BAS053\",TABLAS!$A$59)","v":399},{"$f":"+GETPIVOTDATA(\" BAS054\",TABLAS!$A$59)","v":307},{"$f":"+GETPIVOTDATA(\" BAS055\",TABLAS!$A$59)","v":763},null,null,null,null,null,null,null,null,null,null,null,null,null,null,null,null,null,null,null,{"$f":"+AH39+1","v":49},{"$f":"+AB40+1","v":50},51,52,53,54,55,null,null,null,{"$f":"IF(AB40<9,CONCATENATE($AL$18,\"00\",AB40,$AL$19),IF(AND(AB40>9,AB40<100),CONCATENATE($AL$18,\"0\",AB40,$AL$19),IF(AB40>99,CONCATENATE($AL$18,AB40,$AL$19))))","v":"=+IMPORTARDATOSDINAMICOS(\" BAS049\";TABLAS!$A$59)"},{"$f":"IF(AC40<9,CONCATENATE($AL$18,\"00\",AC40,$AL$19),IF(AND(AC40>9,AC40<100),CONCATENATE($AL$18,\"0\",AC40,$AL$19),IF(AC40>99,CONCATENATE($AL$18,AC40,$AL$19))))","v":"=+IMPORTARDATOSDINAMICOS(\" BAS050\";TABLAS!$A$59)"},{"$f":"IF(AD40<9,CONCATENATE($AL$18,\"00\",AD40,$AL$19),IF(AND(AD40>9,AD40<100),CONCATENATE($AL$18,\"0\",AD40,$AL$19),IF(AD40>99,CONCATENATE($AL$18,AD40,$AL$19))))","v":"=+IMPORTARDATOSDINAMICOS(\" BAS051\";TABLAS!$A$59)"},{"$f":"IF(AE40<9,CONCATENATE($AL$18,\"00\",AE40,$AL$19),IF(AND(AE40>9,AE40<100),CONCATENATE($AL$18,\"0\",AE40,$AL$19),IF(AE40>99,CONCATENATE($AL$18,AE40,$AL$19))))","v":"=+IMPORTARDATOSDINAMICOS(\" BAS052\";TABLAS!$A$59)"},{"$f":"IF(AF40<9,CONCATENATE($AL$18,\"00\",AF40,$AL$19),IF(AND(AF40>9,AF40<100),CONCATENATE($AL$18,\"0\",AF40,$AL$19),IF(AF40>99,CONCATENATE($AL$18,AF40,$AL$19))))","v":"=+IMPORTARDATOSDINAMICOS(\" BAS053\";TABLAS!$A$59)"},{"$f":"IF(AG40<9,CONCATENATE($AL$18,\"00\",AG40,$AL$19),IF(AND(AG40>9,AG40<100),CONCATENATE($AL$18,\"0\",AG40,$AL$19),IF(AG40>99,CONCATENATE($AL$18,AG40,$AL$19))))","v":"=+IMPORTARDATOSDINAMICOS(\" BAS054\";TABLAS!$A$59)"},{"$f":"IF(AH40<9,CONCATENATE($AL$18,\"00\",AH40,$AL$19),IF(AND(AH40>9,AH40<100),CONCATENATE($AL$18,\"0\",AH40,$AL$19),IF(AH40>99,CONCATENATE($AL$18,AH40,$AL$19))))","v":"=+IMPORTARDATOSDINAMICOS(\" BAS055\";TABLAS!$A$59)"}]
["De 2 años",{"$f":"+GETPIVOTDATA(\" BAS056\",TABLAS!$A$59)","v":671},{"$f":"+GETPIVOTDATA(\" BAS057\",TABLAS!$A$59)","v":557},{"$f":"+GETPIVOTDATA(\" BAS058\",TABLAS!$A$59)","v":475},{"$f":"+GETPIVOTDATA(\" BAS059\",TABLAS!$A$59)","v":434},{"$f":"+GETPIVOTDATA(\" BAS060\",TABLAS!$A$59)","v":303},{"$f":"+GETPIVOTDATA(\" BAS061\",TABLAS!$A$59)","v":259},{"$f":"+GETPIVOTDATA(\" BAS062\",TABLAS!$A$59)","v":341},null,null,null,null,null,null,null,null,null,null,null,null,null,null,null,null,null,null,null,{"$f":"+AH40+1","v":56},{"$f":"+AB41+1","v":57},58,59,60,61,62,null,null,null,"=+IMPORTARDATOSDINAMICOS(\" BAS056\";TABLAS!$A$59)","=+IMPORTARDATOSDINAMICOS(\" BAS057\";TABLAS!$A$59)","=+IMPORTARDATOSDINAMICOS(\" BAS058\";TABLAS!$A$59)","=+IMPORTARDATOSDINAMICOS(\" BAS059\";TABLAS!$A$59)","=+IMPORTARDATOSDINAMICOS(\" BAS060\";TABLAS!$A$59)","=+IMPORTARDATOSDINAMICOS(\" BAS061\";TABLAS!$A$59)","=+IMPORTARDATOSDINAMICOS(\" BAS062\";TABLAS!$A$59)"]
["De 3 años",{"$f":"+GETPIVOTDATA(\" BAS063\",TABLAS!$A$59)","v":650},{"$f":"+GETPIVOTDATA(\" BAS064\",TABLAS!$A$59)","v":555},{"$f":"+GETPIVOTDATA(\" BAS065\",TABLAS!$A$59)","v":406},{"$f":"+GETPIVOTDATA(\" BAS066\",TABLAS!$A$59)","v":78},{"$f":"+GETPIVOTDATA(\" BAS067\",TABLAS!$A$59)","v":48},{"$f":"+GETPIVOTDATA(\" BAS068\",TABLAS!$A$59)","v":40},{"$f":"+GETPIVOTDATA(\" BAS069\",TABLAS!$A$59)","v":384},null,null,null,null,null,null,null,null,null,null,null,null,null,null,null,null,null,null,null,63,64,65,66,67,68,69,null,null,null,"=+IMPORTARDATOSDINAMICOS(\" BAS063\";TABLAS!$A$59)","=+IMPORTARDATOSDINAMICOS(\" BAS064\";TABLAS!$A$59)","=+IMPORTARDATOSDINAMICOS(\" BAS065\";TABLAS!$A$59)","=+IMPORTARDATOSDINAMICOS(\" BAS066\";TABLAS!$A$59)","=+IMPORTARDATOSDINAMICOS(\" BAS067\";TABLAS!$A$59)","=+IMPORTARDATOSDINAMICOS(\" BAS068\";TABLAS!$A$59)","=+IMPORTARDATOSDINAMICOS(\" BAS069\";TABLAS!$A$59)"]
["De 4 años",{"$f":"+GETPIVOTDATA(\" BAS070\",TABLAS!$A$59)","v":668},{"$f":"+GETPIVOTDATA(\" BAS071\",TABLAS!$A$59)","v":460},{"$f":"+GETPIVOTDATA(\" BAS072\",TABLAS!$A$59)","v":292},{"$f":"+GETPIVOTDATA(\" BAS073\",TABLAS!$A$59)","v":46},{"$f":"+GETPIVOTDATA(\" BAS074\",TABLAS!$A$59)","v":40},{"$f":"+GETPIVOTDATA(\" BAS075\",TABLAS!$A$59)","v":34},{"$f":"+GETPIVOTDATA(\" BAS076\",TABLAS!$A$59)","v":217},null,null,null,null,null,null,null,null,null,null,null,null,null,null,null,null,null,null,null,70,71,72,73,74,75,76,null,null,null,"=+IMPORTARDATOSDINAMICOS(\" BAS070\";TABLAS!$A$59)","=+IMPORTARDATOSDINAMICOS(\" BAS071\";TABLAS!$A$59)","=+IMPORTARDATOSDINAMICOS(\" BAS072\";TABLAS!$A$59)","=+IMPORTARDATOSDINAMICOS(\" BAS073\";TABLAS!$A$59)","=+IMPORTARDATOSDINAMICOS(\" BAS074\";TABLAS!$A$59)","=+IMPORTARDATOSDINAMICOS(\" BAS075\";TABLAS!$A$59)","=+IMPORTARDATOSDINAMICOS(\" BAS076\";TABLAS!$A$59)"]
["De 5 a 11 años",{"$f":"+GETPIVOTDATA(\" BAS077\",TABLAS!$A$59)","v":843},{"$f":"+GETPIVOTDATA(\" BAS078\",TABLAS!$A$59)","v":219},{"$f":"+GETPIVOTDATA(\" BAS079\",TABLAS!$A$59)","v":99},{"$f":"+GETPIVOTDATA(\" BAS080\",TABLAS!$A$59)","v":13},{"$f":"+GETPIVOTDATA(\" BAS081\",TABLAS!$A$59)","v":13},{"$f":"+GETPIVOTDATA(\" BAS082\",TABLAS!$A$59)","v":6},{"$f":"+GETPIVOTDATA(\" BAS083\",TABLAS!$A$59)","v":26},null,null,null,null,null,null,null,null,null,null,null,null,null,null,null,null,null,null,null,77,78,79,80,81,82,83,null,null,null,"=+IMPORTARDATOSDINAMICOS(\" BAS077\";TABLAS!$A$59)","=+IMPORTARDATOSDINAMICOS(\" BAS078\";TABLAS!$A$59)","=+IMPORTARDATOSDINAMICOS(\" BAS079\";TABLAS!$A$59)","=+IMPORTARDATOSDINAMICOS(\" BAS080\";TABLAS!$A$59)","=+IMPORTARDATOSDINAMICOS(\" BAS081\";TABLAS!$A$59)","=+IMPORTARDATOSDINAMICOS(\" BAS082\";TABLAS!$A$59)","=+IMPORTARDATOSDINAMICOS(\" BAS083\";TABLAS!$A$59)"]
["De 12 a 17 años",{"$f":"+GETPIVOTDATA(\" BAS084\",TABLAS!$A$59)","v":43},{"$f":"+GETPIVOTDATA(\" BAS085\",TABLAS!$A$59)","v":4},{"$f":"+GETPIVOTDATA(\" BAS086\",TABLAS!$A$59)","v":0},{"$f":"+GETPIVOTDATA(\" BAS087\",TABLAS!$A$59)","v":0},{"$f":"+GETPIVOTDATA(\" BAS088\",TABLAS!$A$59)","v":1},{"$f":"+GETPIVOTDATA(\" BAS089\",TABLAS!$A$59)","v":1},{"$f":"+GETPIVOTDATA(\" BAS090\",TABLAS!$A$59)","v":1},null,null,null,null,null,null,null,null,null,null,null,null,null,null,null,null,null,null,null,84,85,86,87,88,89,90,null,null,null,"=+IMPORTARDATOSDINAMICOS(\" BAS084\";TABLAS!$A$59)","=+IMPORTARDATOSDINAMICOS(\" BAS085\";TABLAS!$A$59)","=+IMPORTARDATOSDINAMICOS(\" BAS086\";TABLAS!$A$59)","=+IMPORTARDATOSDINAMICOS(\" BAS087\";TABLAS!$A$59)","=+IMPORTARDATOSDINAMICOS(\" BAS088\";TABLAS!$A$59)","=+IMPORTARDATOSDINAMICOS(\" BAS089\";TABLAS!$A$59)","=+IMPORTARDATOSDINAMICOS(\" BAS090\";TABLAS!$A$59)"]
["TOTAL ",{"$f":"SUM(B39:B43)","v":3425},2893,2386,1227,880,707,{"$f":"SUM(H40:H43)","v":1705}]
[]
["9. SUPLEMENTACION PREVENTIVA CON HIERRO EN MEF, GESTANTES Y PUERPERAS"]
[]
["Actividades \nOperativas ","SUPLEMENTACION CON SULFATO FERROSO O POLIMALTOSADO",null,null,null,null,null,"TA"]
[null,"1 Entrega","2 Entrega","3 Entrega","4 Entrega","5 Entrega","6 Entrega",null,null,null,null,null,null,null,null,null,null,null,null,null,null,null,null,null,null,null,null,null,null,null,null,null,null,null,null,null,null,"A",null,null,null,null,null,"G"]
["MEF",{"$f":"+GETPIVOTDATA(\" BAS091\",TABLAS!$A$59)","v":67},{"$f":"+GETPIVOTDATA(\" BAS092\",TABLAS!$A$59)","v":17},{"$f":"+GETPIVOTDATA(\" BAS093\",TABLAS!$A$59)","v":0},{"$f":"+GETPIVOTDATA(\" BAS094\",TABLAS!$A$59)","v":0},{"$f":"+GETPIVOTDATA(\" BAS095\",TABLAS!$A$59)","v":0},{"$f":"+GETPIVOTDATA(\" BAS096\",TABLAS!$A$59)","v":1},{"$f":"+GETPIVOTDATA(\" BAS097\",TABLAS!$A$59)","v":27},null,null,null,null,null,null,null,null,null,null,null,null,null,null,null,null,null,null,null,{"$f":"+AH45+1","v":91},{"$f":"+AB52+1","v":92},{"$f":"+AC52+1","v":93},94,95,96,97,null,null,null,{"$f":"IF(AB52<9,CONCATENATE($AL$18,\"00\",AB52,$AL$19),IF(AND(AB52>9,AB52<100),CONCATENATE($AL$18,\"0\",AB52,$AL$19),IF(AB52>99,CONCATENATE($AL$18,AB52,$AL$19))))","v":"=+IMPORTARDATOSDINAMICOS(\" BAS091\";TABLAS!$A$59)"},{"$f":"IF(AC52<9,CONCATENATE($AL$18,\"00\",AC52,$AL$19),IF(AND(AC52>9,AC52<100),CONCATENATE($AL$18,\"0\",AC52,$AL$19),IF(AC52>99,CONCATENATE($AL$18,AC52,$AL$19))))","v":"=+IMPORTARDATOSDINAMICOS(\" BAS092\";TABLAS!$A$59)"},{"$f":"IF(AD52<9,CONCATENATE($AL$18,\"00\",AD52,$AL$19),IF(AND(AD52>9,AD52<100),CONCATENATE($AL$18,\"0\",AD52,$AL$19),IF(AD52>99,CONCATENATE($AL$18,AD52,$AL$19))))","v":"=+IMPORTARDATOSDINAMICOS(\" BAS093\";TABLAS!$A$59)"},{"$f":"IF(AE52<9,CONCATENATE($AL$18,\"00\",AE52,$AL$19),IF(AND(AE52>9,AE52<100),CONCATENATE($AL$18,\"0\",AE52,$AL$19),IF(AE52>99,CONCATENATE($AL$18,AE52,$AL$19))))","v":"=+IMPORTARDATOSDINAMICOS(\" BAS094\";TABLAS!$A$59)"},{"$f":"IF(AF52<9,CONCATENATE($AL$18,\"00\",AF52,$AL$19),IF(AND(AF52>9,AF52<100),CONCATENATE($AL$18,\"0\",AF52,$AL$19),IF(AF52>99,CONCATENATE($AL$18,AF52,$AL$19))))","v":"=+IMPORTARDATOSDINAMICOS(\" BAS095\";TABLAS!$A$59)"},{"$f":"IF(AG52<9,CONCATENATE($AL$18,\"00\",AG52,$AL$19),IF(AND(AG52>9,AG52<100),CONCATENATE($AL$18,\"0\",AG52,$AL$19),IF(AG52>99,CONCATENATE($AL$18,AG52,$AL$19))))","v":"=+IMPORTARDATOSDINAMICOS(\" BAS096\";TABLAS!$A$59)"},{"$f":"IF(AH52<9,CONCATENATE($AL$18,\"00\",AH52,$AL$19),IF(AND(AH52>9,AH52<100),CONCATENATE($AL$18,\"0\",AH52,$AL$19),IF(AH52>99,CONCATENATE($AL$18,AH52,$AL$19))))","v":"=+IMPORTARDATOSDINAMICOS(\" BAS097\";TABLAS!$A$59)"}]
["GESTANTES",{"$f":"+GETPIVOTDATA(\" BAS098\",TABLAS!$A$59)","v":510},{"$f":"+GETPIVOTDATA(\" BAS099\",TABLAS!$A$59)","v":210},{"$f":"+GETPIVOTDATA(\" BAS100\",TABLAS!$A$59)","v":5},{"$f":"+GETPIVOTDATA(\" BAS101\",TABLAS!$A$59)","v":0},{"$f":"+GETPIVOTDATA(\" BAS102\",TABLAS!$A$59)","v":0},{"$f":"+GETPIVOTDATA(\" BAS103\",TABLAS!$A$59)","v":0},{"$f":"+GETPIVOTDATA(\" BAS104\",TABLAS!$A$59)","v":0},null,null,null,null,null,null,null,null,null,null,null,null,null,null,null,null,null,null,null,{"$f":"+AH52+1","v":98},{"$f":"+AB53+1","v":99},100,101,102,103,104,null,null,null,{"$f":"IF(AB53<9,CONCATENATE($AL$18,\"00\",AB53,$AL$19),IF(AND(AB53>9,AB53<100),CONCATENATE($AL$18,\"0\",AB53,$AL$19),IF(AB53>99,CONCATENATE($AL$18,AB53,$AL$19))))","v":"=+IMPORTARDATOSDINAMICOS(\" BAS098\";TABLAS!$A$59)"},{"$f":"IF(AC53<9,CONCATENATE($AL$18,\"00\",AC53,$AL$19),IF(AND(AC53>9,AC53<100),CONCATENATE($AL$18,\"0\",AC53,$AL$19),IF(AC53>99,CONCATENATE($AL$18,AC53,$AL$19))))","v":"=+IMPORTARDATOSDINAMICOS(\" BAS099\";TABLAS!$A$59)"},{"$f":"IF(AD53<9,CONCATENATE($AL$18,\"00\",AD53,$AL$19),IF(AND(AD53>9,AD53<100),CONCATENATE($AL$18,\"0\",AD53,$AL$19),IF(AD53>99,CONCATENATE($AL$18,AD53,$AL$19))))","v":"=+IMPORTARDATOSDINAMICOS(\" BAS100\";TABLAS!$A$59)"},{"$f":"IF(AE53<9,CONCATENATE($AL$18,\"00\",AE53,$AL$19),IF(AND(AE53>9,AE53<100),CONCATENATE($AL$18,\"0\",AE53,$AL$19),IF(AE53>99,CONCATENATE($AL$18,AE53,$AL$19))))","v":"=+IMPORTARDATOSDINAMICOS(\" BAS101\";TABLAS!$A$59)"},{"$f":"IF(AF53<9,CONCATENATE($AL$18,\"00\",AF53,$AL$19),IF(AND(AF53>9,AF53<100),CONCATENATE($AL$18,\"0\",AF53,$AL$19),IF(AF53>99,CONCATENATE($AL$18,AF53,$AL$19))))","v":"=+IMPORTARDATOSDINAMICOS(\" BAS102\";TABLAS!$A$59)"},{"$f":"IF(AG53<9,CONCATENATE($AL$18,\"00\",AG53,$AL$19),IF(AND(AG53>9,AG53<100),CONCATENATE($AL$18,\"0\",AG53,$AL$19),IF(AG53>99,CONCATENATE($AL$18,AG53,$AL$19))))","v":"=+IMPORTARDATOSDINAMICOS(\" BAS103\";TABLAS!$A$59)"},{"$f":"IF(AH53<9,CONCATENATE($AL$18,\"00\",AH53,$AL$19),IF(AND(AH53>9,AH53<100),CONCATENATE($AL$18,\"0\",AH53,$AL$19),IF(AH53>99,CONCATENATE($AL$18,AH53,$AL$19))))","v":"=+IMPORTARDATOSDINAMICOS(\" BAS104\";TABLAS!$A$59)"}]
["PUERPERA",{"$f":"+GETPIVOTDATA(\" BAS105\",TABLAS!$A$59)","v":12},{"$f":"+GETPIVOTDATA(\" BAS106\",TABLAS!$A$59)","v":0},{"$f":"+GETPIVOTDATA(\" BAS107\",TABLAS!$A$59)","v":0},{"$f":"+GETPIVOTDATA(\" BAS108\",TABLAS!$A$59)","v":0},{"$f":"+GETPIVOTDATA(\" BAS109\",TABLAS!$A$59)","v":0},{"$f":"+GETPIVOTDATA(\" BAS110\",TABLAS!$A$59)","v":0},{"$f":"+GETPIVOTDATA(\" BAS111\",TABLAS!$A$59)","v":398},null,null,null,null,null,null,null,null,null,null,null,null,null,null,null,null,null,null,null,{"$f":"+AH53+1","v":105},{"$f":"+AB54+1","v":106},107,108,109,110,111,null,null,null,"=+IMPORTARDATOSDINAMICOS(\" BAS105\";TABLAS!$A$59)","=+IMPORTARDATOSDINAMICOS(\" BAS106\";TABLAS!$A$59)","=+IMPORTARDATOSDINAMICOS(\" BAS107\";TABLAS!$A$59)","=+IMPORTARDATOSDINAMICOS(\" BAS108\";TABLAS!$A$59)","=+IMPORTARDATOSDINAMICOS(\" BAS109\";TABLAS!$A$59)","=+IMPORTARDATOSDINAMICOS(\" BAS110\";TABLAS!$A$59)","=+IMPORTARDATOSDINAMICOS(\" BAS111\";TABLAS!$A$59)"]
["TOTAL ",{"$f":"SUM(B52:B53)","v":577},227,5,0,0,1,{"$f":"SUM(H53:H53)","v":0}]
[]
["4. SUPLEMENTACION  CON VITAMINA A ",null,null,null,null,"5. CONSEJERIA NUTRICIONAL"]
[]
["Vitamina. \"A\"",null,"EJEC",null,null,"EDAD",null,1,2,3]
["6-11 meses ","1° dosis",{"$f":"+GETPIVOTDATA(\" BAS112\",TABLAS!$A$59)","v":189},null,null,"RN c/BP o Prematuro",null,{"$f":"+GETPIVOTDATA(\" BAS123\",TABLAS!$A$59)","v":0},{"$f":"+GETPIVOTDATA(\" BAS124\",TABLAS!$A$59)","v":0},{"$f":"+GETPIVOTDATA(\" BAS125\",TABLAS!$A$59)","v":0},null,null,null,null,null,null,null,null,null,null,null,null,null,null,null,null,null,{"$f":"+AH54+1","v":112},null,{"$f":"+AB70+1","v":123},{"$f":"+AD60+1","v":124},{"$f":"+AE60+1","v":125},null,null,null,null,null,{"$f":"IF(AB60<9,CONCATENATE($AL$18,\"00\",AB60,$AL$19),IF(AND(AB60>9,AB60<100),CONCATENATE($AL$18,\"0\",AB60,$AL$19),IF(AB60>99,CONCATENATE($AL$18,AB60,$AL$19))))","v":"=+IMPORTARDATOSDINAMICOS(\" BAS112\";TABLAS!$A$59)"},null,{"$f":"IF(AD60<9,CONCATENATE($AL$18,\"00\",AD60,$AL$19),IF(AND(AD60>9,AD60<100),CONCATENATE($AL$18,\"0\",AD60,$AL$19),IF(AD60>99,CONCATENATE($AL$18,AD60,$AL$19))))","v":"=+IMPORTARDATOSDINAMICOS(\" BAS123\";TABLAS!$A$59)"},{"$f":"IF(AE60<9,CONCATENATE($AL$18,\"00\",AE60,$AL$19),IF(AND(AE60>9,AE60<100),CONCATENATE($AL$18,\"0\",AE60,$AL$19),IF(AE60>99,CONCATENATE($AL$18,AE60,$AL$19))))","v":"=+IMPORTARDATOSDINAMICOS(\" BAS124\";TABLAS!$A$59)"},{"$f":"IF(AF60<9,CONCATENATE($AL$18,\"00\",AF60,$AL$19),IF(AND(AF60>9,AF60<100),CONCATENATE($AL$18,\"0\",AF60,$AL$19),IF(AF60>99,CONCATENATE($AL$18,AF60,$AL$19))))","v":"=+IMPORTARDATOSDINAMICOS(\" BAS125\";TABLAS!$A$59)"}]
["  12-23 meses \n1a","1° dosis",{"$f":"+GETPIVOTDATA(\" BAS113\",TABLAS!$A$59)","v":271},null,null,"4 a 5 meses",null,{"$f":"+GETPIVOTDATA(\" BAS126\",TABLAS!$A$59)","v":0},{"$f":"+GETPIVOTDATA(\" BAS127\",TABLAS!$A$59)","v":0},{"$f":"+GETPIVOTDATA(\" BAS128\",TABLAS!$A$59)","v":0},null,null,null,null,null,null,null,null,null,null,null,null,null,null,null,null,null,{"$f":"+AB60+1","v":113},null,{"$f":"+AF60+1","v":126},{"$f":"+AD61+1","v":127},128,null,null,null,null,null,"=+IMPORTARDATOSDINAMICOS(\" BAS113\";TABLAS!$A$59)",null,{"$f":"IF(AD61<9,CONCATENATE($AL$18,\"00\",AD61,$AL$19),IF(AND(AD61>9,AD61<100),CONCATENATE($AL$18,\"0\",AD61,$AL$19),IF(AD61>99,CONCATENATE($AL$18,AD61,$AL$19))))","v":"=+IMPORTARDATOSDINAMICOS(\" BAS126\";TABLAS!$A$59)"},"=+IMPORTARDATOSDINAMICOS(\" BAS127\";TABLAS!$A$59)",{"$f":"IF(AF61<9,CONCATENATE($AL$18,\"00\",AF61,$AL$19),IF(AND(AF61>9,AF61<100),CONCATENATE($AL$18,\"0\",AF61,$AL$19),IF(AF61>99,CONCATENATE($AL$18,AF61,$AL$19))))","v":"=+IMPORTARDATOSDINAMICOS(\" BAS128\";TABLAS!$A$59)"}]
[null,"2° dosis",{"$f":"+GETPIVOTDATA(\" BAS114\",TABLAS!$A$59)","v":227},null,null,"6 - 11 meses",null,{"$f":"+GETPIVOTDATA(\" BAS129\",TABLAS!$A$59)","v":313},{"$f":"+GETPIVOTDATA(\" BAS130\",TABLAS!$A$59)","v":234},{"$f":"+GETPIVOTDATA(\" BAS131\",TABLAS!$A$59)","v":197},null,null,null,null,null,null,null,null,null,null,null,null,null,null,null,null,null,{"$f":"+AB61+1","v":114},null,{"$f":"+AF61+1","v":129},{"$f":"+AD62+1","v":130},131,null,null,null,null,null,"=+IMPORTARDATOSDINAMICOS(\" BAS114\";TABLAS!$A$59)",null,"=+IMPORTARDATOSDINAMICOS(\" BAS129\";TABLAS!$A$59)","=+IMPORTARDATOSDINAMICOS(\" BAS130\";TABLAS!$A$59)","=+IMPORTARDATOSDINAMICOS(\" BAS131\";TABLAS!$A$59)"]
["  24-35 meses \n2a","1° dosis",{"$f":"+GETPIVOTDATA(\" BAS115\",TABLAS!$A$59)","v":251},null,null,"De 1 año",null,{"$f":"+GETPIVOTDATA(\" BAS132\",TABLAS!$A$59)","v":579},{"$f":"+GETPIVOTDATA(\" BAS133\",TABLAS!$A$59)","v":565},{"$f":"+GETPIVOTDATA(\" BAS134\",TABLAS!$A$59)","v":511},null,null,null,null,null,null,null,null,null,null,null,null,null,null,null,null,null,115,null,132,133,134,null,null,null,null,null,"=+IMPORTARDATOSDINAMICOS(\" BAS115\";TABLAS!$A$59)",null,"=+IMPORTARDATOSDINAMICOS(\" BAS132\";TABLAS!$A$59)","=+IMPORTARDATOSDINAMICOS(\" BAS133\";TABLAS!$A$59)","=+IMPORTARDATOSDINAMICOS(\" BAS134\";TABLAS!$A$59)"]
[null,"2° dosis",{"$f":"+GETPIVOTDATA(\" BAS116\",TABLAS!$A$59)","v":212},null,null,"De 2 años",null,{"$f":"+GETPIVOTDATA(\" BAS135\",TABLAS!$A$59)","v":534},{"$f":"+GETPIVOTDATA(\" BAS136\",TABLAS!$A$59)","v":440},{"$f":"+GETPIVOTDATA(\" BAS137\",TABLAS!$A$59)","v":383},null,null,null,null,null,null,null,null,null,null,null,null,null,null,null,null,null,116,null,135,136,137,null,null,null,null,null,"=+IMPORTARDATOSDINAMICOS(\" BAS116\";TABLAS!$A$59)",null,"=+IMPORTARDATOSDINAMICOS(\" BAS135\";TABLAS!$A$59)","=+IMPORTARDATOSDINAMICOS(\" BAS136\";TABLAS!$A$59)","=+IMPORTARDATOSDINAMICOS(\" BAS137\";TABLAS!$A$59)"]
["  36-47 meses \n3a","1° dosis",{"$f":"+GETPIVOTDATA(\" BAS117\",TABLAS!$A$59)","v":262},null,null,"De 3 años",null,{"$f":"+GETPIVOTDATA(\" BAS138\",TABLAS!$A$59)","v":513},{"$f":"+GETPIVOTDATA(\" BAS139\",TABLAS!$A$59)","v":423},{"$f":"+GETPIVOTDATA(\" BAS140\",TABLAS!$A$59)","v":338},null,null,null,null,null,null,null,null,null,null,null,null,null,null,null,null,null,117,null,138,139,140,null,null,null,null,null,"=+IMPORTARDATOSDINAMICOS(\" BAS117\";TABLAS!$A$59)",null,"=+IMPORTARDATOSDINAMICOS(\" BAS138\";TABLAS!$A$59)","=+IMPORTARDATOSDINAMICOS(\" BAS139\";TABLAS!$A$59)","=+IMPORTARDATOSDINAMICOS(\" BAS140\";TABLAS!$A$59)"]
[null,"2° dosis",{"$f":"+GETPIVOTDATA(\" BAS118\",TABLAS!$A$59)","v":162},null,null,"De 4 años",null,{"$f":"+GETPIVOTDATA(\" BAS141\",TABLAS!$A$59)","v":553},{"$f":"+GETPIVOTDATA(\" BAS142\",TABLAS!$A$59)","v":370},{"$f":"+GETPIVOTDATA(\" BAS143\",TABLAS!$A$59)","v":236},null,null,null,null,null,null,null,null,null,null,null,null,null,null,null,null,null,118,null,141,142,143,null,null,null,null,null,"=+IMPORTARDATOSDINAMICOS(\" BAS118\";TABLAS!$A$59)",null,"=+IMPORTARDATOSDINAMICOS(\" BAS141\";TABLAS!$A$59)","=+IMPORTARDATOSDINAMICOS(\" BAS142\";TABLAS!$A$59)","=+IMPORTARDATOSDINAMICOS(\" BAS143\";TABLAS!$A$59)"]
["  48-59 meses \n4a","1° dosis",{"$f":"+GETPIVOTDATA(\" BAS119\",TABLAS!$A$59)","v":284},null,null,"De 5 a 11 años",null,{"$f":"+GETPIVOTDATA(\" BAS144\",TABLAS!$A$59)","v":736},{"$f":"+GETPIVOTDATA(\" BAS145\",TABLAS!$A$59)","v":154},{"$f":"+GETPIVOTDATA(\" BAS146\",TABLAS!$A$59)","v":74},null,null,null,null,null,null,null,null,null,null,null,null,null,null,null,null,null,119,null,144,145,146,null,null,null,null,null,"=+IMPORTARDATOSDINAMICOS(\" BAS119\";TABLAS!$A$59)",null,"=+IMPORTARDATOSDINAMICOS(\" BAS144\";TABLAS!$A$59)","=+IMPORTARDATOSDINAMICOS(\" BAS145\";TABLAS!$A$59)","=+IMPORTARDATOSDINAMICOS(\" BAS146\";TABLAS!$A$59)",null,null,null,null,null,null,null,null,null,null,null,null,null,null,null,null,null,null,null,null,null,null,null,null,null,null,null,null,null,null,null,null,null,null,null,null,null,null,null,null,null,null,null,null,null,null,null,null,null,null,null,0]
[null,"2° dosis",{"$f":"+GETPIVOTDATA(\" BAS120\",TABLAS!$A$59)","v":152},null,null,"De 12 a 17 años Mujeres",null,{"$f":"+GETPIVOTDATA(\" BAS147\",TABLAS!$A$59)","v":20},{"$f":"+GETPIVOTDATA(\" BAS148\",TABLAS!$A$59)","v":3},{"$f":"+GETPIVOTDATA(\" BAS149\",TABLAS!$A$59)","v":0},null,null,null,null,null,null,null,null,null,null,null,null,null,null,null,null,null,120,null,147,148,149,null,null,null,null,null,"=+IMPORTARDATOSDINAMICOS(\" BAS120\";TABLAS!$A$59)",null,"=+IMPORTARDATOSDINAMICOS(\" BAS147\";TABLAS!$A$59)","=+IMPORTARDATOSDINAMICOS(\" BAS148\";TABLAS!$A$59)","=+IMPORTARDATOSDINAMICOS(\" BAS149\";TABLAS!$A$59)",null,null,null,null,null,null,null,null,null,null,null,null,null,null,null,null,null,null,null,null,null,null,null,null,null,null,null,null,null,null,null,null,null,null,null,null,null,null,null,null,null,null,null,null,null,null,null,null,null,null,null,1,30]
["  49-59 meses \n5a","1° dosis",{"$f":"+GETPIVOTDATA(\" BAS121\",TABLAS!$A$59)","v":13},null,null,"MEF",null,{"$f":"+GETPIVOTDATA(\" BAS150\",TABLAS!$A$59)","v":89},{"$f":"+GETPIVOTDATA(\" BAS151\",TABLAS!$A$59)","v":5},{"$f":"+GETPIVOTDATA(\" BAS152\",TABLAS!$A$59)","v":5},null,null,null,null,null,null,null,null,null,null,null,null,null,null,null,null,null,121,null,150,151,152,null,null,null,null,null,"=+IMPORTARDATOSDINAMICOS(\" BAS121\";TABLAS!$A$59)",null,"=+IMPORTARDATOSDINAMICOS(\" BAS150\";TABLAS!$A$59)","=+IMPORTARDATOSDINAMICOS(\" BAS151\";TABLAS!$A$59)","=+IMPORTARDATOSDINAMICOS(\" BAS152\";TABLAS!$A$59)",null,null,null,null,null,null,null,null,null,null,null,null,null,null,null,null,null,null,null,null,null,null,null,null,null,null,null,null,null,null,null,null,null,null,null,null,null,null,null,null,null,null,null,null,null,null,null,null,null,null,null,{"$f":"+CP68+1","v":2},30]
[null,"2° dosis",{"$f":"+GETPIVOTDATA(\" BAS122\",TABLAS!$A$59)","v":2},null,null,"Gestantes",null,{"$f":"+GETPIVOTDATA(\" BAS153\",TABLAS!$A$59)","v":0},{"$f":"+GETPIVOTDATA(\" BAS154\",TABLAS!$A$59)","v":0},{"$f":"+GETPIVOTDATA(\" BAS155\",TABLAS!$A$59)","v":0},null,null,null,null,null,null,null,null,null,null,null,null,null,null,null,null,null,122,null,153,154,155,null,null,null,null,null,"=+IMPORTARDATOSDINAMICOS(\" BAS122\";TABLAS!$A$59)",null,"=+IMPORTARDATOSDINAMICOS(\" BAS153\";TABLAS!$A$59)","=+IMPORTARDATOSDINAMICOS(\" BAS154\";TABLAS!$A$59)","=+IMPORTARDATOSDINAMICOS(\" BAS155\";TABLAS!$A$59)",null,null,null,null,null,null,null,null,null,null,null,null,null,null,null,null,null,null,null,null,null,null,null,null,null,null,null,null,null,null,null,null,null,null,null,null,null,null,null,null,null,null,null,null,null,null,null,null,null,null,null,{"$f":"+CP69+1","v":3},30]
[null,null,null,null,null,null,null,null,null,null,null,null,null,null,null,null,null,null,null,null,null,null,null,null,null,null,null,null,null,null,null,null,null,null,null,null,null,null,null,null,null,null,null,null,null,null,null,null,null,null,null,null,null,null,null,null,null,null,null,null,null,null,null,null,null,null,null,null,null,null,null,null,null,null,null,null,null,null,null,null,null,null,null,null,null,null,null,null,null,null,null,null,null,4,30]
["6. DOSAJE DE HEMOGLOBINA",null,null,null,null,"7. CONSULTA NUTRICIONAL",null,null,null,null,null,null,null,null,null,null,null,null,null,null,null,null,null,null,null,null,null,null,null,null,null,null,null,null,null,null,null,null,null,null,null,null,null,null,null,null,null,null,null,null,null,null,null,null,null,null,null,null,null,null,null,null,null,null,null,null,null,null,null,null,null,null,null,null,null,null,null,null,null,null,null,null,null,null,null,null,null,null,null,null,null,null,null,5,30]
[null,null,null,null,null,null,null,null,null,null,null,null,null,null,null,null,null,null,null,null,null,null,null,null,null,null,null,null,null,null,null,null,null,null,null,null,null,null,null,null,null,null,null,null,null,null,null,null,null,null,null,null,null,null,null,null,null,null,null,null,null,null,null,null,null,null,null,null,null,null,null,null,null,null,null,null,null,null,null,null,null,null,null,null,null,null,null,null,null,null,null,null,null,6,30,{"$f":"SUM(CQ68:CQ73)","v":180},170,{"$f":"+CS73+70","v":240}]
["Actividades \nOperativas ","Dosaje de hemoglobina",null,null,null,null,null,null,null,null,null,null,null,null,null,null,null,null,null,null,null,null,null,null,null,null,null,null,null,null,null,null,null,null,null,null,null,{"$f":"+GETPIVOTDATA(\" BAS001\",TABLAS!$A$95)","v":30},null,null,null,null,null,null,null,null,null,null,null,null,null,null,null,null,null,null,null,null,null,null,null,null,null,null,null,null,null,null,null,null,null,null,null,null,null,null,null,null,null,null,null,null,null,null,null,null,null,null,null,null,null,null,null,7,30]
[null,"1er","2do","3er",null,"EDAD",null,1,2,3,null,null,null,null,null,null,null,null,null,null,null,null,null,null,null,null,null,null,null,null,null,null,null,null,null,null,null,"\";TABLAS!$A$95)",null,null,null,null,null,null,null,null,null,null,null,null,null,null,null,null,null,null,null,null,null,null,null,null,null,null,null,null,null,null,null,null,null,null,null,null,null,null,null,null,null,null,null,null,null,null,null,null,null,null,null,null,null,null,null,8,30]
["RN bajo Peso o Prematuro",{"$f":"+GETPIVOTDATA(\" BAS001\",TABLAS!$A$95)","v":30},{"$f":"+GETPIVOTDATA(\" BAS002\",TABLAS!$A$95)","v":21},{"$f":"+GETPIVOTDATA(\" BAS003\",TABLAS!$A$95)","v":0},null,"RN c/BP o Prematuro",null,{"$f":"+GETPIVOTDATA(\" BAS031\",TABLAS!$A$95)","v":27},{"$f":"+GETPIVOTDATA(\" BAS032\",TABLAS!$A$95)","v":0},{"$f":"+GETPIVOTDATA(\" BAS033\",TABLAS!$A$95)","v":0},null,null,null,null,null,null,null,null,null,null,null,null,null,null,null,null,null,null,null,1,{"$f":"+AD76+1","v":2},{"$f":"+AE76+1","v":3},null,{"$f":"+AF85+1","v":31},{"$f":"+AH76+1","v":32},{"$f":"+AI76+1","v":33},null,{"$f":"IF(AD76<9,CONCATENATE($AL$18,\"00\",AD76,$AL$75),IF(AND(AD76>9,AD76<100),CONCATENATE($AL$18,\"0\",AD76,$AL$75),IF(AD76>99,CONCATENATE($AL$18,AD76,$AL$75))))","v":"=+IMPORTARDATOSDINAMICOS(\" BAS001\";TABLAS!$A$95)"},{"$f":"IF(AE76<9,CONCATENATE($AL$18,\"00\",AE76,$AL$75),IF(AND(AE76>9,AE76<100),CONCATENATE($AL$18,\"0\",AE76,$AL$75),IF(AE76>99,CONCATENATE($AL$18,AE76,$AL$75))))","v":"=+IMPORTARDATOSDINAMICOS(\" BAS002\";TABLAS!$A$95)"},"=+IMPORTARDATOSDINAMICOS(\" BAS003\";TABLAS!$A$95)",null,{"$f":"IF(AH76<9,CONCATENATE($AL$18,\"00\",AH76,$AL$75),IF(AND(AH76>9,AH76<100),CONCATENATE($AL$18,\"0\",AH76,$AL$75),IF(AH76>99,CONCATENATE($AL$18,AH76,$AL$75))))","v":"=+IMPORTARDATOSDINAMICOS(\" BAS031\";TABLAS!$A$95)"},{"$f":"IF(AI76<9,CONCATENATE($AL$18,\"00\",AI76,$AL$75),IF(AND(AI76>9,AI76<100),CONCATENATE($AL$18,\"0\",AI76,$AL$75),IF(AI76>99,CONCATENATE($AL$18,AI76,$AL$75))))","v":"=+IMPORTARDATOSDINAMICOS(\" BAS032\";TABLAS!$A$95)"},{"$f":"IF(AJ76<9,CONCATENATE($AL$18,\"00\",AJ76,$AL$75),IF(AND(AJ76>9,AJ76<100),CONCATENATE($AL$18,\"0\",AJ76,$AL$75),IF(AJ76>99,CONCATENATE($AL$18,AJ76,$AL$75))))","v":"=+IMPORTARDATOSDINAMICOS(\" BAS033\";TABLAS!$A$95)"},null,null,null,null,null,null,null,null,null,null,null,null,null,null,null,null,null,null,null,null,null,null,null,null,null,null,null,null,null,null,null,null,null,null,null,null,null,null,null,null,null,null,null,null,null,null,null,null,null,9,30,{"$f":"SUM(CQ68:CQ76)","v":270},260,{"$f":"+CS76+70","v":330}]
["6 a 11 meses",{"$f":"+GETPIVOTDATA(\" BAS004\",TABLAS!$A$95)","v":589},{"$f":"+GETPIVOTDATA(\" BAS005\",TABLAS!$A$95)","v":493},{"$f":"+GETPIVOTDATA(\" BAS006\",TABLAS!$A$95)","v":468},null,"4 a 5 meses",null,{"$f":"+GETPIVOTDATA(\" BAS034\",TABLAS!$A$95)","v":12},{"$f":"+GETPIVOTDATA(\" BAS035\",TABLAS!$A$95)","v":0},{"$f":"+GETPIVOTDATA(\" BAS036\",TABLAS!$A$95)","v":0},null,null,null,null,null,null,null,null,null,null,null,null,null,null,null,null,null,null,null,{"$f":"+AF76+1","v":4},{"$f":"+AD77+1","v":5},6,null,{"$f":"+AJ76+1","v":34},{"$f":"+AH77+1","v":35},36,null,{"$f":"IF(AD77<9,CONCATENATE($AL$18,\"00\",AD77,$AL$75),IF(AND(AD77>9,AD77<100),CONCATENATE($AL$18,\"0\",AD77,$AL$75),IF(AD77>99,CONCATENATE($AL$18,AD77,$AL$75))))","v":"=+IMPORTARDATOSDINAMICOS(\" BAS004\";TABLAS!$A$95)"},{"$f":"IF(AE77<9,CONCATENATE($AL$18,\"00\",AE77,$AL$75),IF(AND(AE77>9,AE77<100),CONCATENATE($AL$18,\"0\",AE77,$AL$75),IF(AE77>99,CONCATENATE($AL$18,AE77,$AL$75))))","v":"=+IMPORTARDATOSDINAMICOS(\" BAS005\";TABLAS!$A$95)"},{"$f":"IF(AF77<9,CONCATENATE($AL$18,\"00\",AF77,$AL$75),IF(AND(AF77>9,AF77<100),CONCATENATE($AL$18,\"0\",AF77,$AL$75),IF(AF77>99,CONCATENATE($AL$18,AF77,$AL$75))))","v":"=+IMPORTARDATOSDINAMICOS(\" BAS006\";TABLAS!$A$95)"},null,{"$f":"IF(AH77<9,CONCATENATE($AL$18,\"00\",AH77,$AL$75),IF(AND(AH77>9,AH77<100),CONCATENATE($AL$18,\"0\",AH77,$AL$75),IF(AH77>99,CONCATENATE($AL$18,AH77,$AL$75))))","v":"=+IMPORTARDATOSDINAMICOS(\" BAS034\";TABLAS!$A$95)"},{"$f":"IF(AI77<9,CONCATENATE($AL$18,\"00\",AI77,$AL$75),IF(AND(AI77>9,AI77<100),CONCATENATE($AL$18,\"0\",AI77,$AL$75),IF(AI77>99,CONCATENATE($AL$18,AI77,$AL$75))))","v":"=+IMPORTARDATOSDINAMICOS(\" BAS035\";TABLAS!$A$95)"},{"$f":"IF(AJ77<9,CONCATENATE($AL$18,\"00\",AJ77,$AL$75),IF(AND(AJ77>9,AJ77<100),CONCATENATE($AL$18,\"0\",AJ77,$AL$75),IF(AJ77>99,CONCATENATE($AL$18,AJ77,$AL$75))))","v":"=+IMPORTARDATOSDINAMICOS(\" BAS036\";TABLAS!$A$95)"},null,null,null,null,null,null,null,null,null,null,null,null,null,null,null,null,null,null,null,null,null,null,null,null,null,null,null,null,null,null,null,null,null,null,null,null,null,null,null,null,null,null,null,null,null,null,null,null,null,10,30]
["12 a 23 meses",{"$f":"+GETPIVOTDATA(\" BAS007\",TABLAS!$A$95)","v":558},{"$f":"+GETPIVOTDATA(\" BAS008\",TABLAS!$A$95)","v":648},{"$f":"+GETPIVOTDATA(\" BAS009\",TABLAS!$A$95)","v":295},null,"6 - 11 meses",null,{"$f":"+GETPIVOTDATA(\" BAS037\",TABLAS!$A$95)","v":38},{"$f":"+GETPIVOTDATA(\" BAS038\",TABLAS!$A$95)","v":0},{"$f":"+GETPIVOTDATA(\" BAS039\",TABLAS!$A$95)","v":0},null,null,null,null,null,null,null,null,null,null,null,null,null,null,null,null,null,null,null,{"$f":"+AF77+1","v":7},{"$f":"+AD78+1","v":8},9,null,{"$f":"+AJ77+1","v":37},{"$f":"+AH78+1","v":38},39,null,"=+IMPORTARDATOSDINAMICOS(\" BAS007\";TABLAS!$A$95)","=+IMPORTARDATOSDINAMICOS(\" BAS008\";TABLAS!$A$95)",{"$f":"IF(AF78<10,CONCATENATE($AL$18,\"00\",AF78,$AL$75),IF(AND(AF78>9,AF78<100),CONCATENATE($AL$18,\"0\",AF78,$AL$75),IF(AF78>99,CONCATENATE($AL$18,AF78,$AL$75))))","v":"=+IMPORTARDATOSDINAMICOS(\" BAS009\";TABLAS!$A$95)"},null,"=+IMPORTARDATOSDINAMICOS(\" BAS037\";TABLAS!$A$95)","=+IMPORTARDATOSDINAMICOS(\" BAS038\";TABLAS!$A$95)","=+IMPORTARDATOSDINAMICOS(\" BAS039\";TABLAS!$A$95)",null,null,null,null,null,null,null,null,null,null,null,null,null,null,null,null,null,null,null,null,null,null,null,null,null,null,null,null,null,null,null,null,null,null,null,null,null,null,null,null,null,null,null,null,null,null,null,null,null,11,30]
["24 a 35 meses",{"$f":"+GETPIVOTDATA(\" BAS010\",TABLAS!$A$95)","v":754},{"$f":"+GETPIVOTDATA(\" BAS011\",TABLAS!$A$95)","v":444},{"$f":"+GETPIVOTDATA(\" BAS012\",TABLAS!$A$95)","v":0},null,"De 1 año",null,{"$f":"+GETPIVOTDATA(\" BAS040\",TABLAS!$A$95)","v":67},{"$f":"+GETPIVOTDATA(\" BAS041\",TABLAS!$A$95)","v":0},{"$f":"+GETPIVOTDATA(\" BAS042\",TABLAS!$A$95)","v":0},null,null,null,null,null,null,null,null,null,null,null,null,null,null,null,null,null,null,null,10,11,12,null,40,41,42,null,"=+IMPORTARDATOSDINAMICOS(\" BAS010\";TABLAS!$A$95)","=+IMPORTARDATOSDINAMICOS(\" BAS011\";TABLAS!$A$95)","=+IMPORTARDATOSDINAMICOS(\" BAS012\";TABLAS!$A$95)",null,"=+IMPORTARDATOSDINAMICOS(\" BAS040\";TABLAS!$A$95)","=+IMPORTARDATOSDINAMICOS(\" BAS041\";TABLAS!$A$95)","=+IMPORTARDATOSDINAMICOS(\" BAS042\";TABLAS!$A$95)",null,null,null,null,null,null,null,null,null,null,null,null,null,null,null,null,null,null,null,null,null,null,null,null,null,null,null,null,null,null,null,null,null,null,null,null,null,null,null,null,null,null,null,null,null,null,null,null,null,12,30,{"$f":"SUM(CQ68:CQ79)","v":360},350,370]
["36 a 59 meses",{"$f":"+GETPIVOTDATA(\" BAS013\",TABLAS!$A$95)","v":488},{"$f":"+GETPIVOTDATA(\" BAS014\",TABLAS!$A$95)","v":277},{"$f":"+GETPIVOTDATA(\" BAS015\",TABLAS!$A$95)","v":0},null,"De 2 años",null,{"$f":"+GETPIVOTDATA(\" BAS043\",TABLAS!$A$95)","v":59},{"$f":"+GETPIVOTDATA(\" BAS044\",TABLAS!$A$95)","v":0},{"$f":"+GETPIVOTDATA(\" BAS045\",TABLAS!$A$95)","v":0},null,null,null,null,null,null,null,null,null,null,null,null,null,null,null,null,null,null,null,13,14,15,null,43,44,45,null,"=+IMPORTARDATOSDINAMICOS(\" BAS013\";TABLAS!$A$95)","=+IMPORTARDATOSDINAMICOS(\" BAS014\";TABLAS!$A$95)","=+IMPORTARDATOSDINAMICOS(\" BAS015\";TABLAS!$A$95)",null,"=+IMPORTARDATOSDINAMICOS(\" BAS043\";TABLAS!$A$95)","=+IMPORTARDATOSDINAMICOS(\" BAS044\";TABLAS!$A$95)","=+IMPORTARDATOSDINAMICOS(\" BAS045\";TABLAS!$A$95)",null,null,null,null,null,null,null,null,null,null,null,null,null,null,null,null,null,null,null,null,null,null,null,null,null,null,null,null,null,null,null,null,null,null,null,null,null,null,null,null,null,null,null,null,null,null,null,null,null,13,30]
["5 a 11 años",{"$f":"+GETPIVOTDATA(\" BAS016\",TABLAS!$A$95)","v":1219},{"$f":"+GETPIVOTDATA(\" BAS017\",TABLAS!$A$95)","v":0},{"$f":"+GETPIVOTDATA(\" BAS018\",TABLAS!$A$95)","v":0},null,"De 3 años",null,{"$f":"+GETPIVOTDATA(\" BAS046\",TABLAS!$A$95)","v":43},{"$f":"+GETPIVOTDATA(\" BAS047\",TABLAS!$A$95)","v":0},{"$f":"+GETPIVOTDATA(\" BAS048\",TABLAS!$A$95)","v":0},null,null,null,null,null,null,null,null,null,null,null,null,null,null,null,null,null,null,null,16,17,18,null,46,47,48,null,"=+IMPORTARDATOSDINAMICOS(\" BAS016\";TABLAS!$A$95)","=+IMPORTARDATOSDINAMICOS(\" BAS017\";TABLAS!$A$95)","=+IMPORTARDATOSDINAMICOS(\" BAS018\";TABLAS!$A$95)",null,"=+IMPORTARDATOSDINAMICOS(\" BAS046\";TABLAS!$A$95)","=+IMPORTARDATOSDINAMICOS(\" BAS047\";TABLAS!$A$95)","=+IMPORTARDATOSDINAMICOS(\" BAS048\";TABLAS!$A$95)",null,null,null,null,null,null,null,null,null,null,null,null,null,null,null,null,null,null,null,null,null,null,null,null,null,null,null,null,null,null,null,null,null,null,null,null,null,null,null,null,null,null,null,null,null,null,null,null,null,14,30]
["12 a 17 años Mujeres",{"$f":"+GETPIVOTDATA(\" BAS019\",TABLAS!$A$95)","v":1824},{"$f":"+GETPIVOTDATA(\" BAS020\",TABLAS!$A$95)","v":7},{"$f":"+GETPIVOTDATA(\" BAS021\",TABLAS!$A$95)","v":0},null,"De 4 años",null,{"$f":"+GETPIVOTDATA(\" BAS049\",TABLAS!$A$95)","v":36},{"$f":"+GETPIVOTDATA(\" BAS050\",TABLAS!$A$95)","v":0},{"$f":"+GETPIVOTDATA(\" BAS051\",TABLAS!$A$95)","v":0},null,null,null,null,null,null,null,null,null,null,null,null,null,null,null,null,null,null,null,19,20,21,null,49,50,51,null,"=+IMPORTARDATOSDINAMICOS(\" BAS019\";TABLAS!$A$95)","=+IMPORTARDATOSDINAMICOS(\" BAS020\";TABLAS!$A$95)","=+IMPORTARDATOSDINAMICOS(\" BAS021\";TABLAS!$A$95)",null,"=+IMPORTARDATOSDINAMICOS(\" BAS049\";TABLAS!$A$95)","=+IMPORTARDATOSDINAMICOS(\" BAS050\";TABLAS!$A$95)","=+IMPORTARDATOSDINAMICOS(\" BAS051\";TABLAS!$A$95)",null,null,null,null,null,null,null,null,null,null,null,null,null,null,null,null,null,null,null,null,null,null,null,null,null,null,null,null,null,null,null,null,null,null,null,null,null,null,null,null,null,null,null,null,null,null,null,null,null,15,30,{"$f":"SUM(CQ68:CQ82)","v":450},435,{"$f":"+CS82+105","v":540}]
["MEF",{"$f":"+GETPIVOTDATA(\" BAS022\",TABLAS!$A$95)","v":134},{"$f":"+GETPIVOTDATA(\" BAS023\",TABLAS!$A$95)","v":0},{"$f":"+GETPIVOTDATA(\" BAS024\",TABLAS!$A$95)","v":0},null,"De 5 a 11 años",null,{"$f":"+GETPIVOTDATA(\" BAS052\",TABLAS!$A$95)","v":20},{"$f":"+GETPIVOTDATA(\" BAS053\",TABLAS!$A$95)","v":0},{"$f":"+GETPIVOTDATA(\" BAS054\",TABLAS!$A$95)","v":0},null,null,null,null,null,null,null,null,null,null,null,null,null,null,null,null,null,null,null,22,23,24,null,52,53,54,null,"=+IMPORTARDATOSDINAMICOS(\" BAS022\";TABLAS!$A$95)","=+IMPORTARDATOSDINAMICOS(\" BAS023\";TABLAS!$A$95)","=+IMPORTARDATOSDINAMICOS(\" BAS024\";TABLAS!$A$95)",null,"=+IMPORTARDATOSDINAMICOS(\" BAS052\";TABLAS!$A$95)","=+IMPORTARDATOSDINAMICOS(\" BAS053\";TABLAS!$A$95)","=+IMPORTARDATOSDINAMICOS(\" BAS054\";TABLAS!$A$95)",null,null,null,null,null,null,null,null,null,null,null,null,null,null,null,null,null,null,null,null,null,null,null,null,null,null,null,null,null,null,null,null,null,null,null,null,null,null,null,null,null,null,null,null,null,null,null,null,null,16,30]
["Gestante",{"$f":"+GETPIVOTDATA(\" BAS025\",TABLAS!$A$95)","v":693},{"$f":"+GETPIVOTDATA(\" BAS026\",TABLAS!$A$95)","v":469},{"$f":"+GETPIVOTDATA(\" BAS027\",TABLAS!$A$95)","v":344},null,"De 12 a 17 años Mujeres",null,{"$f":"+GETPIVOTDATA(\" BAS055\",TABLAS!$A$95)","v":20},{"$f":"+GETPIVOTDATA(\" BAS056\",TABLAS!$A$95)","v":0},{"$f":"+GETPIVOTDATA(\" BAS057\",TABLAS!$A$95)","v":0},null,null,null,null,null,null,null,null,null,null,null,null,null,null,null,null,null,null,null,25,26,27,null,55,56,57,null,"=+IMPORTARDATOSDINAMICOS(\" BAS025\";TABLAS!$A$95)","=+IMPORTARDATOSDINAMICOS(\" BAS026\";TABLAS!$A$95)","=+IMPORTARDATOSDINAMICOS(\" BAS027\";TABLAS!$A$95)",null,"=+IMPORTARDATOSDINAMICOS(\" BAS055\";TABLAS!$A$95)","=+IMPORTARDATOSDINAMICOS(\" BAS056\";TABLAS!$A$95)","=+IMPORTARDATOSDINAMICOS(\" BAS057\";TABLAS!$A$95)",null,null,null,null,null,null,null,null,null,null,null,null,null,null,null,null,null,null,null,null,null,null,null,null,null,null,null,null,null,null,null,null,null,null,null,null,null,null,null,null,null,null,null,null,null,null,null,null,null,17,30]
["Puepera",{"$f":"+GETPIVOTDATA(\" BAS028\",TABLAS!$A$95)","v":466},{"$f":"+GETPIVOTDATA(\" BAS029\",TABLAS!$A$95)","v":0},{"$f":"+GETPIVOTDATA(\" BAS030\",TABLAS!$A$95)","v":0},null,"MEF",null,{"$f":"+GETPIVOTDATA(\" BAS058\",TABLAS!$A$95)","v":33},{"$f":"+GETPIVOTDATA(\" BAS059\",TABLAS!$A$95)","v":0},{"$f":"+GETPIVOTDATA(\" BAS060\",TABLAS!$A$95)","v":0},null,null,null,null,null,null,null,null,null,null,null,null,null,null,null,null,null,null,null,28,29,30,null,58,59,60,null,"=+IMPORTARDATOSDINAMICOS(\" BAS028\";TABLAS!$A$95)","=+IMPORTARDATOSDINAMICOS(\" BAS029\";TABLAS!$A$95)","=+IMPORTARDATOSDINAMICOS(\" BAS030\";TABLAS!$A$95)",null,"=+IMPORTARDATOSDINAMICOS(\" BAS058\";TABLAS!$A$95)","=+IMPORTARDATOSDINAMICOS(\" BAS059\";TABLAS!$A$95)","=+IMPORTARDATOSDINAMICOS(\" BAS060\";TABLAS!$A$95)",null,null,null,null,null,null,null,null,null,null,null,null,null,null,null,null,null,null,null,null,null,null,null,null,null,null,null,null,null,null,null,null,null,null,null,null,null,null,null,null,null,null,null,null,null,null,null,null,null,18,30,{"$f":"SUM(CQ68:CQ85)","v":540},525,{"$f":"+CS85+105","v":630}]
[null,null,null,null,null,"Gestantes",null,{"$f":"+GETPIVOTDATA(\" BAS061\",TABLAS!$A$95)","v":0},{"$f":"+GETPIVOTDATA(\" BAS062\",TABLAS!$A$95)","v":0},{"$f":"+GETPIVOTDATA(\" BAS063\",TABLAS!$A$95)","v":0},null,null,null,null,null,null,null,null,null,null,null,null,null,null,null,null,null,null,null,null,null,null,null,61,62,63,null,"=+IMPORTARDATOSDINAMICOS(\" BAS00\";TABLAS!$A$95)","=+IMPORTARDATOSDINAMICOS(\" BAS00\";TABLAS!$A$95)","=+IMPORTARDATOSDINAMICOS(\" BAS00\";TABLAS!$A$95)",null,"=+IMPORTARDATOSDINAMICOS(\" BAS061\";TABLAS!$A$95)","=+IMPORTARDATOSDINAMICOS(\" BAS062\";TABLAS!$A$95)","=+IMPORTARDATOSDINAMICOS(\" BAS063\";TABLAS!$A$95)",null,null,null,null,null,null,null,null,null,null,null,null,null,null,null,null,null,null,null,null,null,null,null,null,null,null,null,null,null,null,null,null,null,null,null,null,null,null,null,null,null,null,null,null,null,null,null,null,null,19,30]
[null,null,null,null,null,null,null,null,null,null,null,null,null,null,null,null,null,null,null,null,null,null,null,null,null,null,null,null,null,null,null,null,null,null,null,null,null,null,null,null,null,null,null,null,null,null,null,null,null,null,null,null,null,null,null,null,null,null,null,null,null,null,null,null,null,null,null,null,null,null,null,null,null,null,null,null,null,null,null,null,null,null,null,null,null,null,null,null,null,null,null,null,null,20,30]
["8. VISITAS DE SEGUIMIENTO /TELEORIENTACION",null,null,null,null,null,null,null,null,null,null,null,null,null,null,null,null,null,null,null,null,null,null,null,null,null,null,null,null,null,null,null,null,null,null,null,null,null,null,null,null,null,null,null,null,null,null,null,null,null,null,null,null,null,null,null,null,null,null,null,null,null,null,null,null,null,null,null,null,null,null,null,null,null,null,null,null,null,null,null,null,null,null,null,null,null,null,null,null,null,null,null,null,21,30,{"$f":"SUM(CQ68:CQ88)","v":630},615,{"$f":"+CS88+105","v":720}]
[null,null,null,null,null,null,null,null,null,null,null,null,null,null,null,null,null,null,null,null,null,null,null,null,null,null,null,null,null,null,null,null,null,null,null,null,null,null,null,null,null,null,null,null,null,null,null,null,null,null,null,null,null,null,null,null,null,null,null,null,null,null,null,null,null,null,null,null,null,null,null,null,null,null,null,null,null,null,null,null,null,null,null,null,null,null,null,null,null,null,null,null,null,22,30]
["Actividades \nOperativas ","Visita de Seguimiento o Teleorientación",null,null,null,null,null,null,null,null,null,null,null,null,null,null,null,null,null,null,null,null,null,null,null,null,null,null,null,null,null,null,null,null,null,null,null,null,null,null,null,null,null,null,null,null,null,null,null,null,null,null,null,null,null,null,null,null,null,null,null,null,null,null,null,null,null,null,null,null,null,null,null,null,null,null,null,null,null,null,null,null,null,null,null,null,null,null,null,null,null,null,null,23,30]
[null,"1er","2do","3ro",null,null,null,null,null,null,null,null,null,null,null,null,null,null,null,null,null,null,null,null,null,null,null,null,null,null,null,null,null,null,null,null,null,null,null,null,null,null,null,null,null,null,null,null,null,null,null,null,null,null,null,null,null,null,null,null,null,null,null,null,null,null,null,null,null,null,null,null,null,null,null,null,null,null,null,null,null,null,null,null,null,null,null,null,null,null,null,null,null,24,30,{"$f":"SUM(CQ68:CQ91)","v":720},705,{"$f":"+CS91+165","v":870}]
["RN bajo Peso o Prematuro",{"$f":"+GETPIVOTDATA(\" BAS064\",TABLAS!$A$95)","v":4},{"$f":"+GETPIVOTDATA(\" BAS065\",TABLAS!$A$95)","v":7},{"$f":"+GETPIVOTDATA(\" BAS066\",TABLAS!$A$95)","v":328},null,null,null,null,null,null,null,null,null,null,null,null,null,null,null,null,null,null,null,null,null,null,null,null,null,{"$f":"+AJ86+1","v":64},{"$f":"+AD92+1","v":65},{"$f":"+AE92+1","v":66},null,null,null,null,null,{"$f":"IF(AD92<9,CONCATENATE($AL$18,\"00\",AD92,$AL$75),IF(AND(AD92>9,AD92<100),CONCATENATE($AL$18,\"0\",AD92,$AL$75),IF(AD92>99,CONCATENATE($AL$18,AD92,$AL$75))))","v":"=+IMPORTARDATOSDINAMICOS(\" BAS064\";TABLAS!$A$95)"},{"$f":"IF(AE92<9,CONCATENATE($AL$18,\"00\",AE92,$AL$75),IF(AND(AE92>9,AE92<100),CONCATENATE($AL$18,\"0\",AE92,$AL$75),IF(AE92>99,CONCATENATE($AL$18,AE92,$AL$75))))","v":"=+IMPORTARDATOSDINAMICOS(\" BAS065\";TABLAS!$A$95)"},"=+IMPORTARDATOSDINAMICOS(\" BAS066\";TABLAS!$A$95)",null,null,null,null,null,null,null,null,null,null,null,null,null,null,null,null,null,null,null,null,null,null,null,null,null,null,null,null,null,null,null,null,null,null,null,null,null,null,null,null,null,null,null,null,null,null,null,null,null,null,null,null,null,25,30]
["6 a 11 meses",{"$f":"+GETPIVOTDATA(\" BAS067\",TABLAS!$A$95)","v":190},{"$f":"+GETPIVOTDATA(\" BAS068\",TABLAS!$A$95)","v":205},{"$f":"+GETPIVOTDATA(\" BAS069\",TABLAS!$A$95)","v":148},null,null,null,null,null,null,null,null,null,null,null,null,null,null,null,null,null,null,null,null,null,null,null,null,null,{"$f":"+AF92+1","v":67},{"$f":"+AD93+1","v":68},69,null,null,null,null,null,{"$f":"IF(AD93<9,CONCATENATE($AL$18,\"00\",AD93,$AL$75),IF(AND(AD93>9,AD93<100),CONCATENATE($AL$18,\"0\",AD93,$AL$75),IF(AD93>99,CONCATENATE($AL$18,AD93,$AL$75))))","v":"=+IMPORTARDATOSDINAMICOS(\" BAS067\";TABLAS!$A$95)"},{"$f":"IF(AE93<9,CONCATENATE($AL$18,\"00\",AE93,$AL$75),IF(AND(AE93>9,AE93<100),CONCATENATE($AL$18,\"0\",AE93,$AL$75),IF(AE93>99,CONCATENATE($AL$18,AE93,$AL$75))))","v":"=+IMPORTARDATOSDINAMICOS(\" BAS068\";TABLAS!$A$95)"},{"$f":"IF(AF93<9,CONCATENATE($AL$18,\"00\",AF93,$AL$75),IF(AND(AF93>9,AF93<100),CONCATENATE($AL$18,\"0\",AF93,$AL$75),IF(AF93>99,CONCATENATE($AL$18,AF93,$AL$75))))","v":"=+IMPORTARDATOSDINAMICOS(\" BAS069\";TABLAS!$A$95)"},null,null,null,null,null,null,null,null,null,null,null,null,null,null,null,null,null,null,null,null,null,null,null,null,null,null,null,null,null,null,null,null,null,null,null,null,null,null,null,null,null,null,null,null,null,null,null,null,null,null,null,null,null,26,30,{"$f":"SUM(CQ68:CQ93)","v":780}]
["12 a 23 meses",{"$f":"+GETPIVOTDATA(\" BAS070\",TABLAS!$A$95)","v":40},{"$f":"+GETPIVOTDATA(\" BAS071\",TABLAS!$A$95)","v":113},{"$f":"+GETPIVOTDATA(\" BAS072\",TABLAS!$A$95)","v":134},null,null,null,null,null,null,null,null,null,null,null,null,null,null,null,null,null,null,null,null,null,null,null,null,null,{"$f":"+AF93+1","v":70},{"$f":"+AD94+1","v":71},72,null,null,null,null,null,"=+IMPORTARDATOSDINAMICOS(\" BAS070\";TABLAS!$A$95)","=+IMPORTARDATOSDINAMICOS(\" BAS071\";TABLAS!$A$95)","=+IMPORTARDATOSDINAMICOS(\" BAS072\";TABLAS!$A$95)",null,null,null,null,null,null,null,null,null,null,null,null,null,null,null,null,null,null,null,null,null,null,null,null,null,null,null,null,null,null,null,null,null,null,null,null,null,null,null,null,null,null,null,null,null,null,null,null,null,null,null,null,null,27,30]
["24 a 35 meses",{"$f":"+GETPIVOTDATA(\" BAS073\",TABLAS!$A$95)","v":61},{"$f":"+GETPIVOTDATA(\" BAS074\",TABLAS!$A$95)","v":55},{"$f":"+GETPIVOTDATA(\" BAS075\",TABLAS!$A$95)","v":0},null,null,null,null,null,null,null,null,null,null,null,null,null,null,null,null,null,null,null,null,null,null,null,null,null,73,74,75,null,null,null,null,null,"=+IMPORTARDATOSDINAMICOS(\" BAS073\";TABLAS!$A$95)","=+IMPORTARDATOSDINAMICOS(\" BAS074\";TABLAS!$A$95)","=+IMPORTARDATOSDINAMICOS(\" BAS075\";TABLAS!$A$95)",null,null,null,null,null,null,null,null,null,null,null,null,null,null,null,null,null,null,null,null,null,null,null,null,null,null,null,null,null,null,null,null,null,null,null,null,null,null,null,null,null,null,null,null,null,null,null,null,null,null,null,null,null,28,30]
["36 a 59 meses",{"$f":"+GETPIVOTDATA(\" BAS076\",TABLAS!$A$95)","v":0},{"$f":"+GETPIVOTDATA(\" BAS077\",TABLAS!$A$95)","v":0},{"$f":"+GETPIVOTDATA(\" BAS078\",TABLAS!$A$95)","v":0},null,null,null,null,null,null,null,null,null,null,null,null,null,null,null,null,null,null,null,null,null,null,null,null,null,76,77,78,null,null,null,null,null,"=+IMPORTARDATOSDINAMICOS(\" BAS076\";TABLAS!$A$95)","=+IMPORTARDATOSDINAMICOS(\" BAS077\";TABLAS!$A$95)","=+IMPORTARDATOSDINAMICOS(\" BAS078\";TABLAS!$A$95)",null,null,null,null,null,null,null,null,null,null,null,null,null,null,null,null,null,null,null,null,null,null,null,null,null,null,null,null,null,null,null,null,null,null,null,null,null,null,null,null,null,null,null,null,null,null,null,null,null,null,null,null,null,29,30]
["5 a 11 Años",{"$f":"+GETPIVOTDATA(\" BAS079\",TABLAS!$A$95)","v":0},{"$f":"+GETPIVOTDATA(\" BAS080\",TABLAS!$A$95)","v":0},{"$f":"+GETPIVOTDATA(\" BAS081\",TABLAS!$A$95)","v":0},null,null,null,null,null,null,null,null,null,null,null,null,null,null,null,null,null,null,null,null,null,null,null,null,null,79,80,81,null,null,null,null,null,"=+IMPORTARDATOSDINAMICOS(\" BAS079\";TABLAS!$A$95)","=+IMPORTARDATOSDINAMICOS(\" BAS080\";TABLAS!$A$95)","=+IMPORTARDATOSDINAMICOS(\" BAS081\";TABLAS!$A$95)",null,null,null,null,null,null,null,null,null,null,null,null,null,null,null,null,null,null,null,null,null,null,null,null,null,null,null,null,null,null,null,null,null,null,null,null,null,null,null,null,null,null,null,null,null,null,null,null,null,null,null,null,null,30,30,{"$f":"SUM(CQ68:CQ97)","v":900},885,{"$f":"+CS97+165","v":1050}]
["Adolescentes /MEF",{"$f":"+GETPIVOTDATA(\" BAS082\",TABLAS!$A$95)","v":0},{"$f":"+GETPIVOTDATA(\" BAS083\",TABLAS!$A$95)","v":0},{"$f":"+GETPIVOTDATA(\" BAS084\",TABLAS!$A$95)","v":0},null,null,null,null,null,null,null,null,null,null,null,null,null,null,null,null,null,null,null,null,null,null,null,null,null,82,83,84,null,null,null,null,null,"=+IMPORTARDATOSDINAMICOS(\" BAS082\";TABLAS!$A$95)","=+IMPORTARDATOSDINAMICOS(\" BAS083\";TABLAS!$A$95)","=+IMPORTARDATOSDINAMICOS(\" BAS084\";TABLAS!$A$95)",null,null,null,null,null,null,null,null,null,null,null,null,null,null,null,null,null,null,null,null,null,null,null,null,null,null,null,null,null,null,null,null,null,null,null,null,null,null,null,null,null,null,null,null,null,null,null,null,null,null,null,null,null,31,30]
["Gestantes ",{"$f":"+GETPIVOTDATA(\" BAS085\",TABLAS!$A$95)","v":0},{"$f":"+GETPIVOTDATA(\" BAS086\",TABLAS!$A$95)","v":0},{"$f":"+GETPIVOTDATA(\" BAS087\",TABLAS!$A$95)","v":0},null,null,null,null,null,null,null,null,null,null,null,null,null,null,null,null,null,null,null,null,null,null,null,null,null,85,86,87,null,null,null,null,null,"=+IMPORTARDATOSDINAMICOS(\" BAS085\";TABLAS!$A$95)","=+IMPORTARDATOSDINAMICOS(\" BAS086\";TABLAS!$A$95)","=+IMPORTARDATOSDINAMICOS(\" BAS087\";TABLAS!$A$95)",null,null,null,null,null,null,null,null,null,null,null,null,null,null,null,null,null,null,null,null,null,null,null,null,null,null,null,null,null,null,null,null,null,null,null,null,null,null,null,null,null,null,null,null,null,null,null,null,null,null,null,null,null,32,30]
[null,null,null,null,null,null,null,null,null,null,null,null,null,null,null,null,null,null,null,null,null,null,null,null,null,null,null,null,null,null,null,null,null,null,null,null,null,null,null,null,null,null,null,null,null,null,null,null,null,null,null,null,null,null,null,null,null,null,null,null,null,null,null,null,null,null,null,null,null,null,null,null,null,null,null,null,null,null,null,null,null,null,null,null,null,null,null,null,null,null,null,null,null,33,30]
[null,null,null,null,null,null,null,null,null,null,null,null,null,null,null,null,null,null,null,null,null,null,null,null,null,null,null,null,null,null,null,null,null,null,null,null,null,null,null,null,null,null,null,null,null,null,null,null,null,null,null,null,null,null,null,null,null,null,null,null,null,null,null,null,null,null,null,null,null,null,null,null,null,null,null,null,null,null,null,null,null,null,null,null,null,null,null,null,null,null,null,null,null,34,30]
[null,null,null,null,null,null,null,null,null,null,null,null,null,null,null,null,null,null,null,null,null,null,null,null,null,null,null,null,null,null,null,null,null,null,null,null,null,null,null,null,null,null,null,null,null,null,null,null,null,null,null,null,null,null,null,null,null,null,null,null,null,null,null,null,null,null,null,null,null,null,null,null,null,null,null,null,null,null,null,null,null,null,null,null,null,null,null,null,null,null,null,null,null,35,30]
[null,null,null,null,null,null,null,null,null,null,null,null,null,null,null,null,null,null,null,null,null,null,null,null,null,null,null,null,null,null,null,null,null,null,null,null,null,null,null,null,null,null,null,null,null,null,null,null,null,null,null,null,null,null,null,null,null,null,null,null,null,null,null,null,null,null,null,null,null,null,null,null,null,null,null,null,null,null,null,null,null,null,null,null,null,null,null,null,null,null,null,null,null,36,30,{"$f":"SUM(CQ68:CQ103)","v":1080},1065,{"$f":"+CS103+70","v":1135}]
[null,null,null,null,null,null,null,null,null,null,null,null,null,null,null,null,null,null,null,null,null,null,null,null,null,null,null,null,null,null,null,null,null,null,null,null,null,null,null,null,null,null,null,null,null,null,null,null,null,null,null,null,null,null,null,null,null,null,null,null,null,null,null,null,null,null,null,null,null,null,null,null,null,null,null,null,null,null,null,null,null,null,null,null,null,null,null,null,null,null,null,null,null,37,30]
[null,null,null,null,null,null,null,null,null,null,null,null,null,null,null,null,null,null,null,null,null,null,null,null,null,null,null,null,null,null,null,null,null,null,null,null,null,null,null,null,null,null,null,null,null,null,null,null,null,null,null,null,null,null,null,null,null,null,null,null,null,null,null,null,null,null,null,null,null,null,null,null,null,null,null,null,null,null,null,null,null,null,null,null,null,null,null,null,null,null,null,null,null,38,30]
[null,null,null,null,null,null,null,null,null,null,null,null,null,null,null,null,null,null,null,null,null,null,null,null,null,null,null,null,null,null,null,null,null,null,null,null,null,null,null,null,null,null,null,null,null,null,null,null,null,null,null,null,null,null,null,null,null,null,null,null,null,null,null,null,null,null,null,null,null,null,null,null,null,null,null,null,null,null,null,null,null,null,null,null,null,null,null,null,null,null,null,null,null,39,30,{"$f":"SUM(CQ68:CQ106)","v":1170},1155,{"$f":"+CS106+105","v":1260}]
[null,null,null,null,null,null,null,null,null,null,null,null,null,null,null,null,null,null,null,null,null,null,null,null,null,null,null,null,null,null,null,null,null,null,null,null,null,null,null,null,null,null,null,null,null,null,null,null,null,null,null,null,null,null,null,null,null,null,null,null,null,null,null,null,null,null,null,null,null,null,null,null,null,null,null,null,null,null,null,null,null,null,null,null,null,null,null,null,null,null,null,null,null,40,30]
[null,null,null,null,null,null,null,null,null,null,null,null,null,null,null,null,null,null,null,null,null,null,null,null,null,null,null,null,null,null,null,null,null,null,null,null,null,null,null,null,null,null,null,null,null,null,null,null,null,null,null,null,null,null,null,null,null,null,null,null,null,null,null,null,null,null,null,null,null,null,null,null,null,null,null,null,null,null,null,null,null,null,null,null,null,null,null,null,null,null,null,null,null,41,30]

{"sheet":"TTO. ANEMIA","index":4,"n_rows":43,"n_cols":56,"rows_kept":43,"cut":false,"hidden":false,"merged":[[7,6,7,7],[8,1,8,2],[8,4,8,5],[8,6,8,7],[0,0,0,17],[1,0,1,17],[2,0,2,17],[3,0,3,17],[5,1,5,2],[5,4,5,5],[5,6,5,9],[6,1,6,2],[6,4,6,5],[7,1,7,2],[7,4,7,5],[9,1,9,2],[9,4,9,5],[24,0,25,0],[31,0,32,0],[31,1,31,6],[9,6,9,7],[10,1,10,2],[11,1,11,2],[17,0,17,1],[18,0,23,0],[12,1,12,2]]}
["GERENCIA REGIONAL DE SALUD CUSCO"]
["DIRECCION DE ESTADISTICA E INFORMATICA Y TELECOMUNICACION"]
["Estrategia Sanitaria Alimentación y Nutricion Saludable"]
["Informe Mensual de Suplementación Preventiva y Terapeutica"]
[]
["DIRESA","CUSCO",null,null,"EJECUTORA",null,{"$f":"+TABLAS!O14","v":""}]
[]
["RED DE SALUD ",{"$f":"+TABLAS!O9","v":""},null,null,"PROVINCIA",null,{"$f":"+TABLAS!O12","v":""}]
[]
["MICRO RED",{"$f":"+TABLAS!O10","v":""},null,null,"DISTRITO",null,{"$f":"+TABLAS!O13","v":""}]
[]
["EE.SS.",{"$f":"+TABLAS!O11","v":""}]
[]
[null,null,null,null,null,"AÑO",{"$f":"+TABLAS!J16","v":"2025"},"MES",{"$f":"+TABLAS!N26","v":"ENE - MAY"},null,null,null,null,null,null,null,null,null,null,null,null,null,null,null,null,null,null,null,null,null,null,null,null,null,null,null,null,null,null,null,null,{"$f":"+GETPIVOTDATA(\" BAS001\",TABLAS!$A$130)","v":0}]
[]
["1. ADMINISTRACION DE TRATAMIENTO CON SULFATO FERROSO",null,null,null,null,null,null,null,null,null,null,"4. CONSULTA NUTRICIONAL",null,null,null,null,null,null,null,null,null,null,null,null,null,null,null,null,null,null,null,null,null,null,null,null,null,null,null,null,null,"=+IMPORTARDATOSDINAMICOS(\" BAS"]
[]
["GRUPOS ETAREOS",null,"1 Dosis","2 Dosis","3 Dosis","4 Dosis","5 Dosis","6 Dosis ","TA","PR",null,"EDAD",1,2,3,4,5,6,null,null,null,null,null,null,null,null,null,null,null,null,null,null,null,null,null,null,null,null,null,null,null,"\";TABLAS!$A$130)",null,null,null,null,null,null,"C",null,"A",null,null,null,null,"G"]
["Niños menores de 5 años","0-5 MESES",{"$f":"+GETPIVOTDATA(\" BAS001\",TABLAS!$A$130)","v":0},{"$f":"+GETPIVOTDATA(\" BAS002\",TABLAS!$A$130)","v":0},{"$f":"+GETPIVOTDATA(\" BAS003\",TABLAS!$A$130)","v":0},{"$f":"+GETPIVOTDATA(\" BAS004\",TABLAS!$A$130)","v":0},{"$f":"+GETPIVOTDATA(\" BAS005\",TABLAS!$A$130)","v":0},{"$f":"+GETPIVOTDATA(\" BAS006\",TABLAS!$A$130)","v":0},{"$f":"+GETPIVOTDATA(\" BAS007\",TABLAS!$A$130)","v":0},{"$f":"+GETPIVOTDATA(\" BAS008\",TABLAS!$A$130)","v":0},null,"0-5 MESES",{"$f":"+GETPIVOTDATA(\" BAS081\",TABLAS!$A$130)","v":0},{"$f":"+GETPIVOTDATA(\" BAS082\",TABLAS!$A$130)","v":0},{"$f":"+GETPIVOTDATA(\" BAS083\",TABLAS!$A$130)","v":0},{"$f":"+GETPIVOTDATA(\" BAS084\",TABLAS!$A$130)","v":0},{"$f":"+GETPIVOTDATA(\" BAS085\",TABLAS!$A$130)","v":0},{"$f":"+GETPIVOTDATA(\" BAS086\",TABLAS!$A$130)","v":0},null,null,null,null,null,1,{"$f":"+X19+1","v":2},{"$f":"+Y19+1","v":3},4,5,6,7,8,null,{"$f":"+AE28+1","v":81},{"$f":"+AG19+1","v":82},{"$f":"+AH19+1","v":83},84,85,86,null,null,null,{"$f":"IF(X19<10,CONCATENATE($AP$16,\"00\",X19,$AP$18),IF(AND(X19>9,X19<100),CONCATENATE($AP$16,\"0\",X19,$AP$18),IF(X19>99,CONCATENATE($AP$16,X19,$AP$18))))","v":"=+IMPORTARDATOSDINAMICOS(\" BAS001\";TABLAS!$A$130)"},{"$f":"IF(Y19<10,CONCATENATE($AP$16,\"00\",Y19,$AP$18),IF(AND(Y19>9,Y19<100),CONCATENATE($AP$16,\"0\",Y19,$AP$18),IF(Y19>99,CONCATENATE($AP$16,Y19,$AP$18))))","v":"=+IMPORTARDATOSDINAMICOS(\" BAS002\";TABLAS!$A$130)"},"=+IMPORTARDATOSDINAMICOS(\" BAS003\";TABLAS!$A$130)","=+IMPORTARDATOSDINAMICOS(\" BAS004\";TABLAS!$A$130)","=+IMPORTARDATOSDINAMICOS(\" BAS005\";TABLAS!$A$130)","=+IMPORTARDATOSDINAMICOS(\" BAS006\";TABLAS!$A$130)","=+IMPORTARDATOSDINAMICOS(\" BAS007\";TABLAS!$A$130)","=+IMPORTARDATOSDINAMICOS(\" BAS008\";TABLAS!$A$130)",null,{"$f":"IF(AG19<10,CONCATENATE($AP$16,\"00\",AG19,$AP$18),IF(AND(AG19>9,AG19<100),CONCATENATE($AP$16,\"0\",AG19,$AP$18),IF(AG19>99,CONCATENATE($AP$16,AG19,$AP$18))))","v":"=+IMPORTARDATOSDINAMICOS(\" BAS081\";TABLAS!$A$130)"},{"$f":"IF(AH19<10,CONCATENATE($AP$16,\"00\",AH19,$AP$18),IF(AND(AH19>9,AH19<100),CONCATENATE($AP$16,\"0\",AH19,$AP$18),IF(AH19>99,CONCATENATE($AP$16,AH19,$AP$18))))","v":"=+IMPORTARDATOSDINAMICOS(\" BAS082\";TABLAS!$A$130)"},{"$f":"IF(AI19<10,CONCATENATE($AP$16,\"00\",AI19,$AP$18),IF(AND(AI19>9,AI19<100),CONCATENATE($AP$16,\"0\",AI19,$AP$18),IF(AI19>99,CONCATENATE($AP$16,AI19,$AP$18))))","v":"=+IMPORTARDATOSDINAMICOS(\" BAS083\";TABLAS!$A$130)"},{"$f":"IF(AJ19<10,CONCATENATE($AP$16,\"00\",AJ19,$AP$18),IF(AND(AJ19>9,AJ19<100),CONCATENATE($AP$16,\"0\",AJ19,$AP$18),IF(AJ19>99,CONCATENATE($AP$16,AJ19,$AP$18))))","v":"=+IMPORTARDATOSDINAMICOS(\" BAS084\";TABLAS!$A$130)"},{"$f":"IF(AK19<10,CONCATENATE($AP$16,\"00\",AK19,$AP$18),IF(AND(AK19>9,AK19<100),CONCATENATE($AP$16,\"0\",AK19,$AP$18),IF(AK19>99,CONCATENATE($AP$16,AK19,$AP$18))))","v":"=+IMPORTARDATOSDINAMICOS(\" BAS085\";TABLAS!$A$130)"},{"$f":"IF(AL19<10,CONCATENATE($AP$16,\"00\",AL19,$AP$18),IF(AND(AL19>9,AL19<100),CONCATENATE($AP$16,\"0\",AL19,$AP$18),IF(AL19>99,CONCATENATE($AP$16,AL19,$AP$18))))","v":"=+IMPORTARDATOSDINAMICOS(\" BAS086\";TABLAS!$A$130)"}]
[null,"6-11m ",{"$f":"+GETPIVOTDATA(\" BAS009\",TABLAS!$A$130)","v":139},{"$f":"+GETPIVOTDATA(\" BAS010\",TABLAS!$A$130)","v":102},{"$f":"+GETPIVOTDATA(\" BAS011\",TABLAS!$A$130)","v":109},{"$f":"+GETPIVOTDATA(\" BAS012\",TABLAS!$A$130)","v":90},{"$f":"+GETPIVOTDATA(\" BAS013\",TABLAS!$A$130)","v":69},{"$f":"+GETPIVOTDATA(\" BAS014\",TABLAS!$A$130)","v":48},{"$f":"+GETPIVOTDATA(\" BAS015\",TABLAS!$A$130)","v":0},{"$f":"+GETPIVOTDATA(\" BAS016\",TABLAS!$A$130)","v":0},null,"6-11m ",{"$f":"+GETPIVOTDATA(\" BAS087\",TABLAS!$A$130)","v":13},{"$f":"+GETPIVOTDATA(\" BAS088\",TABLAS!$A$130)","v":8},{"$f":"+GETPIVOTDATA(\" BAS089\",TABLAS!$A$130)","v":2},{"$f":"+GETPIVOTDATA(\" BAS090\",TABLAS!$A$130)","v":0},{"$f":"+GETPIVOTDATA(\" BAS091\",TABLAS!$A$130)","v":0},{"$f":"+GETPIVOTDATA(\" BAS092\",TABLAS!$A$130)","v":0},null,null,null,null,null,{"$f":"+AE19+1","v":9},{"$f":"+X20+1","v":10},11,12,13,14,15,16,null,{"$f":"+AL19+1","v":87},{"$f":"+AG20+1","v":88},89,90,91,92,null,null,null,{"$f":"IF(X20<10,CONCATENATE($AP$16,\"00\",X20,$AP$18),IF(AND(X20>9,X20<100),CONCATENATE($AP$16,\"0\",X20,$AP$18),IF(X20>99,CONCATENATE($AP$16,X20,$AP$18))))","v":"=+IMPORTARDATOSDINAMICOS(\" BAS009\";TABLAS!$A$130)"},{"$f":"IF(Y20<10,CONCATENATE($AP$16,\"00\",Y20,$AP$18),IF(AND(Y20>9,Y20<100),CONCATENATE($AP$16,\"0\",Y20,$AP$18),IF(Y20>99,CONCATENATE($AP$16,Y20,$AP$18))))","v":"=+IMPORTARDATOSDINAMICOS(\" BAS010\";TABLAS!$A$130)"},{"$f":"IF(Z20<10,CONCATENATE($AP$16,\"00\",Z20,$AP$18),IF(AND(Z20>9,Z20<100),CONCATENATE($AP$16,\"0\",Z20,$AP$18),IF(Z20>99,CONCATENATE($AP$16,Z20,$AP$18))))","v":"=+IMPORTARDATOSDINAMICOS(\" BAS011\";TABLAS!$A$130)"},{"$f":"IF(AA20<10,CONCATENATE($AP$16,\"00\",AA20,$AP$18),IF(AND(AA20>9,AA20<100),CONCATENATE($AP$16,\"0\",AA20,$AP$18),IF(AA20>99,CONCATENATE($AP$16,AA20,$AP$18))))","v":"=+IMPORTARDATOSDINAMICOS(\" BAS012\";TABLAS!$A$130)"},{"$f":"IF(AB20<10,CONCATENATE($AP$16,\"00\",AB20,$AP$18),IF(AND(AB20>9,AB20<100),CONCATENATE($AP$16,\"0\",AB20,$AP$18),IF(AB20>99,CONCATENATE($AP$16,AB20,$AP$18))))","v":"=+IMPORTARDATOSDINAMICOS(\" BAS013\";TABLAS!$A$130)"},{"$f":"IF(AC20<10,CONCATENATE($AP$16,\"00\",AC20,$AP$18),IF(AND(AC20>9,AC20<100),CONCATENATE($AP$16,\"0\",AC20,$AP$18),IF(AC20>99,CONCATENATE($AP$16,AC20,$AP$18))))","v":"=+IMPORTARDATOSDINAMICOS(\" BAS014\";TABLAS!$A$130)"},{"$f":"IF(AD20<10,CONCATENATE($AP$16,\"00\",AD20,$AP$18),IF(AND(AD20>9,AD20<100),CONCATENATE($AP$16,\"0\",AD20,$AP$18),IF(AD20>99,CONCATENATE($AP$16,AD20,$AP$18))))","v":"=+IMPORTARDATOSDINAMICOS(\" BAS015\";TABLAS!$A$130)"},{"$f":"IF(AE20<10,CONCATENATE($AP$16,\"00\",AE20,$AP$18),IF(AND(AE20>9,AE20<100),CONCATENATE($AP$16,\"0\",AE20,$AP$18),IF(AE20>99,CONCATENATE($AP$16,AE20,$AP$18))))","v":"=+IMPORTARDATOSDINAMICOS(\" BAS016\";TABLAS!$A$130)"},null,{"$f":"IF(AG20<10,CONCATENATE($AP$16,\"00\",AG20,$AP$18),IF(AND(AG20>9,AG20<100),CONCATENATE($AP$16,\"0\",AG20,$AP$18),IF(AG20>99,CONCATENATE($AP$16,AG20,$AP$18))))","v":"=+IMPORTARDATOSDINAMICOS(\" BAS087\";TABLAS!$A$130)"},{"$f":"IF(AH20<10,CONCATENATE($AP$16,\"00\",AH20,$AP$18),IF(AND(AH20>9,AH20<100),CONCATENATE($AP$16,\"0\",AH20,$AP$18),IF(AH20>99,CONCATENATE($AP$16,AH20,$AP$18))))","v":"=+IMPORTARDATOSDINAMICOS(\" BAS088\";TABLAS!$A$130)"},{"$f":"IF(AI20<10,CONCATENATE($AP$16,\"00\",AI20,$AP$18),IF(AND(AI20>9,AI20<100),CONCATENATE($AP$16,\"0\",AI20,$AP$18),IF(AI20>99,CONCATENATE($AP$16,AI20,$AP$18))))","v":"=+IMPORTARDATOSDINAMICOS(\" BAS089\";TABLAS!$A$130)"},{"$f":"IF(AJ20<10,CONCATENATE($AP$16,\"00\",AJ20,$AP$18),IF(AND(AJ20>9,AJ20<100),CONCATENATE($AP$16,\"0\",AJ20,$AP$18),IF(AJ20>99,CONCATENATE($AP$16,AJ20,$AP$18))))","v":"=+IMPORTARDATOSDINAMICOS(\" BAS090\";TABLAS!$A$130)"},{"$f":"IF(AK20<10,CONCATENATE($AP$16,\"00\",AK20,$AP$18),IF(AND(AK20>9,AK20<100),CONCATENATE($AP$16,\"0\",AK20,$AP$18),IF(AK20>99,CONCATENATE($AP$16,AK20,$AP$18))))","v":"=+IMPORTARDATOSDINAMICOS(\" BAS091\";TABLAS!$A$130)"},{"$f":"IF(AL20<10,CONCATENATE($AP$16,\"00\",AL20,$AP$18),IF(AND(AL20>9,AL20<100),CONCATENATE($AP$16,\"0\",AL20,$AP$18),IF(AL20>99,CONCATENATE($AP$16,AL20,$AP$18))))","v":"=+IMPORTARDATOSDINAMICOS(\" BAS092\";TABLAS!$A$130)"}]
[null,"1A",{"$f":"+GETPIVOTDATA(\" BAS017\",TABLAS!$A$130)","v":168},{"$f":"+GETPIVOTDATA(\" BAS018\",TABLAS!$A$130)","v":140},{"$f":"+GETPIVOTDATA(\" BAS019\",TABLAS!$A$130)","v":156},{"$f":"+GETPIVOTDATA(\" BAS020\",TABLAS!$A$130)","v":160},{"$f":"+GETPIVOTDATA(\" BAS021\",TABLAS!$A$130)","v":153},{"$f":"+GETPIVOTDATA(\" BAS022\",TABLAS!$A$130)","v":125},{"$f":"+GETPIVOTDATA(\" BAS023\",TABLAS!$A$130)","v":114},{"$f":"+GETPIVOTDATA(\" BAS024\",TABLAS!$A$130)","v":0},null,"1A",{"$f":"+GETPIVOTDATA(\" BAS093\",TABLAS!$A$130)","v":25},{"$f":"+GETPIVOTDATA(\" BAS094\",TABLAS!$A$130)","v":8},{"$f":"+GETPIVOTDATA(\" BAS095\",TABLAS!$A$130)","v":3},{"$f":"+GETPIVOTDATA(\" BAS096\",TABLAS!$A$130)","v":1},{"$f":"+GETPIVOTDATA(\" BAS097\",TABLAS!$A$130)","v":0},{"$f":"+GETPIVOTDATA(\" BAS098\",TABLAS!$A$130)","v":0},null,null,null,null,null,{"$f":"+AE20+1","v":17},18,19,20,21,22,23,24,null,{"$f":"+AL20+1","v":93},94,95,96,97,98,null,null,null,"=+IMPORTARDATOSDINAMICOS(\" BAS017\";TABLAS!$A$130)","=+IMPORTARDATOSDINAMICOS(\" BAS018\";TABLAS!$A$130)","=+IMPORTARDATOSDINAMICOS(\" BAS019\";TABLAS!$A$130)","=+IMPORTARDATOSDINAMICOS(\" BAS020\";TABLAS!$A$130)","=+IMPORTARDATOSDINAMICOS(\" BAS021\";TABLAS!$A$130)","=+IMPORTARDATOSDINAMICOS(\" BAS022\";TABLAS!$A$130)","=+IMPORTARDATOSDINAMICOS(\" BAS023\";TABLAS!$A$130)","=+IMPORTARDATOSDINAMICOS(\" BAS024\";TABLAS!$A$130)",null,"=+IMPORTARDATOSDINAMICOS(\" BAS093\";TABLAS!$A$130)","=+IMPORTARDATOSDINAMICOS(\" BAS094\";TABLAS!$A$130)","=+IMPORTARDATOSDINAMICOS(\" BAS095\";TABLAS!$A$130)","=+IMPORTARDATOSDINAMICOS(\" BAS096\";TABLAS!$A$130)","=+IMPORTARDATOSDINAMICOS(\" BAS097\";TABLAS!$A$130)","=+IMPORTARDATOSDINAMICOS(\" BAS098\";TABLAS!$A$130)"]
[null,"2A",{"$f":"+GETPIVOTDATA(\" BAS025\",TABLAS!$A$130)","v":97},{"$f":"+GETPIVOTDATA(\" BAS026\",TABLAS!$A$130)","v":89},{"$f":"+GETPIVOTDATA(\" BAS027\",TABLAS!$A$130)","v":86},{"$f":"+GETPIVOTDATA(\" BAS028\",TABLAS!$A$130)","v":69},{"$f":"+GETPIVOTDATA(\" BAS029\",TABLAS!$A$130)","v":62},{"$f":"+GETPIVOTDATA(\" BAS030\",TABLAS!$A$130)","v":71},{"$f":"+GETPIVOTDATA(\" BAS031\",TABLAS!$A$130)","v":61},{"$f":"+GETPIVOTDATA(\" BAS032\",TABLAS!$A$130)","v":0},null,"2A",{"$f":"+GETPIVOTDATA(\" BAS099\",TABLAS!$A$130)","v":6},{"$f":"+GETPIVOTDATA(\" BAS100\",TABLAS!$A$130)","v":3},{"$f":"+GETPIVOTDATA(\" BAS101\",TABLAS!$A$130)","v":0},{"$f":"+GETPIVOTDATA(\" BAS102\",TABLAS!$A$130)","v":0},{"$f":"+GETPIVOTDATA(\" BAS103\",TABLAS!$A$130)","v":0},{"$f":"+GETPIVOTDATA(\" BAS104\",TABLAS!$A$130)","v":0},null,null,null,null,null,25,26,27,28,29,30,31,32,null,99,100,101,102,103,104,null,null,null,"=+IMPORTARDATOSDINAMICOS(\" BAS025\";TABLAS!$A$130)","=+IMPORTARDATOSDINAMICOS(\" BAS026\";TABLAS!$A$130)","=+IMPORTARDATOSDINAMICOS(\" BAS027\";TABLAS!$A$130)","=+IMPORTARDATOSDINAMICOS(\" BAS028\";TABLAS!$A$130)","=+IMPORTARDATOSDINAMICOS(\" BAS029\";TABLAS!$A$130)","=+IMPORTARDATOSDINAMICOS(\" BAS030\";TABLAS!$A$130)","=+IMPORTARDATOSDINAMICOS(\" BAS031\";TABLAS!$A$130)","=+IMPORTARDATOSDINAMICOS(\" BAS032\";TABLAS!$A$130)",null,"=+IMPORTARDATOSDINAMICOS(\" BAS099\";TABLAS!$A$130)","=+IMPORTARDATOSDINAMICOS(\" BAS100\";TABLAS!$A$130)","=+IMPORTARDATOSDINAMICOS(\" BAS101\";TABLAS!$A$130)","=+IMPORTARDATOSDINAMICOS(\" BAS102\";TABLAS!$A$130)","=+IMPORTARDATOSDINAMICOS(\" BAS103\";TABLAS!$A$130)","=+IMPORTARDATOSDINAMICOS(\" BAS104\";TABLAS!$A$130)"]
[null,"3A",{"$f":"+GETPIVOTDATA(\" BAS033\",TABLAS!$A$130)","v":59},{"$f":"+GETPIVOTDATA(\" BAS034\",TABLAS!$A$130)","v":56},{"$f":"+GETPIVOTDATA(\" BAS035\",TABLAS!$A$130)","v":53},{"$f":"+GETPIVOTDATA(\" BAS036\",TABLAS!$A$130)","v":49},{"$f":"+GETPIVOTDATA(\" BAS037\",TABLAS!$A$130)","v":39},{"$f":"+GETPIVOTDATA(\" BAS038\",TABLAS!$A$130)","v":25},{"$f":"+GETPIVOTDATA(\" BAS039\",TABLAS!$A$130)","v":32},{"$f":"+GETPIVOTDATA(\" BAS040\",TABLAS!$A$130)","v":0},null,"3A",{"$f":"+GETPIVOTDATA(\" BAS105\",TABLAS!$A$130)","v":6},{"$f":"+GETPIVOTDATA(\" BAS106\",TABLAS!$A$130)","v":0},{"$f":"+GETPIVOTDATA(\" BAS107\",TABLAS!$A$130)","v":0},{"$f":"+GETPIVOTDATA(\" BAS108\",TABLAS!$A$130)","v":0},{"$f":"+GETPIVOTDATA(\" BAS109\",TABLAS!$A$130)","v":0},{"$f":"+GETPIVOTDATA(\" BAS110\",TABLAS!$A$130)","v":0},null,null,null,null,null,33,34,35,36,37,38,39,40,null,105,106,107,108,109,110,null,null,null,"=+IMPORTARDATOSDINAMICOS(\" BAS033\";TABLAS!$A$130)","=+IMPORTARDATOSDINAMICOS(\" BAS034\";TABLAS!$A$130)","=+IMPORTARDATOSDINAMICOS(\" BAS035\";TABLAS!$A$130)","=+IMPORTARDATOSDINAMICOS(\" BAS036\";TABLAS!$A$130)","=+IMPORTARDATOSDINAMICOS(\" BAS037\";TABLAS!$A$130)","=+IMPORTARDATOSDINAMICOS(\" BAS038\";TABLAS!$A$130)","=+IMPORTARDATOSDINAMICOS(\" BAS039\";TABLAS!$A$130)","=+IMPORTARDATOSDINAMICOS(\" BAS040\";TABLAS!$A$130)",null,"=+IMPORTARDATOSDINAMICOS(\" BAS105\";TABLAS!$A$130)","=+IMPORTARDATOSDINAMICOS(\" BAS106\";TABLAS!$A$130)","=+IMPORTARDATOSDINAMICOS(\" BAS107\";TABLAS!$A$130)","=+IMPORTARDATOSDINAMICOS(\" BAS108\";TABLAS!$A$130)","=+IMPORTARDATOSDINAMICOS(\" BAS109\";TABLAS!$A$130)","=+IMPORTARDATOSDINAMICOS(\" BAS110\";TABLAS!$A$130)"]
[null,"4A",{"$f":"+GETPIVOTDATA(\" BAS041\",TABLAS!$A$130)","v":63},{"$f":"+GETPIVOTDATA(\" BAS042\",TABLAS!$A$130)","v":46},{"$f":"+GETPIVOTDATA(\" BAS043\",TABLAS!$A$130)","v":43},{"$f":"+GETPIVOTDATA(\" BAS044\",TABLAS!$A$130)","v":31},{"$f":"+GETPIVOTDATA(\" BAS045\",TABLAS!$A$130)","v":32},{"$f":"+GETPIVOTDATA(\" BAS046\",TABLAS!$A$130)","v":29},{"$f":"+GETPIVOTDATA(\" BAS047\",TABLAS!$A$130)","v":28},{"$f":"+GETPIVOTDATA(\" BAS048\",TABLAS!$A$130)","v":0},null,"4A",{"$f":"+GETPIVOTDATA(\" BAS111\",TABLAS!$A$130)","v":2},{"$f":"+GETPIVOTDATA(\" BAS112\",TABLAS!$A$130)","v":1},{"$f":"+GETPIVOTDATA(\" BAS113\",TABLAS!$A$130)","v":0},{"$f":"+GETPIVOTDATA(\" BAS114\",TABLAS!$A$130)","v":0},{"$f":"+GETPIVOTDATA(\" BAS115\",TABLAS!$A$130)","v":0},{"$f":"+GETPIVOTDATA(\" BAS116\",TABLAS!$A$130)","v":0},null,null,null,null,null,41,42,43,44,45,46,47,48,null,111,112,113,114,115,116,null,null,null,"=+IMPORTARDATOSDINAMICOS(\" BAS041\";TABLAS!$A$130)","=+IMPORTARDATOSDINAMICOS(\" BAS042\";TABLAS!$A$130)","=+IMPORTARDATOSDINAMICOS(\" BAS043\";TABLAS!$A$130)","=+IMPORTARDATOSDINAMICOS(\" BAS044\";TABLAS!$A$130)","=+IMPORTARDATOSDINAMICOS(\" BAS045\";TABLAS!$A$130)","=+IMPORTARDATOSDINAMICOS(\" BAS046\";TABLAS!$A$130)","=+IMPORTARDATOSDINAMICOS(\" BAS047\";TABLAS!$A$130)","=+IMPORTARDATOSDINAMICOS(\" BAS048\";TABLAS!$A$130)",null,"=+IMPORTARDATOSDINAMICOS(\" BAS111\";TABLAS!$A$130)","=+IMPORTARDATOSDINAMICOS(\" BAS112\";TABLAS!$A$130)","=+IMPORTARDATOSDINAMICOS(\" BAS113\";TABLAS!$A$130)","=+IMPORTARDATOSDINAMICOS(\" BAS114\";TABLAS!$A$130)","=+IMPORTARDATOSDINAMICOS(\" BAS115\";TABLAS!$A$130)","=+IMPORTARDATOSDINAMICOS(\" BAS116\";TABLAS!$A$130)"]
["Adolescentes","Varones",{"$f":"+GETPIVOTDATA(\" BAS049\",TABLAS!$A$130)","v":5},{"$f":"+GETPIVOTDATA(\" BAS050\",TABLAS!$A$130)","v":0},{"$f":"+GETPIVOTDATA(\" BAS051\",TABLAS!$A$130)","v":0},{"$f":"+GETPIVOTDATA(\" BAS052\",TABLAS!$A$130)","v":0},{"$f":"+GETPIVOTDATA(\" BAS053\",TABLAS!$A$130)","v":0},{"$f":"+GETPIVOTDATA(\" BAS054\",TABLAS!$A$130)","v":0},{"$f":"+GETPIVOTDATA(\" BAS055\",TABLAS!$A$130)","v":0},{"$f":"+GETPIVOTDATA(\" BAS056\",TABLAS!$A$130)","v":0},null,"Varones",{"$f":"+GETPIVOTDATA(\" BAS117\",TABLAS!$A$130)","v":0},{"$f":"+GETPIVOTDATA(\" BAS118\",TABLAS!$A$130)","v":0},{"$f":"+GETPIVOTDATA(\" BAS119\",TABLAS!$A$130)","v":0},{"$f":"+GETPIVOTDATA(\" BAS120\",TABLAS!$A$130)","v":0},{"$f":"+GETPIVOTDATA(\" BAS121\",TABLAS!$A$130)","v":0},{"$f":"+GETPIVOTDATA(\" BAS122\",TABLAS!$A$130)","v":0},null,null,null,null,null,49,50,51,52,53,54,55,56,null,117,118,119,120,121,122,null,null,null,"=+IMPORTARDATOSDINAMICOS(\" BAS049\";TABLAS!$A$130)","=+IMPORTARDATOSDINAMICOS(\" BAS050\";TABLAS!$A$130)","=+IMPORTARDATOSDINAMICOS(\" BAS051\";TABLAS!$A$130)","=+IMPORTARDATOSDINAMICOS(\" BAS052\";TABLAS!$A$130)","=+IMPORTARDATOSDINAMICOS(\" BAS053\";TABLAS!$A$130)","=+IMPORTARDATOSDINAMICOS(\" BAS054\";TABLAS!$A$130)","=+IMPORTARDATOSDINAMICOS(\" BAS055\";TABLAS!$A$130)","=+IMPORTARDATOSDINAMICOS(\" BAS056\";TABLAS!$A$130)",null,"=+IMPORTARDATOSDINAMICOS(\" BAS117\";TABLAS!$A$130)","=+IMPORTARDATOSDINAMICOS(\" BAS118\";TABLAS!$A$130)","=+IMPORTARDATOSDINAMICOS(\" BAS119\";TABLAS!$A$130)","=+IMPORTARDATOSDINAMICOS(\" BAS120\";TABLAS!$A$130)","=+IMPORTARDATOSDINAMICOS(\" BAS121\";TABLAS!$A$130)","=+IMPORTARDATOSDINAMICOS(\" BAS122\";TABLAS!$A$130)"]
[null,"Mujeres",{"$f":"+GETPIVOTDATA(\" BAS057\",TABLAS!$A$130)","v":89},{"$f":"+GETPIVOTDATA(\" BAS058\",TABLAS!$A$130)","v":30},{"$f":"+GETPIVOTDATA(\" BAS059\",TABLAS!$A$130)","v":1},{"$f":"+GETPIVOTDATA(\" BAS060\",TABLAS!$A$130)","v":0},{"$f":"+GETPIVOTDATA(\" BAS061\",TABLAS!$A$130)","v":0},{"$f":"+GETPIVOTDATA(\" BAS062\",TABLAS!$A$130)","v":0},{"$f":"+GETPIVOTDATA(\" BAS063\",TABLAS!$A$130)","v":0},{"$f":"+GETPIVOTDATA(\" BAS064\",TABLAS!$A$130)","v":0},null,"Mujeres",{"$f":"+GETPIVOTDATA(\" BAS123\",TABLAS!$A$130)","v":3},{"$f":"+GETPIVOTDATA(\" BAS124\",TABLAS!$A$130)","v":0},{"$f":"+GETPIVOTDATA(\" BAS125\",TABLAS!$A$130)","v":0},{"$f":"+GETPIVOTDATA(\" BAS126\",TABLAS!$A$130)","v":0},{"$f":"+GETPIVOTDATA(\" BAS127\",TABLAS!$A$130)","v":0},{"$f":"+GETPIVOTDATA(\" BAS128\",TABLAS!$A$130)","v":0},null,null,null,null,null,57,58,59,60,61,62,63,64,null,123,124,125,126,127,128,null,null,null,"=+IMPORTARDATOSDINAMICOS(\" BAS057\";TABLAS!$A$130)","=+IMPORTARDATOSDINAMICOS(\" BAS058\";TABLAS!$A$130)","=+IMPORTARDATOSDINAMICOS(\" BAS059\";TABLAS!$A$130)","=+IMPORTARDATOSDINAMICOS(\" BAS060\";TABLAS!$A$130)","=+IMPORTARDATOSDINAMICOS(\" BAS061\";TABLAS!$A$130)","=+IMPORTARDATOSDINAMICOS(\" BAS062\";TABLAS!$A$130)","=+IMPORTARDATOSDINAMICOS(\" BAS063\";TABLAS!$A$130)","=+IMPORTARDATOSDINAMICOS(\" BAS064\";TABLAS!$A$130)",null,"=+IMPORTARDATOSDINAMICOS(\" BAS123\";TABLAS!$A$130)","=+IMPORTARDATOSDINAMICOS(\" BAS124\";TABLAS!$A$130)","=+IMPORTARDATOSDINAMICOS(\" BAS125\";TABLAS!$A$130)","=+IMPORTARDATOSDINAMICOS(\" BAS126\";TABLAS!$A$130)","=+IMPORTARDATOSDINAMICOS(\" BAS127\";TABLAS!$A$130)","=+IMPORTARDATOSDINAMICOS(\" BAS128\";TABLAS!$A$130)"]
["MEF","MEF",{"$f":"+GETPIVOTDATA(\" BAS065\",TABLAS!$A$130)","v":93},{"$f":"+GETPIVOTDATA(\" BAS066\",TABLAS!$A$130)","v":30},{"$f":"+GETPIVOTDATA(\" BAS067\",TABLAS!$A$130)","v":2},{"$f":"+GETPIVOTDATA(\" BAS068\",TABLAS!$A$130)","v":2},{"$f":"+GETPIVOTDATA(\" BAS069\",TABLAS!$A$130)","v":0},{"$f":"+GETPIVOTDATA(\" BAS070\",TABLAS!$A$130)","v":0},{"$f":"+GETPIVOTDATA(\" BAS071\",TABLAS!$A$130)","v":0},{"$f":"+GETPIVOTDATA(\" BAS072\",TABLAS!$A$130)","v":0},null,"MEF",{"$f":"+GETPIVOTDATA(\" BAS129\",TABLAS!$A$130)","v":5},{"$f":"+GETPIVOTDATA(\" BAS130\",TABLAS!$A$130)","v":1},{"$f":"+GETPIVOTDATA(\" BAS131\",TABLAS!$A$130)","v":0},{"$f":"+GETPIVOTDATA(\" BAS132\",TABLAS!$A$130)","v":0},{"$f":"+GETPIVOTDATA(\" BAS133\",TABLAS!$A$130)","v":0},{"$f":"+GETPIVOTDATA(\" BAS134\",TABLAS!$A$130)","v":0},null,null,null,null,null,65,66,67,68,69,70,71,72,null,129,130,131,132,133,134,null,null,null,"=+IMPORTARDATOSDINAMICOS(\" BAS065\";TABLAS!$A$130)","=+IMPORTARDATOSDINAMICOS(\" BAS066\";TABLAS!$A$130)","=+IMPORTARDATOSDINAMICOS(\" BAS067\";TABLAS!$A$130)","=+IMPORTARDATOSDINAMICOS(\" BAS068\";TABLAS!$A$130)","=+IMPORTARDATOSDINAMICOS(\" BAS069\";TABLAS!$A$130)","=+IMPORTARDATOSDINAMICOS(\" BAS070\";TABLAS!$A$130)","=+IMPORTARDATOSDINAMICOS(\" BAS071\";TABLAS!$A$130)","=+IMPORTARDATOSDINAMICOS(\" BAS072\";TABLAS!$A$130)",null,"=+IMPORTARDATOSDINAMICOS(\" BAS129\";TABLAS!$A$130)","=+IMPORTARDATOSDINAMICOS(\" BAS130\";TABLAS!$A$130)","=+IMPORTARDATOSDINAMICOS(\" BAS131\";TABLAS!$A$130)","=+IMPORTARDATOSDINAMICOS(\" BAS132\";TABLAS!$A$130)","=+IMPORTARDATOSDINAMICOS(\" BAS133\";TABLAS!$A$130)","=+IMPORTARDATOSDINAMICOS(\" BAS134\";TABLAS!$A$130)"]
["Gestantes","Gestantes",{"$f":"+GETPIVOTDATA(\" BAS073\",TABLAS!$A$130)","v":155},{"$f":"+GETPIVOTDATA(\" BAS074\",TABLAS!$A$130)","v":2},{"$f":"+GETPIVOTDATA(\" BAS075\",TABLAS!$A$130)","v":0},{"$f":"+GETPIVOTDATA(\" BAS076\",TABLAS!$A$130)","v":0},{"$f":"+GETPIVOTDATA(\" BAS077\",TABLAS!$A$130)","v":2},{"$f":"+GETPIVOTDATA(\" BAS078\",TABLAS!$A$130)","v":1},{"$f":"+GETPIVOTDATA(\" BAS079\",TABLAS!$A$130)","v":0},{"$f":"+GETPIVOTDATA(\" BAS080\",TABLAS!$A$130)","v":0},null,"Gestantes",{"$f":"+GETPIVOTDATA(\" BAS135\",TABLAS!$A$130)","v":0},{"$f":"+GETPIVOTDATA(\" BAS136\",TABLAS!$A$130)","v":1},{"$f":"+GETPIVOTDATA(\" BAS137\",TABLAS!$A$130)","v":0},{"$f":"+GETPIVOTDATA(\" BAS138\",TABLAS!$A$130)","v":0},{"$f":"+GETPIVOTDATA(\" BAS139\",TABLAS!$A$130)","v":0},{"$f":"+GETPIVOTDATA(\" BAS140\",TABLAS!$A$130)","v":0},null,null,null,null,null,73,74,75,76,77,78,79,80,null,135,136,137,138,139,140,null,null,null,"=+IMPORTARDATOSDINAMICOS(\" BAS073\";TABLAS!$A$130)","=+IMPORTARDATOSDINAMICOS(\" BAS074\";TABLAS!$A$130)","=+IMPORTARDATOSDINAMICOS(\" BAS075\";TABLAS!$A$130)","=+IMPORTARDATOSDINAMICOS(\" BAS076\";TABLAS!$A$130)","=+IMPORTARDATOSDINAMICOS(\" BAS077\";TABLAS!$A$130)","=+IMPORTARDATOSDINAMICOS(\" BAS078\";TABLAS!$A$130)","=+IMPORTARDATOSDINAMICOS(\" BAS079\";TABLAS!$A$130)","=+IMPORTARDATOSDINAMICOS(\" BAS080\";TABLAS!$A$130)",null,"=+IMPORTARDATOSDINAMICOS(\" BAS135\";TABLAS!$A$130)","=+IMPORTARDATOSDINAMICOS(\" BAS136\";TABLAS!$A$130)","=+IMPORTARDATOSDINAMICOS(\" BAS137\";TABLAS!$A$130)","=+IMPORTARDATOSDINAMICOS(\" BAS138\";TABLAS!$A$130)","=+IMPORTARDATOSDINAMICOS(\" BAS139\";TABLAS!$A$130)","=+IMPORTARDATOSDINAMICOS(\" BAS140\";TABLAS!$A$130)"]
[]
["2. DOSAJE DE HEMOGLOBINA CONTROL",null,null,null,null,null,null,null,null,null,null,"3. CONSULTA MEDICA"]
[]
["Actividades \nOperativas ","Dosaje de hemoglobina",null,null,null,null,null,null,null,null,null,null,null,null,null,null,null,null,null,null,null,null,null,null,null,null,null,null,null,null,null,null,null,null,null,null,null,null,null,null,null,{"$f":"+GETPIVOTDATA(\" BAS001\",TABLAS!$A$168)","v":75}]
[null,"1er Control","2do Control","3er Control","4to Control","5to Control","6to Control",null,null,null,null,"EDAD",1,2,3,4,5,6,null,null,null,null,null,null,null,null,null,null,null,null,null,null,null,null,null,null,null,null,null,null,null,"\";TABLAS!$A$168)",null,null,null,null,"D",null,null,null,"S",null,null,null,null,"D"]
["6 a 11 meses",{"$f":"+GETPIVOTDATA(\" BAS001\",TABLAS!$A$168)","v":75},{"$f":"+GETPIVOTDATA(\" BAS002\",TABLAS!$A$168)","v":68},{"$f":"+GETPIVOTDATA(\" BAS003\",TABLAS!$A$168)","v":59},{"$f":"+GETPIVOTDATA(\" BAS004\",TABLAS!$A$168)","v":4},{"$f":"+GETPIVOTDATA(\" BAS005\",TABLAS!$A$168)","v":0},{"$f":"+GETPIVOTDATA(\" BAS006\",TABLAS!$A$168)","v":0},null,null,null,null,"0-5 MESES",{"$f":"+GETPIVOTDATA(\" BAS055\",TABLAS!$A$168)","v":0},{"$f":"+GETPIVOTDATA(\" BAS056\",TABLAS!$A$168)","v":0},{"$f":"+GETPIVOTDATA(\" BAS057\",TABLAS!$A$168)","v":0},{"$f":"+GETPIVOTDATA(\" BAS058\",TABLAS!$A$168)","v":0},{"$f":"+GETPIVOTDATA(\" BAS059\",TABLAS!$A$168)","v":0},{"$f":"+GETPIVOTDATA(\" BAS060\",TABLAS!$A$168)","v":0},null,null,null,null,null,1,{"$f":"+X34+1","v":2},{"$f":"+Y34+1","v":3},4,5,6,null,null,null,{"$f":"+AC42+1","v":55},{"$f":"+AG34+1","v":56},{"$f":"+AH34+1","v":57},58,59,60,null,null,null,{"$f":"IF(X34<10,CONCATENATE($AP$16,\"00\",X34,$AP$33),IF(AND(X34>9,X34<100),CONCATENATE($AP$16,\"0\",X34,$AP$33),IF(X34>99,CONCATENATE($AP$16,X34,$AP$33))))","v":"=+IMPORTARDATOSDINAMICOS(\" BAS001\";TABLAS!$A$168)"},{"$f":"IF(Y34<10,CONCATENATE($AP$16,\"00\",Y34,$AP$33),IF(AND(Y34>9,Y34<100),CONCATENATE($AP$16,\"0\",Y34,$AP$33),IF(Y34>99,CONCATENATE($AP$16,Y34,$AP$33))))","v":"=+IMPORTARDATOSDINAMICOS(\" BAS002\";TABLAS!$A$168)"},"=+IMPORTARDATOSDINAMICOS(\" BAS003\";TABLAS!$A$168)","=+IMPORTARDATOSDINAMICOS(\" BAS004\";TABLAS!$A$168)","=+IMPORTARDATOSDINAMICOS(\" BAS005\";TABLAS!$A$168)","=+IMPORTARDATOSDINAMICOS(\" BAS006\";TABLAS!$A$168)",null,null,null,{"$f":"IF(AG34<10,CONCATENATE($AP$16,\"00\",AG34,$AP$33),IF(AND(AG34>9,AG34<100),CONCATENATE($AP$16,\"0\",AG34,$AP$33),IF(AG34>99,CONCATENATE($AP$16,AG34,$AP$33))))","v":"=+IMPORTARDATOSDINAMICOS(\" BAS055\";TABLAS!$A$168)"},{"$f":"IF(AH34<10,CONCATENATE($AP$16,\"00\",AH34,$AP$33),IF(AND(AH34>9,AH34<100),CONCATENATE($AP$16,\"0\",AH34,$AP$33),IF(AH34>99,CONCATENATE($AP$16,AH34,$AP$33))))","v":"=+IMPORTARDATOSDINAMICOS(\" BAS056\";TABLAS!$A$168)"},{"$f":"IF(AI34<10,CONCATENATE($AP$16,\"00\",AI34,$AP$33),IF(AND(AI34>9,AI34<100),CONCATENATE($AP$16,\"0\",AI34,$AP$33),IF(AI34>99,CONCATENATE($AP$16,AI34,$AP$33))))","v":"=+IMPORTARDATOSDINAMICOS(\" BAS057\";TABLAS!$A$168)"},{"$f":"IF(AJ34<10,CONCATENATE($AP$16,\"00\",AJ34,$AP$33),IF(AND(AJ34>9,AJ34<100),CONCATENATE($AP$16,\"0\",AJ34,$AP$33),IF(AJ34>99,CONCATENATE($AP$16,AJ34,$AP$33))))","v":"=+IMPORTARDATOSDINAMICOS(\" BAS058\";TABLAS!$A$168)"},{"$f":"IF(AK34<10,CONCATENATE($AP$16,\"00\",AK34,$AP$33),IF(AND(AK34>9,AK34<100),CONCATENATE($AP$16,\"0\",AK34,$AP$33),IF(AK34>99,CONCATENATE($AP$16,AK34,$AP$33))))","v":"=+IMPORTARDATOSDINAMICOS(\" BAS059\";TABLAS!$A$168)"},{"$f":"IF(AL34<10,CONCATENATE($AP$16,\"00\",AL34,$AP$33),IF(AND(AL34>9,AL34<100),CONCATENATE($AP$16,\"0\",AL34,$AP$33),IF(AL34>99,CONCATENATE($AP$16,AL34,$AP$33))))","v":"=+IMPORTARDATOSDINAMICOS(\" BAS060\";TABLAS!$A$168)"}]
["12 a 23 meses",{"$f":"+GETPIVOTDATA(\" BAS007\",TABLAS!$A$168)","v":93},{"$f":"+GETPIVOTDATA(\" BAS008\",TABLAS!$A$168)","v":94},{"$f":"+GETPIVOTDATA(\" BAS009\",TABLAS!$A$168)","v":111},{"$f":"+GETPIVOTDATA(\" BAS010\",TABLAS!$A$168)","v":23},{"$f":"+GETPIVOTDATA(\" BAS011\",TABLAS!$A$168)","v":79},{"$f":"+GETPIVOTDATA(\" BAS012\",TABLAS!$A$168)","v":0},null,null,null,null,"6-11m ",{"$f":"+GETPIVOTDATA(\" BAS061\",TABLAS!$A$168)","v":0},{"$f":"+GETPIVOTDATA(\" BAS062\",TABLAS!$A$168)","v":0},{"$f":"+GETPIVOTDATA(\" BAS063\",TABLAS!$A$168)","v":0},{"$f":"+GETPIVOTDATA(\" BAS064\",TABLAS!$A$168)","v":0},{"$f":"+GETPIVOTDATA(\" BAS065\",TABLAS!$A$168)","v":0},{"$f":"+GETPIVOTDATA(\" BAS066\",TABLAS!$A$168)","v":0},null,null,null,null,null,{"$f":"+AC34+1","v":7},{"$f":"+X35+1","v":8},9,10,11,12,null,null,null,{"$f":"+AL34+1","v":61},{"$f":"+AG35+1","v":62},63,64,65,66,null,null,null,{"$f":"IF(X35<10,CONCATENATE($AP$16,\"00\",X35,$AP$33),IF(AND(X35>9,X35<100),CONCATENATE($AP$16,\"0\",X35,$AP$33),IF(X35>99,CONCATENATE($AP$16,X35,$AP$33))))","v":"=+IMPORTARDATOSDINAMICOS(\" BAS007\";TABLAS!$A$168)"},{"$f":"IF(Y35<10,CONCATENATE($AP$16,\"00\",Y35,$AP$33),IF(AND(Y35>9,Y35<100),CONCATENATE($AP$16,\"0\",Y35,$AP$33),IF(Y35>99,CONCATENATE($AP$16,Y35,$AP$33))))","v":"=+IMPORTARDATOSDINAMICOS(\" BAS008\";TABLAS!$A$168)"},{"$f":"IF(Z35<10,CONCATENATE($AP$16,\"00\",Z35,$AP$33),IF(AND(Z35>9,Z35<100),CONCATENATE($AP$16,\"0\",Z35,$AP$33),IF(Z35>99,CONCATENATE($AP$16,Z35,$AP$33))))","v":"=+IMPORTARDATOSDINAMICOS(\" BAS009\";TABLAS!$A$168)"},{"$f":"IF(AA35<10,CONCATENATE($AP$16,\"00\",AA35,$AP$33),IF(AND(AA35>9,AA35<100),CONCATENATE($AP$16,\"0\",AA35,$AP$33),IF(AA35>99,CONCATENATE($AP$16,AA35,$AP$33))))","v":"=+IMPORTARDATOSDINAMICOS(\" BAS010\";TABLAS!$A$168)"},{"$f":"IF(AB35<10,CONCATENATE($AP$16,\"00\",AB35,$AP$33),IF(AND(AB35>9,AB35<100),CONCATENATE($AP$16,\"0\",AB35,$AP$33),IF(AB35>99,CONCATENATE($AP$16,AB35,$AP$33))))","v":"=+IMPORTARDATOSDINAMICOS(\" BAS011\";TABLAS!$A$168)"},{"$f":"IF(AC35<10,CONCATENATE($AP$16,\"00\",AC35,$AP$33),IF(AND(AC35>9,AC35<100),CONCATENATE($AP$16,\"0\",AC35,$AP$33),IF(AC35>99,CONCATENATE($AP$16,AC35,$AP$33))))","v":"=+IMPORTARDATOSDINAMICOS(\" BAS012\";TABLAS!$A$168)"},null,null,null,{"$f":"IF(AG35<10,CONCATENATE($AP$16,\"00\",AG35,$AP$33),IF(AND(AG35>9,AG35<100),CONCATENATE($AP$16,\"0\",AG35,$AP$33),IF(AG35>99,CONCATENATE($AP$16,AG35,$AP$33))))","v":"=+IMPORTARDATOSDINAMICOS(\" BAS061\";TABLAS!$A$168)"},{"$f":"IF(AH35<10,CONCATENATE($AP$16,\"00\",AH35,$AP$33),IF(AND(AH35>9,AH35<100),CONCATENATE($AP$16,\"0\",AH35,$AP$33),IF(AH35>99,CONCATENATE($AP$16,AH35,$AP$33))))","v":"=+IMPORTARDATOSDINAMICOS(\" BAS062\";TABLAS!$A$168)"},{"$f":"IF(AI35<10,CONCATENATE($AP$16,\"00\",AI35,$AP$33),IF(AND(AI35>9,AI35<100),CONCATENATE($AP$16,\"0\",AI35,$AP$33),IF(AI35>99,CONCATENATE($AP$16,AI35,$AP$33))))","v":"=+IMPORTARDATOSDINAMICOS(\" BAS063\";TABLAS!$A$168)"},{"$f":"IF(AJ35<10,CONCATENATE($AP$16,\"00\",AJ35,$AP$33),IF(AND(AJ35>9,AJ35<100),CONCATENATE($AP$16,\"0\",AJ35,$AP$33),IF(AJ35>99,CONCATENATE($AP$16,AJ35,$AP$33))))","v":"=+IMPORTARDATOSDINAMICOS(\" BAS064\";TABLAS!$A$168)"},{"$f":"IF(AK35<10,CONCATENATE($AP$16,\"00\",AK35,$AP$33),IF(AND(AK35>9,AK35<100),CONCATENATE($AP$16,\"0\",AK35,$AP$33),IF(AK35>99,CONCATENATE($AP$16,AK35,$AP$33))))","v":"=+IMPORTARDATOSDINAMICOS(\" BAS065\";TABLAS!$A$168)"},{"$f":"IF(AL35<10,CONCATENATE($AP$16,\"00\",AL35,$AP$33),IF(AND(AL35>9,AL35<100),CONCATENATE($AP$16,\"0\",AL35,$AP$33),IF(AL35>99,CONCATENATE($AP$16,AL35,$AP$33))))","v":"=+IMPORTARDATOSDINAMICOS(\" BAS066\";TABLAS!$A$168)"}]
["24 a 35 meses",{"$f":"+GETPIVOTDATA(\" BAS013\",TABLAS!$A$168)","v":73},{"$f":"+GETPIVOTDATA(\" BAS014\",TABLAS!$A$168)","v":59},{"$f":"+GETPIVOTDATA(\" BAS015\",TABLAS!$A$168)","v":52},{"$f":"+GETPIVOTDATA(\" BAS016\",TABLAS!$A$168)","v":9},{"$f":"+GETPIVOTDATA(\" BAS017\",TABLAS!$A$168)","v":54},{"$f":"+GETPIVOTDATA(\" BAS018\",TABLAS!$A$168)","v":0},null,null,null,null,"1A",{"$f":"+GETPIVOTDATA(\" BAS067\",TABLAS!$A$168)","v":0},{"$f":"+GETPIVOTDATA(\" BAS068\",TABLAS!$A$168)","v":0},{"$f":"+GETPIVOTDATA(\" BAS069\",TABLAS!$A$168)","v":0},{"$f":"+GETPIVOTDATA(\" BAS070\",TABLAS!$A$168)","v":0},{"$f":"+GETPIVOTDATA(\" BAS071\",TABLAS!$A$168)","v":0},{"$f":"+GETPIVOTDATA(\" BAS072\",TABLAS!$A$168)","v":0},null,null,null,null,null,{"$f":"+AC35+1","v":13},14,15,16,17,18,null,null,null,{"$f":"+AL35+1","v":67},68,69,70,71,72,null,null,null,"=+IMPORTARDATOSDINAMICOS(\" BAS013\";TABLAS!$A$168)","=+IMPORTARDATOSDINAMICOS(\" BAS014\";TABLAS!$A$168)","=+IMPORTARDATOSDINAMICOS(\" BAS015\";TABLAS!$A$168)","=+IMPORTARDATOSDINAMICOS(\" BAS016\";TABLAS!$A$168)","=+IMPORTARDATOSDINAMICOS(\" BAS017\";TABLAS!$A$168)","=+IMPORTARDATOSDINAMICOS(\" BAS018\";TABLAS!$A$168)",null,null,null,"=+IMPORTARDATOSDINAMICOS(\" BAS067\";TABLAS!$A$168)","=+IMPORTARDATOSDINAMICOS(\" BAS068\";TABLAS!$A$168)","=+IMPORTARDATOSDINAMICOS(\" BAS069\";TABLAS!$A$168)","=+IMPORTARDATOSDINAMICOS(\" BAS070\";TABLAS!$A$168)","=+IMPORTARDATOSDINAMICOS(\" BAS071\";TABLAS!$A$168)","=+IMPORTARDATOSDINAMICOS(\" BAS072\";TABLAS!$A$168)"]
["36 a 59 meses",{"$f":"+GETPIVOTDATA(\" BAS019\",TABLAS!$A$168)","v":75},{"$f":"+GETPIVOTDATA(\" BAS020\",TABLAS!$A$168)","v":27},{"$f":"+GETPIVOTDATA(\" BAS021\",TABLAS!$A$168)","v":60},{"$f":"+GETPIVOTDATA(\" BAS022\",TABLAS!$A$168)","v":47},{"$f":"+GETPIVOTDATA(\" BAS023\",TABLAS!$A$168)","v":0},{"$f":"+GETPIVOTDATA(\" BAS024\",TABLAS!$A$168)","v":0},null,null,null,null,"2A",{"$f":"+GETPIVOTDATA(\" BAS073\",TABLAS!$A$168)","v":0},{"$f":"+GETPIVOTDATA(\" BAS074\",TABLAS!$A$168)","v":0},{"$f":"+GETPIVOTDATA(\" BAS075\",TABLAS!$A$168)","v":0},{"$f":"+GETPIVOTDATA(\" BAS076\",TABLAS!$A$168)","v":0},{"$f":"+GETPIVOTDATA(\" BAS077\",TABLAS!$A$168)","v":0},{"$f":"+GETPIVOTDATA(\" BAS078\",TABLAS!$A$168)","v":0},null,null,null,null,null,19,20,21,22,23,24,null,null,null,73,74,75,76,77,78,null,null,null,"=+IMPORTARDATOSDINAMICOS(\" BAS019\";TABLAS!$A$168)","=+IMPORTARDATOSDINAMICOS(\" BAS020\";TABLAS!$A$168)","=+IMPORTARDATOSDINAMICOS(\" BAS021\";TABLAS!$A$168)","=+IMPORTARDATOSDINAMICOS(\" BAS022\";TABLAS!$A$168)","=+IMPORTARDATOSDINAMICOS(\" BAS023\";TABLAS!$A$168)","=+IMPORTARDATOSDINAMICOS(\" BAS024\";TABLAS!$A$168)",null,null,null,"=+IMPORTARDATOSDINAMICOS(\" BAS073\";TABLAS!$A$168)","=+IMPORTARDATOSDINAMICOS(\" BAS074\";TABLAS!$A$168)","=+IMPORTARDATOSDINAMICOS(\" BAS075\";TABLAS!$A$168)","=+IMPORTARDATOSDINAMICOS(\" BAS076\";TABLAS!$A$168)","=+IMPORTARDATOSDINAMICOS(\" BAS077\";TABLAS!$A$168)","=+IMPORTARDATOSDINAMICOS(\" BAS078\";TABLAS!$A$168)"]
["5 a 11 años",{"$f":"+GETPIVOTDATA(\" BAS025\",TABLAS!$A$168)","v":18},{"$f":"+GETPIVOTDATA(\" BAS026\",TABLAS!$A$168)","v":5},{"$f":"+GETPIVOTDATA(\" BAS027\",TABLAS!$A$168)","v":4},{"$f":"+GETPIVOTDATA(\" BAS028\",TABLAS!$A$168)","v":3},{"$f":"+GETPIVOTDATA(\" BAS029\",TABLAS!$A$168)","v":0},{"$f":"+GETPIVOTDATA(\" BAS030\",TABLAS!$A$168)","v":0},null,null,null,null,"3A",{"$f":"+GETPIVOTDATA(\" BAS079\",TABLAS!$A$168)","v":0},{"$f":"+GETPIVOTDATA(\" BAS080\",TABLAS!$A$168)","v":0},{"$f":"+GETPIVOTDATA(\" BAS081\",TABLAS!$A$168)","v":0},{"$f":"+GETPIVOTDATA(\" BAS082\",TABLAS!$A$168)","v":0},{"$f":"+GETPIVOTDATA(\" BAS083\",TABLAS!$A$168)","v":0},{"$f":"+GETPIVOTDATA(\" BAS084\",TABLAS!$A$168)","v":0},null,null,null,null,null,25,26,27,28,29,30,null,null,null,79,80,81,82,83,84,null,null,null,"=+IMPORTARDATOSDINAMICOS(\" BAS025\";TABLAS!$A$168)","=+IMPORTARDATOSDINAMICOS(\" BAS026\";TABLAS!$A$168)","=+IMPORTARDATOSDINAMICOS(\" BAS027\";TABLAS!$A$168)","=+IMPORTARDATOSDINAMICOS(\" BAS028\";TABLAS!$A$168)","=+IMPORTARDATOSDINAMICOS(\" BAS029\";TABLAS!$A$168)","=+IMPORTARDATOSDINAMICOS(\" BAS030\";TABLAS!$A$168)",null,null,null,"=+IMPORTARDATOSDINAMICOS(\" BAS079\";TABLAS!$A$168)","=+IMPORTARDATOSDINAMICOS(\" BAS080\";TABLAS!$A$168)","=+IMPORTARDATOSDINAMICOS(\" BAS081\";TABLAS!$A$168)","=+IMPORTARDATOSDINAMICOS(\" BAS082\";TABLAS!$A$168)","=+IMPORTARDATOSDINAMICOS(\" BAS083\";TABLAS!$A$168)","=+IMPORTARDATOSDINAMICOS(\" BAS084\";TABLAS!$A$168)"]
["12 a 17 años Mujeres",{"$f":"+GETPIVOTDATA(\" BAS031\",TABLAS!$A$168)","v":9},{"$f":"+GETPIVOTDATA(\" BAS032\",TABLAS!$A$168)","v":0},{"$f":"+GETPIVOTDATA(\" BAS033\",TABLAS!$A$168)","v":0},{"$f":"+GETPIVOTDATA(\" BAS034\",TABLAS!$A$168)","v":0},{"$f":"+GETPIVOTDATA(\" BAS035\",TABLAS!$A$168)","v":0},{"$f":"+GETPIVOTDATA(\" BAS036\",TABLAS!$A$168)","v":0},null,null,null,null,"4A",{"$f":"+GETPIVOTDATA(\" BAS085\",TABLAS!$A$168)","v":0},{"$f":"+GETPIVOTDATA(\" BAS086\",TABLAS!$A$168)","v":0},{"$f":"+GETPIVOTDATA(\" BAS087\",TABLAS!$A$168)","v":0},{"$f":"+GETPIVOTDATA(\" BAS088\",TABLAS!$A$168)","v":0},{"$f":"+GETPIVOTDATA(\" BAS089\",TABLAS!$A$168)","v":0},{"$f":"+GETPIVOTDATA(\" BAS090\",TABLAS!$A$168)","v":0},null,null,null,null,null,31,32,33,34,35,36,null,null,null,85,86,87,88,89,90,null,null,null,"=+IMPORTARDATOSDINAMICOS(\" BAS031\";TABLAS!$A$168)","=+IMPORTARDATOSDINAMICOS(\" BAS032\";TABLAS!$A$168)","=+IMPORTARDATOSDINAMICOS(\" BAS033\";TABLAS!$A$168)","=+IMPORTARDATOSDINAMICOS(\" BAS034\";TABLAS!$A$168)","=+IMPORTARDATOSDINAMICOS(\" BAS035\";TABLAS!$A$168)","=+IMPORTARDATOSDINAMICOS(\" BAS036\";TABLAS!$A$168)",null,null,null,"=+IMPORTARDATOSDINAMICOS(\" BAS085\";TABLAS!$A$168)","=+IMPORTARDATOSDINAMICOS(\" BAS086\";TABLAS!$A$168)","=+IMPORTARDATOSDINAMICOS(\" BAS087\";TABLAS!$A$168)","=+IMPORTARDATOSDINAMICOS(\" BAS088\";TABLAS!$A$168)","=+IMPORTARDATOSDINAMICOS(\" BAS089\";TABLAS!$A$168)","=+IMPORTARDATOSDINAMICOS(\" BAS090\";TABLAS!$A$168)"]
["MEF",{"$f":"+GETPIVOTDATA(\" BAS037\",TABLAS!$A$168)","v":9},{"$f":"+GETPIVOTDATA(\" BAS038\",TABLAS!$A$168)","v":1},{"$f":"+GETPIVOTDATA(\" BAS039\",TABLAS!$A$168)","v":2},{"$f":"+GETPIVOTDATA(\" BAS040\",TABLAS!$A$168)","v":0},{"$f":"+GETPIVOTDATA(\" BAS041\",TABLAS!$A$168)","v":0},{"$f":"+GETPIVOTDATA(\" BAS042\",TABLAS!$A$168)","v":0},null,null,null,null,"Varones Adolescentes",{"$f":"+GETPIVOTDATA(\" BAS091\",TABLAS!$A$168)","v":0},{"$f":"+GETPIVOTDATA(\" BAS092\",TABLAS!$A$168)","v":0},{"$f":"+GETPIVOTDATA(\" BAS093\",TABLAS!$A$168)","v":0},{"$f":"+GETPIVOTDATA(\" BAS094\",TABLAS!$A$168)","v":0},{"$f":"+GETPIVOTDATA(\" BAS095\",TABLAS!$A$168)","v":0},{"$f":"+GETPIVOTDATA(\" BAS096\",TABLAS!$A$168)","v":0},null,null,null,null,null,37,38,39,40,41,42,null,null,null,91,92,93,94,95,96,null,null,null,"=+IMPORTARDATOSDINAMICOS(\" BAS037\";TABLAS!$A$168)","=+IMPORTARDATOSDINAMICOS(\" BAS038\";TABLAS!$A$168)","=+IMPORTARDATOSDINAMICOS(\" BAS039\";TABLAS!$A$168)","=+IMPORTARDATOSDINAMICOS(\" BAS040\";TABLAS!$A$168)","=+IMPORTARDATOSDINAMICOS(\" BAS041\";TABLAS!$A$168)","=+IMPORTARDATOSDINAMICOS(\" BAS042\";TABLAS!$A$168)",null,null,null,"=+IMPORTARDATOSDINAMICOS(\" BAS091\";TABLAS!$A$168)","=+IMPORTARDATOSDINAMICOS(\" BAS092\";TABLAS!$A$168)","=+IMPORTARDATOSDINAMICOS(\" BAS093\";TABLAS!$A$168)","=+IMPORTARDATOSDINAMICOS(\" BAS094\";TABLAS!$A$168)","=+IMPORTARDATOSDINAMICOS(\" BAS095\";TABLAS!$A$168)","=+IMPORTARDATOSDINAMICOS(\" BAS096\";TABLAS!$A$168)"]
["Gestante",{"$f":"+GETPIVOTDATA(\" BAS043\",TABLAS!$A$168)","v":0},{"$f":"+GETPIVOTDATA(\" BAS044\",TABLAS!$A$168)","v":1},{"$f":"+GETPIVOTDATA(\" BAS045\",TABLAS!$A$168)","v":0},{"$f":"+GETPIVOTDATA(\" BAS046\",TABLAS!$A$168)","v":0},{"$f":"+GETPIVOTDATA(\" BAS047\",TABLAS!$A$168)","v":0},{"$f":"+GETPIVOTDATA(\" BAS048\",TABLAS!$A$168)","v":0},null,null,null,null,"Mujeres Adolescentes",{"$f":"+GETPIVOTDATA(\" BAS097\",TABLAS!$A$168)","v":0},{"$f":"+GETPIVOTDATA(\" BAS098\",TABLAS!$A$168)","v":0},{"$f":"+GETPIVOTDATA(\" BAS099\",TABLAS!$A$168)","v":0},{"$f":"+GETPIVOTDATA(\" BAS100\",TABLAS!$A$168)","v":0},{"$f":"+GETPIVOTDATA(\" BAS101\",TABLAS!$A$168)","v":0},{"$f":"+GETPIVOTDATA(\" BAS102\",TABLAS!$A$168)","v":0},null,null,null,null,null,43,44,45,46,47,48,null,null,null,97,98,99,100,101,102,null,null,null,"=+IMPORTARDATOSDINAMICOS(\" BAS043\";TABLAS!$A$168)","=+IMPORTARDATOSDINAMICOS(\" BAS044\";TABLAS!$A$168)","=+IMPORTARDATOSDINAMICOS(\" BAS045\";TABLAS!$A$168)","=+IMPORTARDATOSDINAMICOS(\" BAS046\";TABLAS!$A$168)","=+IMPORTARDATOSDINAMICOS(\" BAS047\";TABLAS!$A$168)","=+IMPORTARDATOSDINAMICOS(\" BAS048\";TABLAS!$A$168)",null,null,null,"=+IMPORTARDATOSDINAMICOS(\" BAS097\";TABLAS!$A$168)","=+IMPORTARDATOSDINAMICOS(\" BAS098\";TABLAS!$A$168)","=+IMPORTARDATOSDINAMICOS(\" BAS099\";TABLAS!$A$168)","=+IMPORTARDATOSDINAMICOS(\" BAS100\";TABLAS!$A$168)","=+IMPORTARDATOSDINAMICOS(\" BAS101\";TABLAS!$A$168)","=+IMPORTARDATOSDINAMICOS(\" BAS102\";TABLAS!$A$168)"]
["Puerpera",{"$f":"+GETPIVOTDATA(\" BAS049\",TABLAS!$A$168)","v":0},{"$f":"+GETPIVOTDATA(\" BAS050\",TABLAS!$A$168)","v":0},{"$f":"+GETPIVOTDATA(\" BAS051\",TABLAS!$A$168)","v":2},{"$f":"+GETPIVOTDATA(\" BAS052\",TABLAS!$A$168)","v":0},{"$f":"+GETPIVOTDATA(\" BAS053\",TABLAS!$A$168)","v":0},{"$f":"+GETPIVOTDATA(\" BAS054\",TABLAS!$A$168)","v":0},null,null,null,null,"MEF",{"$f":"+GETPIVOTDATA(\" BAS103\",TABLAS!$A$168)","v":0},{"$f":"+GETPIVOTDATA(\" BAS104\",TABLAS!$A$168)","v":0},{"$f":"+GETPIVOTDATA(\" BAS105\",TABLAS!$A$168)","v":0},{"$f":"+GETPIVOTDATA(\" BAS106\",TABLAS!$A$168)","v":0},{"$f":"+GETPIVOTDATA(\" BAS107\",TABLAS!$A$168)","v":0},{"$f":"+GETPIVOTDATA(\" BAS108\",TABLAS!$A$168)","v":0},null,null,null,null,null,49,50,51,52,53,54,null,null,null,103,104,105,106,107,108,null,null,null,"=+IMPORTARDATOSDINAMICOS(\" BAS049\";TABLAS!$A$168)","=+IMPORTARDATOSDINAMICOS(\" BAS050\";TABLAS!$A$168)","=+IMPORTARDATOSDINAMICOS(\" BAS051\";TABLAS!$A$168)","=+IMPORTARDATOSDINAMICOS(\" BAS052\";TABLAS!$A$168)","=+IMPORTARDATOSDINAMICOS(\" BAS053\";TABLAS!$A$168)","=+IMPORTARDATOSDINAMICOS(\" BAS054\";TABLAS!$A$168)",null,null,null,"=+IMPORTARDATOSDINAMICOS(\" BAS103\";TABLAS!$A$168)","=+IMPORTARDATOSDINAMICOS(\" BAS104\";TABLAS!$A$168)","=+IMPORTARDATOSDINAMICOS(\" BAS105\";TABLAS!$A$168)","=+IMPORTARDATOSDINAMICOS(\" BAS106\";TABLAS!$A$168)","=+IMPORTARDATOSDINAMICOS(\" BAS107\";TABLAS!$A$168)","=+IMPORTARDATOSDINAMICOS(\" BAS108\";TABLAS!$A$168)"]
[null,null,null,null,null,null,null,null,null,null,null,"Gestantes",{"$f":"+GETPIVOTDATA(\" BAS109\",TABLAS!$A$168)","v":0},{"$f":"+GETPIVOTDATA(\" BAS110\",TABLAS!$A$168)","v":0},{"$f":"+GETPIVOTDATA(\" BAS111\",TABLAS!$A$168)","v":0},{"$f":"+GETPIVOTDATA(\" BAS112\",TABLAS!$A$168)","v":0},{"$f":"+GETPIVOTDATA(\" BAS113\",TABLAS!$A$168)","v":0},{"$f":"+GETPIVOTDATA(\" BAS114\",TABLAS!$A$168)","v":0},null,null,null,null,null,null,null,null,null,null,null,null,null,null,109,110,111,112,113,114,null,null,null,"=+IMPORTARDATOSDINAMICOS(\" BAS00\";TABLAS!$A$168)","=+IMPORTARDATOSDINAMICOS(\" BAS00\";TABLAS!$A$168)","=+IMPORTARDATOSDINAMICOS(\" BAS00\";TABLAS!$A$168)","=+IMPORTARDATOSDINAMICOS(\" BAS00\";TABLAS!$A$168)","=+IMPORTARDATOSDINAMICOS(\" BAS00\";TABLAS!$A$168)","=+IMPORTARDATOSDINAMICOS(\" BAS00\";TABLAS!$A$168)",null,null,null,"=+IMPORTARDATOSDINAMICOS(\" BAS109\";TABLAS!$A$168)","=+IMPORTARDATOSDINAMICOS(\" BAS110\";TABLAS!$A$168)","=+IMPORTARDATOSDINAMICOS(\" BAS111\";TABLAS!$A$168)","=+IMPORTARDATOSDINAMICOS(\" BAS112\";TABLAS!$A$168)","=+IMPORTARDATOSDINAMICOS(\" BAS113\";TABLAS!$A$168)","=+IMPORTARDATOSDINAMICOS(\" BAS114\";TABLAS!$A$168)"]