{"text_format":"1","workbook":"xlsx","n_sheets":4,"sheets":["MENU","TABLAS","Datos","INFORME"],"not_rendered":{"charts":0,"images":30,"macros":1,"external_links":2,"defined_names":9,"comments":0,"pivot_tables":4},"unopened":[],"bounds":{"document_bytes":16777216,"sheet_cells":100000,"rows_first":2000,"rows_last":500,"rows_between":2000,"halvings":0,"cell_chars":16384,"cell_head_chars":4096},"cells_cut":0,"cells_raw":0,"read":"whole","date_system":"1900"}

{"sheet":"MENU","index":0,"n_rows":29,"n_cols":12,"rows_kept":29,"cut":false,"hidden":false,"merged":[[28,7,29,10],[26,7,27,10]]}
[]
[]
[]
[null,null,null,null,null,null,null,null,null,null,null,{"$f":"+TABLAS!A81","v":"1-2-3-4-5-T------"}]
[null,null,null,null,null,null,null,null,null,null,null,{"$f":"+TABLAS!A117","v":"1-2-3-4-5-T------"}]
[null,null,null,null,null,null,null,null,null,null,null,{"$f":"+TABLAS!A152","v":"1-2-3-4-5-T------"}]
[null,null,null,null,null,null,null,null,null,null,null,{"$f":"+TABLAS!A190","v":"1-2-3-4-5-T------"}]
[]
[]
[]
[]
[]
[]
[]
[]
[]
[]
[]
[]
[]
[]
[]
[]
[]
[]
[]
[null,null,null,null,null,null,null,"CONTROL DE MESES"]
[]
[null,null,null,null,null,null,null,{"$f":"+TABLAS!A190","v":"1-2-3-4-5-T------"}]

{"sheet":"TABLAS","index":1,"n_rows":192,"n_cols":232,"rows_kept":192,"cut":false,"hidden":true,"merged":[[189,0,189,1],[116,0,116,1],[151,0,151,1],[11,3,11,6],[12,3,12,6],[13,3,13,6],[7,2,7,6],[8,3,8,6],[9,3,9,6],[10,3,10,6],[80,0,80,1]]}
[]
[]
[]
[]
[]
[]
[]
[null,null,"Valores",null,null,null,null,null,"Tabla",{"$f":"IF(I9=\"(Todas)\",\"CUSCO \",\"\")","v":""}]
[null,null,"RED","99 - (All)",null,null,null,null,{"$f":"IF(MID(D9,1,2)=\"99\",\"(All)\",MID(D9,1,2))","v":"(All)"},{"$f":"IF(I9=\"(All)\",\" \",I9)","v":" "},null,null,{"$f":"LEN(MID(D9,5,90))","v":6},null,{"$f":"IF(MID(D9,6,5)=\"(All)\",\"\",D9)","v":""}]
[null,null,"Micro RED","9999 - (All)",null,null,null,null,{"$f":"IF(MID(D10,3,2)=\"99\",\"(All)\",MID(D10,1,4))","v":"(All)"}," ",null,null,{"$f":"LEN(MID(D10,7,90))","v":6},null,{"$f":"IF(MID(D10,8,5)=\"(All)\",\"\",D10)","v":""}]
[null,null,"Establecimiento","999999999 - (All)",null,null,null,null,{"$f":"IF(OR(MID(D11,1,9)=\"999999999\",MID(D11,1,9)=\"000000000\"),\"(All)\",MID(D11,1,9))","v":"(All)"}," ",null,null,{"$f":"LEN(MID(D11,12,90))","v":6},null,{"$f":"IF(MID(D11,13,5)=\"(All)\",\"\",D11)","v":""},null,{"$f":"MID(O11,1,9)","v":""}]
[null,null,"Provincia","00 - (All)",null,null,null,null,{"$f":"IF(MID(D12,1,2)=\"00\",\"(All)\",MID(D12,1,2))","v":"(All)"}," ",null,null,{"$f":"LEN(MID(D12,6,90))","v":5},null,{"$f":"IF(MID(D12,6,5)=\"(All)\",\"\",D12)","v":""}]
[null,null,"Distrito","0000 - (All)",null,null,null,null,{"$f":"IF(OR(MID(D13,1,4)=\"0000\",MID(D13,3,2)=\"00\"),\"(All)\",MID(D13,1,4))","v":"(All)"}," ",null,null,{"$f":"LEN(MID(D13,8,90))","v":5},null,{"$f":"IF(MID(D13,8,5)=\"(All)\",\"\",D13)","v":""}]
[null,null,"Ejecutira","99 - (ALL)",null,null,null,null,{"$f":"IF(MID(D14,1,2)=\"99\",\"(All)\",MID(D14,1,2))","v":"(All)"}," ",null,null,{"$f":"LEN(MID(D14,5,90))","v":6},null,{"$f":"IF(MID(D14,6,5)=\"(All)\",\"\",D14)","v":""}]
[]
[null,null,"Año","2025",null,null,null,null,{"$f":"+D16","v":"2025"},{"$f":"IF(I16=\"(Todas)\",\" \",I16)","v":"2025"}]
[]
[]
[]
[null,1,1,1,1,1,0,0,0,0,0,0,0,{"$f":"SUM(B20:M20)","v":5}]
[null,{"$f":"IF(B20=1,\"ENERO\",\"\")","v":"ENERO"},{"$f":"IF(C20=1,\"FEBRERO\",\"\")","v":"FEBRERO"},{"$f":"IF(D20=1,\"MARZO\",\"\")","v":"MARZO"},{"$f":"IF(E20=1,\"ABRIL\",\"\")","v":"ABRIL"},{"$f":"IF(F20=1,\"MAYO\",\"\")","v":"MAYO"},{"$f":"IF(G20=1,\"JUNIO\",\"\")","v":""},{"$f":"IF(H20=1,\"JULIO\",\"\")","v":""},{"$f":"IF(I20=1,\"AGOSTO\",\"\")","v":""},{"$f":"IF(J20=1,\"SETIEMBRE\",\"\")","v":""},{"$f":"IF(K20=1,\"OCTUBRE\",\"\")","v":""},{"$f":"IF(L20=1,\"NOVIEMBRE\",\"\")","v":""},{"$f":"IF(M20=1,\"DICIEMBRE\",\"\")","v":""},{"$f":"IF(B20=1,B21,IF(C20=1,C21,IF(D20=1,D21,IF(E20=1,E21,IF(F20=1,F21,IF(G20=1,G21,IF(H20=1,H21,IF(I20=1,I21,IF(J20=1,J21,IF(K20=1,K21,IF(L20=1,L21,IF(M20=1,M21,\"\"))))))))))))","v":"ENERO"}]
[null,null,null,null,null,null,null,null,null,null,null,null,null,{"$f":"IF(N20=1,N21,\"\")","v":""}]
[null,2,4,6,8,10,null,null,null,null,null,null,null,{"$f":"MIN(B23:M23)","v":2},{"$f":"MAX(B23:M23)","v":10},{"$f":"MAX(C23:N23)","v":10}]
[null,{"$f":"IF(B23=2,\"ENE\",\"\")","v":"ENE"},{"$f":"IF(C23=4,\"FEB\",\"\")","v":"FEB"},{"$f":"IF(D23=6,\"MAR\",\"\")","v":"MAR"},{"$f":"IF(E23=8,\"ABR\",\"\")","v":"ABR"},{"$f":"IF(F23=10,\"MAY\",\"\")","v":"MAY"},{"$f":"IF(G23=12,\"JUN\",\"\")","v":""},{"$f":"IF(H23=14,\"JUL\",\"\")","v":""},{"$f":"IF(I23=16,\"AGO\",\"\")","v":""},{"$f":"IF(J23=18,\"SET\",\"\")","v":""},{"$f":"IF(K23=20,\"OCT\",\"\")","v":""},{"$f":"IF(L23=22,\"NOV\",\"\")","v":""},{"$f":"IF(M23=24,\"DIC\",\"\")","v":""},{"$f":"IF(N23=B23,B24,IF(N23=C23,C24,IF(N23=D23,D24,IF(N23=E23,E24,IF(N23=F23,F24,IF(N23=G23,G24,IF(N23=H23,#REF!,IF(N23=I23,I24,IF(N23=J23,J24,IF(N23=K23,K24,IF(N23=L23,L24,IF(N23=M23,M24,\"\"))))))))))))","v":"ENE"},{"$f":"IF(O23=C23,C24,IF(O23=D23,D24,IF(O23=E23,E24,IF(O23=F23,F24,IF(O23=G23,G24,IF(O23=H23,H24,IF(O23=I23,I24,IF(O23=J23,J24,IF(O23=K23,K24,IF(O23=L23,L24,IF(O23=M23,M24,\"\")))))))))))","v":"MAY"},{"$f":"IF(P23=D23,D24,IF(P23=E23,E24,IF(P23=F23,F24,IF(P23=G23,G24,IF(P23=H23,H24,IF(P23=I23,I24,IF(P23=J23,J24,IF(P23=K23,K24,IF(P23=L23,L24,IF(P23=M23,M24,IF(P23=N23,N24,\"\")))))))))))","v":"MAY"}]
[null,null,null,null,null,null,null,null,null,null,null,null,null,{"$f":"CONCATENATE(N24,\" - \",O24)","v":"ENE - MAY"}]
[null,null,null,null,null,null,null,null,null,null,null,null,null,{"$f":"IF(N23=O23,N22,N25)","v":"ENE - MAY"}]
[]
[]
[]
[]
[]
[]
[]
[]
[]
[]
[]
[]
[]
[]
[]
[]
[]
[]
[]
[]
[]
[]
[]
["CRED01"]
["anno",2025]
["cod_red","(Todas)"]
["codmic","(Todas)"]
["cod_prov","(Todas)"]
["coddist","(Todas)"]
["cod_estab","(Todas)"]
["cod_eje","(Todas)"]
[]
[null,"Valores"]
["Etiquetas de fila"," BAS001"," BAS002"," BAS003"," BAS004"," BAS005"," BAS006"," BAS007"," BAS008"," BAS009"," BAS010"," BAS011"," BAS012"," BAS013"," BAS014"," BAS015"," BAS016"," BAS017"," BAS018"," BAS019"," BAS020"," BAS021"," BAS022"," BAS023"," BAS024"," BAS025"," BAS026"," BAS027"," BAS028"," BAS029"," BAS030"," BAS031"," BAS032"," BAS033"," BAS034"," BAS035"," BAS036"," BAS037"," BAS038"," BAS039"," BAS040"," BAS041"," BAS042"," BAS043"," BAS044"," BAS045"," BAS046"," BAS047"," BAS048"," BAS049"," BAS050"," BAS051"," BAS052"," BAS053"," BAS054"," BAS055"," BAS056"," BAS057"," BAS058"," BAS059"," BAS060"," BAS061"," BAS062"," BAS063"," BAS064"," BAS065"," BAS066"," BAS067"," BAS068"," BAS069"," BAS070"," BAS071"," BAS072"," BAS073"," BAS074"," BAS075"," BAS076"," BAS077"," BAS078"," BAS079"," BAS080"," BAS081"," BAS082"," BAS083"," BAS084"," BAS085"," BAS086"," BAS087"," BAS088"," BAS089"," BAS090"," BAS091"," BAS092"," BAS093"," BAS094"," BAS095"," BAS096"," BAS097"," BAS098"," BAS099"," BAS100"," BAS101"," BAS102"," BAS103"," BAS104"," BAS105"," BAS106"," BAS107"," BAS108"," BAS109"," BAS110"," BAS111"," BAS112"," BAS113"," BAS114"," BAS115"," BAS116"," BAS117"," BAS118"," BAS119"," BAS120"," BAS121"," BAS122"," BAS123"," BAS124"," BAS125"," BAS126"," BAS127"," BAS128"," BAS129"," BAS130"," BAS131"," BAS132"," BAS133"," BAS134"," BAS135"," BAS136"," BAS137"," BAS138"," BAS139"," BAS140"," BAS141"," BAS142"," BAS143"," BAS144"," BAS145"," BAS146"," BAS147"," BAS148"," BAS149"," BAS150"," BAS151"," BAS152"," BAS153"," BAS154"," BAS155"," BAS156"," BAS157"," BAS158"," BAS159"," BAS160"," BAS161"," BAS162"," BAS163"," BAS164"," BAS165"," BAS166"," BAS167"," BAS168"," BAS169"," BAS170"," BAS171"," BAS172"," BAS173"," BAS174"," BAS175"," BAS176"," BAS177"," BAS178"," BAS179"," BAS180"," BAS181"," BAS182"," BAS183"," BAS184"," BAS185"," BAS186"," BAS187"," BAS188"," BAS189"," BAS190"," BAS191"," BAS192"," BAS193"," BAS194"," BAS195"," BAS196"," BAS197"," BAS198"," BAS199"," BAS200"," BAS201"," BAS202"," BAS203"," BAS204"," BAS205"," BAS206"," BAS207"," BAS208"," BAS209"," BAS210"," BAS211"," BAS212"," BAS213"," BAS214"," BAS215"," BAS216"," BAS217"," BAS218"," BAS219"," BAS220"," BAS221"," BAS222"," BAS223"," BAS224"," BAS225"," BAS226"," BAS227"," BAS228"," BAS229"," BAS230"]
[1,94,0,113,127,127,112,0,0,0,0,0,0,0,57,57,0,0,0,0,0,2,0,2,2,1,3,0,0,0,0,0,0,0,0,0,0,0,0,0,0,0,0,0,0,0,0,0,0,0,0,0,0,0,0,0,0,0,0,0,0,0,0,0,0,0,0,0,0,0,0,0,0,0,0,0,0,0,0,0,0,140,117,117,137,116,111,122,137,130,111,96,1182,1173,0,0,0,0,0,130,146,132,132,98,97,0,0,0,0,0,608,600,0,0,0,0,0,149,123,101,127,0,0,0,0,0,0,0,453,448,0,0,0,0,0,135,112,94,92,0,1,0,0,0,0,0,383,380,0,0,0,0,0,145,92,90,70,0,0,0,0,0,0,0,294,294,0,0,0,0,0,152,35,35,0,0,0,0,0,10,5,5,0,0,0,0,0,0,0,0,0,0,0,0,0,0,0,0,0,0,0,0,0,0,0,0,0,0,0,0,0,0,0,0,0,0,0,0,0,0,0,0,0,0,0,0,0,0,0,0,0]
[2,101,0,99,103,86,101,0,0,0,0,0,0,0,31,30,0,0,0,0,0,3,0,7,5,3,1,0,0,0,0,0,0,0,0,0,0,0,0,0,0,0,0,0,0,0,0,0,0,0,0,0,0,0,0,0,0,0,0,0,0,0,0,0,0,0,0,0,0,0,0,0,0,0,0,0,0,0,0,0,0,118,129,101,121,115,111,114,105,123,115,96,1005,991,0,0,0,0,0,112,122,133,124,124,84,0,0,0,0,0,551,545,0,0,0,0,0,124,90,96,89,0,0,0,0,0,0,0,319,315,0,0,0,0,0,126,98,91,78,1,0,0,0,0,0,0,327,321,0,0,0,0,0,128,87,72,58,0,0,0,0,0,0,0,262,256,0,0,0,0,0,133,61,60,0,0,0,0,0,16,5,5,0,0,0,0,0,0,0,0,0,0,0,0,0,0,0,0,0,0,0,0,0,0,0,0,0,0,0,0,0,0,0,0,0,0,0,0,0,0,0,0,0,0,0,0,0,0,0,0,0]
[3,95,0,118,110,132,122,1,0,0,0,0,0,0,24,24,0,0,0,0,0,0,0,1,4,2,3,0,0,0,0,0,0,0,0,0,0,0,0,0,0,0,0,0,0,0,0,0,0,0,0,0,0,0,0,0,0,0,0,0,0,0,0,0,0,0,0,0,0,0,0,0,0,0,0,0,0,0,0,0,0,142,135,145,120,136,140,111,123,130,134,128,1062,1052,0,0,0,0,0,128,139,141,146,117,98,0,0,0,0,0,587,584,0,0,0,0,0,136,135,129,103,1,3,0,0,0,0,0,396,396,0,0,0,0,0,118,120,97,98,0,0,0,0,0,0,0,324,320,0,0,0,0,0,137,92,88,62,0,0,0,0,0,0,0,262,261,0,0,0,0,0,239,45,45,0,0,0,0,0,56,4,4,0,0,0,0,0,0,0,0,0,0,0,0,0,0,0,0,0,0,0,0,0,0,0,0,0,0,0,0,0,0,0,0,0,0,0,0,0,0,0,0,0,0,0,0,0,0,0,0,0]
[4,96,0,117,114,97,101,0,0,0,0,0,0,0,22,22,0,0,0,0,0,0,0,1,1,1,0,0,0,0,0,0,0,0,0,0,0,0,0,0,0,0,0,0,0,0,0,0,0,0,0,0,0,0,0,0,0,0,0,0,0,0,0,0,0,0,0,0,0,0,0,0,0,0,0,0,0,0,0,0,0,125,133,132,140,127,138,132,113,104,117,118,1039,1033,0,0,0,0,0,155,129,125,131,135,108,0,0,0,0,0,571,568,0,0,0,0,0,136,142,99,105,0,1,0,0,0,0,0,366,364,0,0,0,0,0,155,111,91,79,0,0,0,0,0,0,0,314,310,0,0,0,0,0,164,111,75,70,0,0,0,0,0,0,0,300,295,0,0,0,0,0,352,109,109,0,0,0,0,0,162,55,55,0,0,0,0,0,0,0,0,0,0,0,0,0,0,0,0,0,0,0,0,0,0,0,0,0,0,0,0,0,0,0,0,0,0,0,0,0,0,0,0,0,0,0,0,0,0,0,0,0]
[5,96,0,98,99,109,114,0,0,0,0,0,0,0,30,30,0,0,0,0,0,2,0,4,2,4,1,0,0,0,0,0,0,0,0,0,0,0,0,0,0,0,0,0,0,0,0,0,0,0,0,0,0,0,0,0,0,0,0,0,0,0,0,0,0,0,0,0,0,0,0,0,0,0,0,0,0,0,0,0,0,115,115,131,129,142,131,135,128,109,106,112,1016,1008,0,0,0,0,0,129,127,120,137,107,106,0,0,0,0,0,547,542,0,0,0,0,0,119,107,89,84,0,4,0,0,0,0,0,314,313,0,0,0,0,0,116,113,79,69,0,0,0,0,0,0,0,260,259,0,0,0,0,0,130,116,71,59,0,0,0,0,0,0,0,257,255,0,0,0,0,0,249,68,68,0,0,0,0,0,113,14,14,0,0,0,0,0,0,0,0,0,0,0,0,0,0,0,0,0,0,0,0,0,0,0,0,0,0,0,0,0,0,0,0,0,0,0,0,0,0,0,0,0,0,0,0,0,0,0,0,0]
["T",482,0,545,553,551,550,1,0,0,0,0,0,0,164,163,0,0,0,0,0,7,0,15,14,11,8,0,0,0,0,0,0,0,0,0,0,0,0,0,0,0,0,0,0,0,0,0,0,0,0,0,0,0,0,0,0,0,0,0,0,0,0,0,0,0,0,0,0,0,0,0,0,0,0,0,0,0,0,0,0,640,629,626,647,636,631,614,606,596,583,550,5304,5257,0,0,0,0,0,654,663,651,670,581,493,0,0,0,0,0,2864,2839,0,0,0,0,0,664,597,514,508,1,8,0,0,0,0,0,1848,1836,0,0,0,0,0,650,554,452,416,1,1,0,0,0,0,0,1608,1590,0,0,0,0,0,704,498,396,319,0,0,0,0,0,0,0,1375,1361,0,0,0,0,0,1125,318,317,0,0,0,0,0,357,83,83,0,0,0,0,0,0,0,0,0,0,0,0,0,0,0,0,0,0,0,0,0,0,0,0,0,0,0,0,0,0,0,0,0,0,0,0,0,0,0,0,0,0,0,0,0,0,0,0,0]
[]
[]
[]
[]
[]
[]
[]
[]
[]
[]
[]
[]
["TOTAL"]
[{"$f":"COUNT(A61:A77)","v":5},{"$f":"SUM(B61:B77)","v":964},{"$f":"SUM(C61:C77)","v":0},1090,1106,1102,1100,2,0,0,0,0,0,0,328,326,0,0,0,0,0,14,0,30,28,22,16,0,0,0,0,0,0,0,0,0,0,0,0,0,0,0,0,0,0,0,0,0,0,0,0,0,0,0,0,0,0,0,0,0,0,0,0,0,0,0,{"$f":"SUM(BO61:BO77)","v":0},0,0,0,0,0,0,0,0,0,0,0,0,0,0,1280,1258,1252,1294,1272,1262,1228,1212,1192,1166,1100,10608,10514,0,0,0,0,0,1308,1326,1302,1340,1162,986,0,0,0,0,0,5728,5678,0,0,0,0,0,1328,1194,1028,1016,2,16,0,0,0,0,0,3696,3672,{"$f":"SUM(EA61:EA77)","v":0},0,0,0,0,1300,1108,904,832,2,2,0,0,0,0,0,3216,3180,0,0,0,0,0,1408,996,792,638,0,0,0,0,0,0,0,2750,2722,0,0,0,0,0,2250,636,634,0,0,0,0,0,714,166,166,0,0,0,0,0,0,0,0,0,0,0,0,{"$f":"SUM(GM61:GM77)","v":0},0,0,0,0,0,0,0,0,0,0,0,0,0,0,0,0,0,0,0,0,0,0,0,0,0,0,0,0,0,0,0,0,0,0,0,0,0]
[{"$f":"CONCATENATE(A61,\"-\",A62,\"-\",A63,\"-\",A64,\"-\",A65,\"-\",A66,\"-\",A67,\"-\",A68,\"-\",A69,\"-\",A70,\"-\",A71,\"-\",A72)","v":"1-2-3-4-5-T------"}]
[null," BAS001"," BAS002"," BAS003"," BAS004"," BAS005"," BAS006"," BAS007"," BAS008"," BAS009"," BAS010"," BAS011"," BAS012"," BAS013"," BAS014"," BAS015"," BAS016"," BAS017"," BAS018"," BAS019"," BAS020"," BAS021"," BAS022"," BAS023"," BAS024"," BAS025"," BAS026"," BAS027"," BAS028"," BAS029"," BAS030"," BAS031"," BAS032"," BAS033"," BAS034"," BAS035"," BAS036"," BAS037"," BAS038"," BAS039"," BAS040"," BAS041"," BAS042"," BAS043"," BAS044"," BAS045"," BAS046"," BAS047"," BAS048"," BAS049"," BAS050"," BAS051"," BAS052"," BAS053"," BAS054"," BAS055"," BAS056"," BAS057"," BAS058"," BAS059"," BAS060"," BAS061"," BAS062"," BAS063"," BAS064"," BAS065"," BAS066"," BAS067"," BAS068"," BAS069"," BAS070"," BAS071"," BAS072"," BAS073"," BAS074"," BAS075"," BAS076"," BAS077"," BAS078"," BAS079"," BAS080"," BAS081"," BAS082"," BAS083"," BAS084"," BAS085"," BAS086"," BAS087"," BAS088"," BAS089"," BAS090"," BAS091"," BAS092"," BAS093"," BAS094"," BAS095"," BAS096"," BAS097"," BAS098"," BAS099"," BAS100"," BAS101"," BAS102"," BAS103"," BAS104"," BAS105"," BAS106"," BAS107"," BAS108"," BAS109"," BAS110"," BAS111"," BAS112"," BAS113"," BAS114"," BAS115"," BAS116"," BAS117"," BAS118"," BAS119"," BAS120"," BAS121"," BAS122"," BAS123"," BAS124"," BAS125"," BAS126"," BAS127"," BAS128"," BAS129"," BAS130"," BAS131"," BAS132"," BAS133"," BAS134"," BAS135"," BAS136"," BAS137"," BAS138"," BAS139"," BAS140"," BAS141"," BAS142"," BAS143"," BAS144"," BAS145"," BAS146"," BAS147"," BAS148"," BAS149"," BAS150"," BAS151"," BAS152"," BAS153"," BAS154"," BAS155"," BAS156"," BAS157"," BAS158"," BAS159"," BAS160"," BAS161"," BAS162"," BAS163"," BAS164"," BAS165"," BAS166"," BAS167"," BAS168"," BAS169"," BAS170"," BAS171"," BAS172"," BAS173"," BAS174"," BAS175"," BAS176"," BAS177"," BAS178"," BAS179"," BAS180"," BAS181"," BAS182"," BAS183"," BAS184"," BAS185"," BAS186"," BAS187"," BAS188"," BAS189"," BAS190"," BAS191"," BAS192"," BAS193"," BAS194"," BAS195"," BAS196"," BAS197"," BAS198"," BAS199"," BAS200"," BAS201"," BAS202"," BAS203"," BAS204"," BAS205"," BAS206"," BAS207"," BAS208"," BAS209"," BAS210"," BAS211"," BAS212"," BAS213"," BAS214"," BAS215"," BAS216"," BAS217"," BAS218"," BAS219"," BAS220"," BAS221"," BAS222"," BAS223"," BAS224"," BAS225"," BAS226"," BAS227"," BAS228"," BAS229"," BAS230"]
[null,{"$f":"IF(B82=B60,\"SI\",\"NO\")","v":"SI"},{"$f":"IF(C82=C60,\"SI\",\"NO\")","v":"SI"},"SI","SI","SI","SI","SI","SI","SI","SI","SI","SI","SI","SI","SI","SI","SI","SI","SI","SI","SI","SI","SI","SI","SI","SI","SI","SI","SI","SI","SI","SI","SI","SI","SI","SI","SI","SI","SI","SI","SI","SI","SI","SI","SI","SI","SI","SI","SI","SI","SI","SI","SI","SI","SI","SI","SI","SI","SI","SI","SI","SI","SI","SI","SI",{"$f":"IF(BO82=BO60,\"SI\",\"NO\")","v":"SI"},"SI","SI","SI","SI","SI","SI","SI","SI","SI","SI","SI","SI","SI","SI","SI","SI","SI","SI","SI","SI","SI","SI","SI","SI","SI","SI","SI","SI","SI","SI","SI","SI","SI","SI","SI","SI","SI","SI","SI","SI","SI","SI","SI","SI","SI","SI","SI","SI","SI","SI","SI","SI","SI","SI","SI","SI","SI","SI","SI","SI","SI","SI","SI",{"$f":"IF(EA82=EA60,\"SI\",\"NO\")","v":"SI"},"SI","SI","SI","SI","SI","SI","SI","SI","SI","SI","SI","SI","SI","SI","SI","SI","SI","SI","SI","SI","SI","SI","SI","SI","SI","SI","SI","SI","SI","SI","SI","SI","SI","SI","SI","SI","SI","SI","SI","SI","SI","SI","SI","SI","SI","SI","SI","SI","SI","SI","SI","SI","SI","SI","SI","SI","SI","SI","SI","SI","SI","SI","SI",{"$f":"IF(GM82=GM60,\"SI\",\"NO\")","v":"SI"},"SI","SI","SI","SI","SI","SI","SI","SI","SI","SI","SI","SI","SI","SI","SI","SI","SI","SI","SI","SI","SI","SI","SI","SI","SI","SI","SI","SI","SI","SI","SI","SI","SI","SI","SI","SI",{"$f":"IF(HW82=HX60,\"SI\",\"NO\")","v":"NO"}]
[]
[]
["CRED02"]
["anno",2025]
["cod_red","(Todas)"]
["codmic","(Todas)"]
["cod_prov","(Todas)"]
["coddist","(Todas)"]
["cod_estab","(Todas)"]
["cod_eje","(Todas)"]
[]
[null,"Valores"]
["Etiquetas de fila"," BAS001"," BAS002"," BAS003"," BAS004"," BAS005"," BAS006"," BAS007"," BAS008"," BAS009"," BAS010"," BAS011"," BAS012"," BAS013"," BAS014"," BAS015"," BAS016"," BAS017"," BAS018"," BAS019"," BAS020"," BAS021"," BAS022"," BAS023"," BAS024"," BAS025"," BAS026"," BAS027"," BAS028"," BAS029"," BAS030"," BAS031"," BAS032"," BAS033"," BAS034"," BAS035"," BAS036"," BAS037"," BAS038"," BAS039"," BAS040"," BAS041"," BAS042"," BAS043"," BAS044"," BAS045"," BAS046"," BAS047"," BAS048"," BAS049"," BAS050"," BAS051"," BAS052"," BAS053"," BAS054"," BAS055"," BAS056"," BAS057"," BAS058"," BAS059"," BAS060"," BAS061"," BAS062"," BAS063"," BAS064"," BAS065"," BAS066"," BAS067"," BAS068"," BAS069"," BAS070"," BAS071"," BAS072"," BAS073"," BAS074"," BAS075"," BAS076"," BAS077"," BAS078"," BAS079"," BAS080"," BAS081"," BAS082"," BAS083"," BAS084"," BAS085"," BAS086"," BAS087"," BAS088"," BAS089"," BAS090"," BAS091"," BAS092"," BAS093"," BAS094"," BAS095"," BAS096"," BAS097"," BAS098"," BAS099"," BAS100"," BAS101"," BAS102"," BAS103"," BAS104"," BAS105"," BAS106"," BAS107"," BAS108"," BAS109"," BAS110"," BAS111"," BAS112"," BAS113"," BAS114"," BAS115"," BAS116"," BAS117"," BAS118"," BAS119"," BAS120"," BAS121"," BAS122"," BAS123"," BAS124"," BAS125"," BAS126"," BAS127"," BAS128"," BAS129"," BAS130"," BAS131"," BAS132"," BAS133"," BAS134"," BAS135"," BAS136"," BAS137"," BAS138"," BAS139"," BAS140"," BAS141"," BAS142"," BAS143"," BAS144"," BAS145"," BAS146"," BAS147"," BAS148"," BAS149"," BAS150"," BAS151"," BAS152"," BAS153"," BAS154"," BAS155"," BAS156"," BAS157"," BAS158"," BAS159"," BAS160"," BAS161"," BAS162"," BAS163"," BAS164"," BAS165"," BAS166"," BAS167"," BAS168"," BAS169"," BAS170"," BAS171"," BAS172"," BAS173"," BAS174"," BAS175"," BAS176"," BAS177"," BAS178"," BAS179"," BAS180"," BAS181"," BAS182"," BAS183"," BAS184"," BAS185"," BAS186"," BAS187"," BAS188"," BAS189"," BAS190"," BAS191"," BAS192"," BAS193"," BAS194"," BAS195"," BAS196"," BAS197"," BAS198"," BAS199"," BAS200"," BAS201"," BAS202"," BAS203"," BAS204"," BAS205"," BAS206"," BAS207"," BAS208"," BAS209"," BAS210"," BAS211"," BAS212"," BAS213"," BAS214"," BAS215"," BAS216"," BAS217"," BAS218"," BAS219"," BAS220"," BAS221"," BAS222"," BAS223"," BAS224"," BAS225"," BAS226"," BAS227"," BAS228"," BAS229"," BAS230"]
[1,98,95,0,96,90,96,90,10,0,0,0,0,0,0,0,0,0,0,0,0,2,100,61,95,78,78,0,1188,0,0,5,1,0,0,126,0,0,0,0,0,0,0,0,0,0,0,0,0,0,0,0,0,0,0,0,0,0,0,0,0,0,0,0,0,0,0,0,0,0,0,0,0,0,0,0,0,0,0,0,0,0,0,0,0,0,0,0,0,0,0,0,0,0,0,0,0,0,0,0,0,0,0,71,0,0,0,0,0,0,119,97,119,106,104,133,0,89,98,92,44,1,0,0,90,46,0,0,0,0,0,32,0,0,0,0,0,0,0,0,0,0,0,0,0,0,0,0,0,0,0,0,0,0,0,0,0,0,0,0,0,0,0,0,0,0,0,0,0,0,0,0,0,0,0,0,0,0,0,0,0,0,0,0,0,0,0,0,0,0,0,0,0,0,0,0,0,0,0,0,0,0,0,0,0,0,0,0,0,0,0,0,0,0,0,0,0,0,0,0,0,0,0,0,0,0,0,0,0,0,0]
[2,104,89,0,103,81,82,81,15,1,0,0,0,0,0,0,0,0,0,0,0,1,105,35,82,63,66,0,1047,0,0,11,0,1,7,136,1,0,0,0,0,0,0,0,0,0,0,0,0,0,0,0,0,0,0,0,0,0,0,0,0,0,0,1,0,0,0,0,0,0,0,0,0,0,0,0,0,0,0,0,0,0,0,0,0,0,0,0,0,0,0,0,0,1,1,0,0,1,0,0,0,0,0,57,0,0,0,0,0,0,93,111,105,96,102,104,0,70,83,83,47,0,0,0,69,49,1,0,0,0,0,23,1,0,0,0,0,0,0,0,0,0,0,0,0,0,0,0,0,0,0,0,0,0,0,0,0,0,0,0,0,0,0,0,0,0,0,0,0,0,0,0,0,0,0,0,0,0,0,0,0,0,0,0,0,0,0,0,0,0,0,0,0,0,0,0,0,0,0,0,0,0,0,0,0,0,0,0,0,0,0,0,0,0,0,0,0,0,0,0,0,0,0,0,0,0,0,0,0,0,0]
[3,98,93,0,98,83,82,82,10,0,0,0,0,0,0,0,0,0,0,0,0,1,98,27,82,62,65,0,1198,0,0,4,3,0,5,138,0,0,0,0,0,0,0,0,0,0,0,0,0,0,0,0,0,0,0,0,0,0,0,0,0,0,0,0,0,0,0,0,0,0,0,0,0,0,0,0,0,0,0,0,0,0,0,0,0,0,0,0,0,0,0,0,0,0,0,0,0,0,0,0,0,0,0,69,0,0,0,0,0,0,121,111,106,116,96,98,0,85,74,97,60,3,0,0,76,60,7,1,0,0,0,12,0,0,0,0,0,0,0,0,0,0,0,0,0,0,0,0,0,0,0,0,0,0,0,0,0,0,0,0,0,0,0,0,0,0,0,0,0,0,0,0,0,0,0,0,0,0,0,0,0,0,0,0,0,0,0,0,0,0,0,0,0,0,0,0,0,0,0,0,0,0,0,0,0,0,0,0,0,0,0,0,0,0,0,0,0,0,0,0,0,0,0,0,0,0,0,0,0,0,0]
[4,96,93,1,95,75,78,75,8,0,0,0,0,0,0,0,0,0,0,0,0,0,96,48,73,63,63,0,1099,0,0,2,0,0,3,120,0,0,0,0,0,0,0,0,0,0,0,0,0,0,0,0,0,0,0,0,0,0,0,0,0,0,0,0,1,0,0,0,0,0,0,0,0,1,0,0,0,0,0,0,0,0,0,0,0,0,0,0,0,0,0,0,0,0,0,0,0,0,0,0,0,0,0,67,0,0,0,0,0,0,97,114,121,116,101,92,0,108,83,85,49,1,1,0,83,47,6,1,0,0,0,18,0,0,0,0,0,0,0,0,0,0,0,0,0,0,0,0,0,0,0,0,0,0,0,0,0,0,0,0,0,0,0,0,0,0,0,0,0,0,0,0,0,0,0,0,0,0,0,0,0,0,0,0,0,0,0,0,0,0,0,0,0,0,0,0,0,0,0,0,0,0,0,0,0,0,0,0,0,0,0,0,0,0,0,0,0,0,0,0,0,0,0,0,0,0,0,0,0,0,0]
[5,100,88,1,99,82,85,79,5,0,0,1,0,0,0,0,0,0,0,0,0,2,99,67,86,73,76,0,1074,0,0,7,0,0,1,127,0,0,0,0,0,0,0,0,0,0,0,0,0,0,0,0,0,0,0,0,0,0,0,0,0,0,0,0,0,0,0,0,0,0,0,0,0,0,0,0,0,0,0,0,0,0,0,0,0,0,0,0,0,0,0,0,0,0,0,0,0,0,0,0,0,0,0,52,0,0,0,0,0,0,98,93,115,112,100,90,0,89,69,89,47,1,0,0,65,43,0,1,0,0,0,20,0,0,0,0,0,0,0,0,0,0,0,0,0,0,0,0,0,0,0,0,0,0,0,0,0,0,0,0,0,0,0,0,0,0,0,0,0,0,0,0,0,0,0,0,0,0,0,0,0,0,0,0,0,0,0,0,0,0,0,0,0,0,0,0,0,0,0,0,0,0,0,0,0,0,0,0,0,0,0,0,0,0,0,0,0,0,0,0,0,0,0,0,0,0,0,0,0,0,0]
["T",496,458,2,491,411,423,407,48,1,0,1,0,0,0,0,0,0,0,0,0,6,498,238,418,339,348,0,5606,0,0,29,4,1,16,647,1,0,0,0,0,0,0,0,0,0,0,0,0,0,0,0,0,0,0,0,0,0,0,0,0,0,0,1,1,0,0,0,0,0,0,0,0,1,0,0,0,0,0,0,0,0,0,0,0,0,0,0,0,0,0,0,0,1,1,0,0,1,0,0,0,0,0,316,0,0,0,0,0,0,528,526,566,546,503,517,0,441,407,446,247,6,1,0,383,245,14,3,0,0,0,105,1,0,0,0,0,0,0,0,0,0,0,0,0,0,0,0,0,0,0,0,0,0,0,0,0,0,0,0,0,0,0,0,0,0,0,0,0,0,0,0,0,0,0,0,0,0,0,0,0,0,0,0,0,0,0,0,0,0,0,0,0,0,0,0,0,0,0,0,0,0,0,0,0,0,0,0,0,0,0,0,0,0,0,0,0,0,0,0,0,0,0,0,0,0,0,0,0,0,0]
[]
[]
[]
[]
[]
[]
[]
[]
[]
[]
[]
[]
["TOTAL"]
[{"$f":"COUNT(A97:A113)","v":5},{"$f":"SUM(B97:B113)","v":992},{"$f":"SUM(C97:C113)","v":916},4,982,822,846,814,96,2,0,2,0,0,0,0,0,0,0,0,0,12,996,476,836,678,696,0,11212,0,0,58,8,2,32,1294,2,0,0,0,0,0,0,0,0,0,0,0,0,0,0,0,0,0,0,0,0,0,0,0,0,0,0,2,2,0,{"$f":"SUM(BO97:BO113)","v":0},0,0,0,0,0,0,2,0,0,0,0,0,0,0,0,0,0,0,0,0,0,0,0,0,0,0,2,2,0,0,2,0,0,0,0,0,632,0,0,0,0,0,0,1056,1052,1132,1092,1006,1034,0,882,814,892,494,12,2,0,766,490,28,6,0,0,{"$f":"SUM(EA97:EA113)","v":0},210,2,0,0,0,0,0,0,0,0,0,0,0,0,0,0,0,0,0,0,0,0,0,0,0,0,0,0,0,0,0,0,0,0,0,0,0,0,0,0,0,0,0,0,0,0,0,0,0,0,0,0,0,0,0,0,0,0,0,0,0,0,0,{"$f":"SUM(GM97:GM113)","v":0},0,0,0,0,0,0,0,0,0,0,0,0,0,0,0,0,0,0,0,0,0,0,0,0,0,0,0,0,0,0,0,0,0,0,0,0]
[{"$f":"CONCATENATE(A97,\"-\",A98,\"-\",A99,\"-\",A100,\"-\",A101,\"-\",A102,\"-\",A103,\"-\",A104,\"-\",A105,\"-\",A106,\"-\",A107,\"-\",A108)","v":"1-2-3-4-5-T------"}]
[null," BAS001"," BAS002"," BAS003"," BAS004"," BAS005"," BAS006"," BAS007"," BAS008"," BAS009"," BAS010"," BAS011"," BAS012"," BAS013"," BAS014"," BAS015"," BAS016"," BAS017"," BAS018"," BAS019"," BAS020"," BAS021"," BAS022"," BAS023"," BAS024"," BAS025"," BAS026"," BAS027"," BAS028"," BAS029"," BAS030"," BAS031"," BAS032"," BAS033"," BAS034"," BAS035"," BAS036"," BAS037"," BAS038"," BAS039"," BAS040"," BAS041"," BAS042"," BAS043"," BAS044"," BAS045"," BAS046"," BAS047"," BAS048"," BAS049"," BAS050"," BAS051"," BAS052"," BAS053"," BAS054"," BAS055"," BAS056"," BAS057"," BAS058"," BAS059"," BAS060"," BAS061"," BAS062"," BAS063"," BAS064"," BAS065"," BAS066"," BAS067"," BAS068"," BAS069"," BAS070"," BAS071"," BAS072"," BAS073"," BAS074"," BAS075"," BAS076"," BAS077"," BAS078"," BAS079"," BAS080"," BAS081"," BAS082"," BAS083"," BAS084"," BAS085"," BAS086"," BAS087"," BAS088"," BAS089"," BAS090"," BAS091"," BAS092"," BAS093"," BAS094"," BAS095"," BAS096"," BAS097"," BAS098"," BAS099"," BAS100"," BAS101"," BAS102"," BAS103"," BAS104"," BAS105"," BAS106"," BAS107"," BAS108"," BAS109"," BAS110"," BAS111"," BAS112"," BAS113"," BAS114"," BAS115"," BAS116"," BAS117"," BAS118"," BAS119"," BAS120"," BAS121"," BAS122"," BAS123"," BAS124"," BAS125"," BAS126"," BAS127"," BAS128"," BAS129"," BAS130"," BAS131"," BAS132"," BAS133"," BAS134"," BAS135"," BAS136"," BAS137"," BAS138"," BAS139"," BAS140"," BAS141"," BAS142"," BAS143"," BAS144"," BAS145"," BAS146"," BAS147"," BAS148"," BAS149"," BAS150"," BAS151"," BAS152"," BAS153"," BAS154"," BAS155"," BAS156"," BAS157"," BAS158"," BAS159"," BAS160"," BAS161"," BAS162"," BAS163"," BAS164"," BAS165"," BAS166"," BAS167"," BAS168"," BAS169"," BAS170"," BAS171"," BAS172"," BAS173"," BAS174"," BAS175"," BAS176"," BAS177"," BAS178"," BAS179"," BAS180"," BAS181"," BAS182"," BAS183"," BAS184"," BAS185"," BAS186"," BAS187"," BAS188"," BAS189"," BAS190"," BAS191"," BAS192"," BAS193"," BAS194"," BAS195"," BAS196"," BAS197"," BAS198"," BAS199"," BAS200"," BAS201"," BAS202"," BAS203"," BAS204"," BAS205"," BAS206"," BAS207"," BAS208"," BAS209"," BAS210"," BAS211"," BAS212"," BAS213"," BAS214"," BAS215"," BAS216"," BAS217"," BAS218"," BAS219"," BAS220"," BAS221"," BAS222"," BAS223"," BAS224"," BAS225"," BAS226"," BAS227"," BAS228"," BAS229"," BAS230"]
[null,{"$f":"IF(B118=B96,\"SI\",\"NO\")","v":"SI"},{"$f":"IF(C118=C96,\"SI\",\"NO\")","v":"SI"},"SI","SI","SI","SI","SI","SI","SI","SI","SI","SI","SI","SI","SI","SI","SI","SI","SI","SI","SI","SI","SI","SI","SI","SI","SI","SI","SI","SI","SI","SI","SI","SI","SI","SI","SI","SI","SI","SI","SI","SI","SI","SI","SI","SI","SI","SI","SI","SI","SI","SI","SI","SI","SI","SI","SI","SI","SI","SI","SI","SI","SI","SI","SI",{"$f":"IF(BO118=BO96,\"SI\",\"NO\")","v":"SI"},"SI","SI","SI","SI","SI","SI","SI","SI","SI","SI","SI","SI","SI","SI","SI","SI","SI","SI","SI","SI","SI","SI","SI","SI","SI","SI","SI","SI","SI","SI","SI","SI","SI","SI","SI","SI","SI","SI","SI","SI","SI","SI","SI","SI","SI","SI","SI","SI","SI","SI","SI","SI","SI","SI","SI","SI","SI","SI","SI","SI","SI","SI","SI",{"$f":"IF(EA118=EA96,\"SI\",\"NO\")","v":"SI"},"SI","SI","SI","SI","SI","SI","SI","SI","SI","SI","SI","SI","SI","SI","SI","SI","SI","SI","SI","SI","SI","SI","SI","SI","SI","SI","SI","SI","SI","SI","SI","SI","SI","SI","SI","SI","SI","SI","SI","SI","SI","SI","SI","SI","SI","SI","SI","SI","SI","SI","SI","SI","SI","SI","SI","SI","SI","SI","SI","SI","SI","SI","SI",{"$f":"IF(GM118=GM96,\"SI\",\"NO\")","v":"SI"},"SI","SI","SI","SI","SI","SI","SI","SI","SI","SI","SI","SI","SI","SI","SI","SI","SI","SI","SI","SI","SI","SI","SI","SI","SI","SI","SI","SI","SI","SI","SI","SI","SI","SI","SI","SI"]
[]
["CRED03"]
["anno",2025]
["cod_red","(Todas)"]
["codmic","(Todas)"]
["cod_prov","(Todas)"]
["coddist","(Todas)"]
["cod_estab","(Todas)"]
["cod_eje","(Todas)"]
[]
[null,"Valores"]
["Etiquetas de fila"," BAS001"," BAS002"," BAS003"," BAS004"," BAS005"," BAS006"," BAS007"," BAS008"," BAS009"," BAS010"," BAS011"," BAS012"," BAS013"," BAS014"," BAS015"," BAS016"," BAS017"," BAS018"," BAS019"," BAS020"," BAS021"," BAS022"," BAS023"," BAS024"," BAS025"," BAS026"," BAS027"," BAS028"," BAS029"," BAS030"," BAS031"," BAS032"," BAS033"," BAS034"," BAS035"," BAS036"," BAS037"," BAS038"," BAS039"," BAS040"," BAS041"," BAS042"," BAS043"," BAS044"," BAS045"," BAS046"," BAS047"," BAS048"," BAS049"," BAS050"," BAS051"," BAS052"," BAS053"," BAS054"," BAS055"," BAS056"," BAS057"," BAS058"," BAS059"," BAS060"," BAS061"," BAS062"," BAS063"," BAS064"," BAS065"," BAS066"," BAS067"," BAS068"," BAS069"," BAS070"," BAS071"," BAS072"," BAS073"," BAS074"," BAS075"," BAS076"," BAS077"," BAS078"," BAS079"," BAS080"," BAS081"," BAS082"," BAS083"," BAS084"," BAS085"," BAS086"," BAS087"," BAS088"," BAS089"," BAS090"," BAS091"," BAS092"," BAS093"," BAS094"," BAS095"," BAS096"," BAS097"," BAS098"," BAS099"," BAS100"," BAS101"," BAS102"," BAS103"," BAS104"," BAS105"," BAS106"," BAS107"," BAS108"," BAS109"," BAS110"," BAS111"," BAS112"," BAS113"," BAS114"," BAS115"," BAS116"," BAS117"," BAS118"," BAS119"," BAS120"," BAS121"," BAS122"," BAS123"," BAS124"," BAS125"," BAS126"," BAS127"," BAS128"," BAS129"," BAS130"," BAS131"," BAS132"," BAS133"," BAS134"," BAS135"," BAS136"," BAS137"," BAS138"," BAS139"," BAS140"," BAS141"," BAS142"," BAS143"," BAS144"," BAS145"," BAS146"," BAS147"," BAS148"," BAS149"," BAS150"," BAS151"," BAS152"," BAS153"," BAS154"," BAS155"," BAS156"," BAS157"," BAS158"," BAS159"," BAS160"," BAS161"," BAS162"," BAS163"," BAS164"," BAS165"," BAS166"," BAS167"," BAS168"," BAS169"," BAS170"," BAS171"," BAS172"," BAS173"," BAS174"," BAS175"," BAS176"," BAS177"," BAS178"," BAS179"," BAS180"," BAS181"," BAS182"," BAS183"," BAS184"," BAS185"," BAS186"," BAS187"," BAS188"," BAS189"," BAS190"," BAS191"," BAS192"," BAS193"," BAS194"," BAS195"," BAS196"," BAS197"," BAS198"," BAS199"," BAS200"," BAS201"," BAS202"," BAS203"," BAS204"," BAS205"," BAS206"," BAS207"," BAS208"," BAS209"," BAS210"," BAS211"," BAS212"," BAS213"," BAS214"," BAS215"," BAS216"," BAS217"," BAS218"," BAS219"," BAS220"," BAS221"," BAS222"," BAS223"," BAS224"," BAS225"," BAS226"," BAS227"," BAS228"," BAS229"," BAS230"]
[1,2,4,1,0,0,0,1,0,0,0,0,0,0,78,178,103,0,1,10,0,1,0,0,0,0,0,184,43,11,2,5,3,1,0,0,0,0,0,0,1,1,0,0,1,3,0,0,0,0,0,0,0,2,19,13,1,0,7,2,1,0,0,0,0,0,0,0,0,1,4,3,2,0,0,0,0,0,0,4,15,13,9,20,19,3,1,1,0,3,4,1,24,87,92,89,53,33,4,0,1,1,1,2,1,22,961,832,660,448,397,93,66,14,15,12,13,8,680,513,3,4,0,0,0,2,0,0,0,0,0,15,0,8,3,0,3,15,0,0,0,18,0,3,0,10,1,8,1,0,0,10,0,0,0,7,0,1,0,11,0,12,1,0,0,3,0,0,0,4,0,0,0,4,0,9,0,0,0,6,0,0,0,3,0,3,0,4,1,3,0,0,0,3,0,0,0,3,0,0,0,0,0,0,0,0,0,0,0,0,0,0,0,0,0,0,0,0,0,0,0,0,0,0,0,0,0,0,0,0,0]
[2,0,4,2,0,0,1,0,1,0,0,0,1,0,65,193,98,0,0,14,0,0,1,0,0,0,0,154,34,19,0,0,1,1,0,0,0,0,0,0,1,1,1,0,1,0,1,0,1,0,0,0,0,1,14,14,3,4,1,0,0,0,0,0,0,0,0,1,2,0,11,6,4,3,2,1,1,1,0,8,28,20,13,21,9,2,6,2,1,2,1,1,24,77,82,61,57,31,6,0,1,0,0,0,1,16,869,874,620,488,394,97,46,26,17,13,18,7,570,478,6,7,3,3,0,1,1,0,0,1,0,12,6,4,3,0,3,9,1,0,0,27,0,3,0,5,0,8,0,0,0,16,1,0,0,10,0,4,0,0,0,1,0,0,0,7,0,0,0,2,0,1,0,5,0,7,0,0,0,5,0,0,0,2,0,1,0,0,0,4,0,0,0,3,0,0,0,4,0,1,0,0,0,0,0,0,0,0,0,0,0,0,0,0,0,0,0,0,0,0,0,0,0,0,0,0,0,0,0,0,0]
[3,1,7,7,0,0,0,0,0,0,0,0,0,0,65,206,81,0,0,11,0,1,0,0,0,0,0,144,62,12,2,4,1,1,0,1,0,0,0,0,1,0,0,0,0,0,0,0,0,0,0,0,0,0,14,5,0,1,1,1,0,0,0,0,0,0,0,1,0,2,12,10,4,10,31,25,34,29,23,15,25,16,7,22,14,2,3,1,2,0,2,0,29,60,64,57,43,24,3,1,0,0,0,0,0,17,997,1030,715,547,455,118,70,78,72,73,52,63,659,551,5,1,0,1,6,2,0,0,0,0,0,4,6,2,1,0,1,13,0,0,0,23,0,3,0,9,1,1,2,0,0,10,0,0,0,8,0,2,0,2,1,5,0,1,0,2,0,0,0,6,0,1,0,4,0,4,1,1,0,2,0,0,0,6,0,1,0,1,0,3,0,0,0,3,0,0,0,2,0,0,0,0,0,0,0,0,0,0,0,0,0,0,0,0,0,0,0,0,0,0,0,0,0,0,0,0,0,0,0,0,0]
[4,4,8,2,0,0,1,0,0,0,0,0,0,0,63,204,118,7,7,5,0,0,0,0,0,0,0,148,36,23,10,4,6,2,1,1,0,0,1,0,0,0,1,1,0,1,0,1,0,0,1,0,0,0,12,12,0,0,0,0,0,0,0,0,0,0,0,1,1,3,11,4,8,30,30,39,34,33,44,5,24,26,17,19,14,2,0,2,1,4,0,0,13,67,53,40,41,23,1,1,0,0,0,0,0,13,960,1078,733,541,519,151,79,66,64,69,81,79,592,512,4,0,1,1,2,1,0,0,0,0,0,5,1,5,1,0,1,12,0,0,0,18,0,3,0,6,1,4,0,0,0,7,0,0,0,10,0,4,0,2,0,5,0,0,0,2,0,0,0,5,0,2,0,2,0,3,0,0,0,3,0,0,0,6,0,0,0,3,0,5,0,0,0,9,0,0,0,4,0,1,0,0,0,0,0,0,0,0,0,0,0,0,0,0,0,0,0,0,0,0,0,0,0,0,0,0,0,0,0,0,0]
[5,1,6,4,0,1,0,0,0,0,0,0,0,0,78,211,97,20,14,12,1,1,0,0,0,1,0,154,40,4,3,2,4,1,0,1,1,1,1,1,0,1,0,0,0,0,0,0,0,0,0,0,0,0,13,5,1,0,3,1,1,0,1,0,0,0,0,0,5,0,8,8,12,23,6,9,17,46,20,8,18,16,7,13,23,2,0,0,0,2,1,0,17,72,47,25,25,20,5,0,0,0,0,0,0,27,883,943,688,490,463,168,65,30,27,37,67,18,574,511,5,4,0,1,0,0,0,3,0,0,0,6,3,5,3,0,3,9,0,0,0,18,0,1,0,6,0,0,2,0,0,7,0,0,0,5,0,0,0,0,0,2,0,0,0,4,0,0,0,4,0,1,0,0,0,3,0,0,0,1,0,0,0,0,0,0,0,1,0,3,0,0,0,0,0,0,0,3,0,2,0,0,0,0,0,0,0,0,0,0,0,0,0,0,0,0,0,0,0,0,0,0,0,0,0,0,0,0,0,0,0]
["T",8,29,16,0,1,2,1,1,0,0,0,1,0,349,992,497,27,22,52,1,3,1,0,0,1,0,784,215,69,17,15,15,6,1,3,1,1,2,1,3,3,2,1,2,4,1,1,1,0,1,0,0,3,72,49,5,5,12,4,2,0,1,0,0,0,0,3,8,6,46,31,30,66,69,74,86,109,87,40,110,91,53,95,79,11,10,6,4,11,8,2,107,363,338,272,219,131,19,2,2,1,1,2,2,95,4670,4757,3416,2514,2228,627,326,214,195,204,231,175,3075,2565,23,16,4,6,8,6,1,3,0,1,0,42,16,24,11,0,11,58,1,0,0,104,0,13,0,36,3,21,5,0,0,50,1,0,0,40,0,11,0,15,1,25,1,1,0,18,0,0,0,21,0,5,0,15,0,26,1,1,0,17,0,0,0,17,0,5,0,9,1,18,0,0,0,18,0,0,0,16,0,4,0,0,0,0,0,0,0,0,0,0,0,0,0,0,0,0,0,0,0,0,0,0,0,0,0,0,0,0,0,0,0]
[]
[]
[]
[]
[]
[]
[]
[]
[]
[]
[]
[]
["TOTAL"]
[{"$f":"COUNT(A132:A148)","v":5},{"$f":"SUM(B132:B148)","v":16},{"$f":"SUM(C132:C148)","v":58},32,0,2,4,2,2,0,0,0,2,0,698,1984,994,54,44,104,2,6,2,0,0,2,0,1568,430,138,34,30,30,12,2,6,2,2,4,2,6,6,4,2,4,8,2,2,2,0,2,0,0,6,144,98,10,10,24,8,4,0,2,0,0,0,{"$f":"SUM(BO132:BO148)","v":0},6,16,12,92,62,60,132,138,148,172,218,174,80,220,182,106,190,158,22,20,12,8,22,16,4,214,726,676,544,438,262,38,4,4,2,2,4,4,190,9340,9514,6832,5028,4456,1254,652,428,390,408,462,350,6150,5130,46,32,8,12,16,12,2,6,0,2,{"$f":"SUM(EA132:EA148)","v":0},84,32,48,22,0,22,116,2,0,0,208,0,26,0,72,6,42,10,0,0,100,2,0,0,80,0,22,0,30,2,50,2,2,0,36,0,0,0,42,0,10,0,30,0,52,2,2,0,34,0,0,0,34,0,10,0,18,2,36,0,0,0,36,{"$f":"SUM(GM132:GM148)","v":0},0,0,32,0,8,0,0,0,0,0,0,0,0,0,0,0,0,0,0,0,0,0,0,0,0,0,0,0,0,0,0,0,0,0,0,0]
[{"$f":"CONCATENATE(A132,\"-\",A133,\"-\",A134,\"-\",A135,\"-\",A136,\"-\",A137,\"-\",A138,\"-\",A139,\"-\",A140,\"-\",A141,\"-\",A142,\"-\",A143)","v":"1-2-3-4-5-T------"}]
[null," BAS001"," BAS002"," BAS003"," BAS004"," BAS005"," BAS006"," BAS007"," BAS008"," BAS009"," BAS010"," BAS011"," BAS012"," BAS013"," BAS014"," BAS015"," BAS016"," BAS017"," BAS018"," BAS019"," BAS020"," BAS021"," BAS022"," BAS023"," BAS024"," BAS025"," BAS026"," BAS027"," BAS028"," BAS029"," BAS030"," BAS031"," BAS032"," BAS033"," BAS034"," BAS035"," BAS036"," BAS037"," BAS038"," BAS039"," BAS040"," BAS041"," BAS042"," BAS043"," BAS044"," BAS045"," BAS046"," BAS047"," BAS048"," BAS049"," BAS050"," BAS051"," BAS052"," BAS053"," BAS054"," BAS055"," BAS056"," BAS057"," BAS058"," BAS059"," BAS060"," BAS061"," BAS062"," BAS063"," BAS064"," BAS065"," BAS066"," BAS067"," BAS068"," BAS069"," BAS070"," BAS071"," BAS072"," BAS073"," BAS074"," BAS075"," BAS076"," BAS077"," BAS078"," BAS079"," BAS080"," BAS081"," BAS082"," BAS083"," BAS084"," BAS085"," BAS086"," BAS087"," BAS088"," BAS089"," BAS090"," BAS091"," BAS092"," BAS093"," BAS094"," BAS095"," BAS096"," BAS097"," BAS098"," BAS099"," BAS100"," BAS101"," BAS102"," BAS103"," BAS104"," BAS105"," BAS106"," BAS107"," BAS108"," BAS109"," BAS110"," BAS111"," BAS112"," BAS113"," BAS114"," BAS115"," BAS116"," BAS117"," BAS118"," BAS119"," BAS120"," BAS121"," BAS122"," BAS123"," BAS124"," BAS125"," BAS126"," BAS127"," BAS128"," BAS129"," BAS130"," BAS131"," BAS132"," BAS133"," BAS134"," BAS135"," BAS136"," BAS137"," BAS138"," BAS139"," BAS140"," BAS141"," BAS142"," BAS143"," BAS144"," BAS145"," BAS146"," BAS147"," BAS148"," BAS149"," BAS150"," BAS151"," BAS152"," BAS153"," BAS154"," BAS155"," BAS156"," BAS157"," BAS158"," BAS159"," BAS160"," BAS161"," BAS162"," BAS163"," BAS164"," BAS165"," BAS166"," BAS167"," BAS168"," BAS169"," BAS170"," BAS171"," BAS172"," BAS173"," BAS174"," BAS175"," BAS176"," BAS177"," BAS178"," BAS179"," BAS180"," BAS181"," BAS182"," BAS183"," BAS184"," BAS185"," BAS186"," BAS187"," BAS188"," BAS189"," BAS190"," BAS191"," BAS192"," BAS193"," BAS194"," BAS195"," BAS196"," BAS197"," BAS198"," BAS199"," BAS200"," BAS201"," BAS202"," BAS203"," BAS204"," BAS205"," BAS206"," BAS207"," BAS208"," BAS209"," BAS210"," BAS211"," BAS212"," BAS213"," BAS214"," BAS215"," BAS216"," BAS217"," BAS218"," BAS219"," BAS220"," BAS221"," BAS222"," BAS223"," BAS224"," BAS225"," BAS226"," BAS227"," BAS228"," BAS229"," BAS230"]
[null,{"$f":"IF(B153=B131,\"SI\",\"NO\")","v":"SI"},{"$f":"IF(C153=C131,\"SI\",\"NO\")","v":"SI"},"SI","SI","SI","SI","SI","SI","SI","SI","SI","SI","SI","SI","SI","SI","SI","SI","SI","SI","SI","SI","SI","SI","SI","SI","SI","SI","SI","SI","SI","SI","SI","SI","SI","SI","SI","SI","SI","SI","SI","SI","SI","SI","SI","SI","SI","SI","SI","SI","SI","SI","SI","SI","SI","SI","SI","SI","SI","SI","SI","SI","SI","SI","SI",{"$f":"IF(BO153=BO131,\"SI\",\"NO\")","v":"SI"},"SI","SI","SI","SI","SI","SI","SI","SI","SI","SI","SI","SI","SI","SI","SI","SI","SI","SI","SI","SI","SI","SI","SI","SI","SI","SI","SI","SI","SI","SI","SI","SI","SI","SI","SI","SI","SI","SI","SI","SI","SI","SI","SI","SI","SI","SI","SI","SI","SI","SI","SI","SI","SI","SI","SI","SI","SI","SI","SI","SI","SI","SI","SI",{"$f":"IF(EA153=EA131,\"SI\",\"NO\")","v":"SI"},"SI","SI","SI","SI","SI","SI","SI","SI","SI","SI","SI","SI","SI","SI","SI","SI","SI","SI","SI","SI","SI","SI","SI","SI","SI","SI","SI","SI","SI","SI","SI","SI","SI","SI","SI","SI","SI","SI","SI","SI","SI","SI","SI","SI","SI","SI","SI","SI","SI","SI","SI","SI","SI","SI","SI","SI","SI","SI","SI","SI","SI","SI","SI",{"$f":"IF(GM153=GM131,\"SI\",\"NO\")","v":"SI"},"SI","SI","SI","SI","SI","SI","SI","SI","SI","SI","SI","SI","SI","SI","SI","SI","SI","SI","SI","SI","SI","SI","SI","SI","SI","SI","SI","SI","SI","SI","SI","SI","SI","SI","SI","SI"]
[]
[]
[]
[]
["CRED04"]
["anno",2025]
["cod_red","(Todas)"]
["codmic","(Todas)"]
["cod_prov","(Todas)"]
["coddist","(Todas)"]
["cod_estab","(Todas)"]
["cod_eje","(Todas)"]
[]
[null,"Valores"]
["Etiquetas de fila"," BAS001"," BAS002"," BAS003"," BAS004"," BAS005"," BAS006"," BAS007"," BAS008"," BAS009"," BAS010"," BAS011"," BAS012"," BAS013"," BAS014"," BAS015"," BAS016"," BAS017"," BAS018"," BAS019"," BAS020"," BAS021"," BAS022"," BAS023"," BAS024"," BAS025"," BAS026"," BAS027"," BAS028"," BAS029"," BAS030"," BAS031"," BAS032"," BAS033"," BAS034"," BAS035"," BAS036"," BAS037"," BAS038"," BAS039"," BAS040"," BAS041"," BAS042"," BAS043"," BAS044"," BAS045"," BAS046"," BAS047"," BAS048"," BAS049"," BAS050"," BAS051"," BAS052"," BAS053"," BAS054"," BAS055"," BAS056"," BAS057"," BAS058"," BAS059"," BAS060"," BAS061"," BAS062"," BAS063"," BAS064"," BAS065"," BAS066"," BAS067"," BAS068"," BAS069"," BAS070"," BAS071"," BAS072"," BAS073"," BAS074"," BAS075"," BAS076"," BAS077"," BAS078"," BAS079"," BAS080"," BAS081"," BAS082"," BAS083"," BAS084"," BAS085"," BAS086"," BAS087"," BAS088"," BAS089"," BAS090"," BAS091"," BAS092"," BAS093"," BAS094"," BAS095"," BAS096"," BAS097"," BAS098"," BAS099"," BAS100"," BAS101"," BAS102"," BAS103"," BAS104"," BAS105"," BAS106"," BAS107"," BAS108"," BAS109"," BAS110"," BAS111"," BAS112"," BAS113"," BAS114"," BAS115"," BAS116"," BAS117"," BAS118"," BAS119"," BAS120"," BAS121"," BAS122"," BAS123"," BAS124"," BAS125"," BAS126"," BAS127"," BAS128"," BAS129"," BAS130"," BAS131"," BAS132"," BAS133"," BAS134"," BAS135"," BAS136"," BAS137"," BAS138"," BAS139"," BAS140"," BAS141"," BAS142"," BAS143"," BAS144"," BAS145"," BAS146"," BAS147"," BAS148"," BAS149"," BAS150"," BAS151"," BAS152"," BAS153"," BAS154"," BAS155"," BAS156"," BAS157"," BAS158"," BAS159"," BAS160"," BAS161"," BAS162"," BAS163"," BAS164"," BAS165"," BAS166"," BAS167"," BAS168"," BAS169"," BAS170"," BAS171"," BAS172"," BAS173"," BAS174"," BAS175"," BAS176"," BAS177"," BAS178"," BAS179"," BAS180"," BAS181"," BAS182"," BAS183"," BAS184"," BAS185"," BAS186"," BAS187"," BAS188"," BAS189"," BAS190"," BAS191"," BAS192"," BAS193"," BAS194"," BAS195"," BAS196"," BAS197"," BAS198"," BAS199"," BAS200"," BAS201"," BAS202"," BAS203"," BAS204"," BAS205"," BAS206"," BAS207"," BAS208"," BAS209"," BAS210"," BAS211"," BAS212"," BAS213"," BAS214"," BAS215"," BAS216"," BAS217"," BAS218"," BAS219"," BAS220"," BAS221"," BAS222"," BAS223"," BAS224"," BAS225"," BAS226"," BAS227"," BAS228"," BAS229"," BAS230"]
[1,46,84,65,57,46,12,9,16,13,70,52,91,71,56,51,14,12,21,18,85,0,98,89,73,9,0,0,147,98,135,89,135,73,197,9,130,483,261,175,114,107,235,71,49,30,483,261,175,114,107,235,681,483,261,175,114,107,235,190,528,261,175,114,121,260,0,1167,944,944,944,397,372,0,484,262,177,115,111,235,0,0,0,0,0,0,0,0,0,0,0,0,0,0,0,0,0,0,0,0,0,0,0,0,0,0,0,0,0,0,0,0,0,0,0,0,0,0,0,0,0,0,0,0,0,0,0,0,0,0,0,0,0,0,0,0,0,0,0,0,0,0,0,0,0,0,0,0,0,0,0,0,0,0,0,0,0,0,0,0,0,0,0,0,0,0,0,0,0,0,0,0,0,0,0,0,0,0,0,0,0,0,0,0,0,0,0,0,0,0,0,0,0,0,0,0,0,0,0,0,0,0,0,0,0,0,0,0,0,0,0,0,0,0,0,0,0,0,0,0,0,0,0,0,0,0,0,0,0,0,0]
[2,55,65,64,56,45,9,4,5,11,76,64,73,72,57,50,12,8,9,19,93,0,95,88,64,3,0,0,118,95,126,88,124,64,269,3,123,452,273,163,136,111,182,122,42,33,452,273,163,136,111,182,570,452,273,163,136,111,182,167,482,274,163,137,118,197,0,1080,1040,1040,1040,416,339,0,457,282,174,145,117,182,0,0,0,0,0,0,0,0,0,0,0,0,0,0,0,0,0,0,0,0,0,0,0,0,0,0,0,0,0,0,0,0,0,0,0,0,0,0,0,0,0,0,0,0,0,0,0,0,0,0,0,0,0,0,0,0,0,0,0,0,0,0,0,0,0,0,0,0,0,0,0,0,0,0,0,0,0,0,0,0,0,0,0,0,0,0,0,0,0,0,0,0,0,0,0,0,0,0,0,0,0,0,0,0,0,0,0,0,0,0,0,0,0,0,0,0,0,0,0,0,0,0,0,0,0,0,0,0,0,0,0,0,0,0,0,0,0,0,0,0,0,0,0,0,0,0,0,0,0,0,0]
[3,63,63,47,46,37,5,12,10,10,72,65,65,48,52,40,8,21,13,14,91,0,130,95,82,12,0,0,126,130,113,95,126,82,157,12,146,451,247,163,112,107,137,272,47,40,451,247,163,112,107,137,661,451,247,163,112,107,137,183,493,248,163,112,111,142,0,1124,1107,1107,1107,480,470,0,454,251,199,124,115,137,0,0,0,0,0,0,0,0,0,0,0,0,0,0,0,0,0,0,0,0,0,0,0,0,0,0,0,0,0,0,0,0,0,0,0,0,0,0,0,0,0,0,0,0,0,0,0,0,0,0,0,0,0,0,0,0,0,0,0,0,0,0,0,0,0,0,0,0,0,0,0,0,0,0,0,0,0,0,0,0,0,0,0,0,0,0,0,0,0,0,0,0,0,0,0,0,0,0,0,0,0,0,0,0,0,0,0,0,0,0,0,0,0,0,0,0,0,0,0,0,0,0,0,0,0,0,0,0,0,0,0,0,0,0,0,0,0,0,0,0,0,0,0,0,0,0,0,0,0,0,0]
[4,62,69,70,51,40,11,5,12,12,56,68,74,76,60,45,17,11,14,18,76,1,92,93,73,13,4,1,128,92,147,93,156,73,940,13,120,389,267,161,137,91,92,277,92,26,389,267,161,137,91,92,594,389,267,161,137,91,92,153,428,267,162,138,99,123,0,1032,1192,1192,1192,510,390,0,391,271,184,152,101,92,0,0,0,0,0,0,0,0,0,0,0,0,0,0,0,0,0,0,0,0,0,0,0,0,0,0,0,0,0,0,0,0,0,0,0,0,0,0,0,0,0,0,0,0,0,0,0,0,0,0,0,0,0,0,0,0,0,0,0,0,0,0,0,0,0,0,0,0,0,0,0,0,0,0,0,0,0,0,0,0,0,0,0,0,0,0,0,0,0,0,0,0,0,0,0,0,0,0,0,0,0,0,0,0,0,0,0,0,0,0,0,0,0,0,0,0,0,0,0,0,0,0,0,0,0,0,0,0,0,0,0,0,0,0,0,0,0,0,0,0,0,0,0,0,0,0,0,0,0,0,0]
[5,53,55,50,46,55,15,5,7,8,47,58,63,50,48,60,20,11,13,11,62,1,86,78,78,29,1,1,108,86,156,78,209,78,2656,29,107,421,270,132,120,104,145,170,44,29,421,270,132,120,104,145,575,421,270,132,120,104,145,172,455,271,132,122,107,151,0,1034,1131,1131,1131,496,431,0,424,272,159,132,109,146,0,0,0,0,0,0,0,0,0,0,0,0,0,0,0,0,0,0,0,0,0,0,0,0,0,0,0,0,0,0,0,0,0,0,0,0,0,0,0,0,0,0,0,0,0,0,0,0,0,0,0,0,0,0,0,0,0,0,0,0,0,0,0,0,0,0,0,0,0,0,0,0,0,0,0,0,0,0,0,0,0,0,0,0,0,0,0,0,0,0,0,0,0,0,0,0,0,0,0,0,0,0,0,0,0,0,0,0,0,0,0,0,0,0,0,0,0,0,0,0,0,0,0,0,0,0,0,0,0,0,0,0,0,0,0,0,0,0,0,0,0,0,0,0,0,0,0,0,0,0,0]
["T",279,336,296,256,223,52,35,50,54,321,307,366,317,273,246,71,63,70,80,407,2,501,443,370,66,5,2,627,501,677,443,750,370,4219,66,626,2196,1318,794,619,520,791,912,274,158,2196,1318,794,619,520,791,3081,2196,1318,794,619,520,791,865,2386,1321,795,623,556,873,0,5437,5414,5414,5414,2299,2002,0,2210,1338,893,668,553,792,0,0,0,0,0,0,0,0,0,0,0,0,0,0,0,0,0,0,0,0,0,0,0,0,0,0,0,0,0,0,0,0,0,0,0,0,0,0,0,0,0,0,0,0,0,0,0,0,0,0,0,0,0,0,0,0,0,0,0,0,0,0,0,0,0,0,0,0,0,0,0,0,0,0,0,0,0,0,0,0,0,0,0,0,0,0,0,0,0,0,0,0,0,0,0,0,0,0,0,0,0,0,0,0,0,0,0,0,0,0,0,0,0,0,0,0,0,0,0,0,0,0,0,0,0,0,0,0,0,0,0,0,0,0,0,0,0,0,0,0,0,0,0,0,0,0,0,0,0,0,0]
[]
[]
[]
[]
[]
[]
[]
[]
[]
[]
[]
[]
["TOTAL"]
[{"$f":"COUNT(A170:A186)","v":5},{"$f":"SUM(B170:B186)","v":558},{"$f":"SUM(C170:C186)","v":672},592,512,446,104,70,100,108,642,614,732,634,546,492,142,126,140,160,814,4,1002,886,740,132,10,4,1254,1002,1354,886,1500,740,8438,132,1252,4392,2636,1588,1238,1040,1582,1824,548,316,4392,2636,1588,1238,1040,1582,6162,4392,2636,1588,1238,1040,1582,1730,4772,2642,1590,1246,1112,1746,{"$f":"SUM(BO170:BO186)","v":0},10874,10828,10828,10828,4598,4004,0,4420,2676,1786,1336,1106,1584,0,0,0,0,0,0,0,0,0,0,0,0,0,0,0,0,0,0,0,0,0,0,0,0,0,0,0,0,0,0,0,0,0,0,0,0,0,0,0,0,0,0,0,0,0,0,0,0,0,0,{"$f":"SUM(EA170:EA186)","v":0},0,0,0,0,0,0,0,0,0,0,0,0,0,0,0,0,0,0,0,0,0,0,0,0,0,0,0,0,0,0,0,0,0,0,0,0,0,0,0,0,0,0,0,0,0,0,0,0,0,0,0,0,0,0,0,0,0,0,0,0,0,0,0,{"$f":"SUM(GM170:GM186)","v":0},0,0,0,0,0,0,0,0,0,0,0,0,0,0,0,0,0,0,0,0,0,0,0,0,0,0,0,0,0,0,0,0,0,0,0,0]
[{"$f":"CONCATENATE(A170,\"-\",A171,\"-\",A172,\"-\",A173,\"-\",A174,\"-\",A175,\"-\",A176,\"-\",A177,\"-\",A178,\"-\",A179,\"-\",A180,\"-\",A181)","v":"1-2-3-4-5-T------"}]
[null," BAS001"," BAS002"," BAS003"," BAS004"," BAS005"," BAS006"," BAS007"," BAS008"," BAS009"," BAS010"," BAS011"," BAS012"," BAS013"," BAS014"," BAS015"," BAS016"," BAS017"," BAS018"," BAS019"," BAS020"," BAS021"," BAS022"," BAS023"," BAS024"," BAS025"," BAS026"," BAS027"," BAS028"," BAS029"," BAS030"," BAS031"," BAS032"," BAS033"," BAS034"," BAS035"," BAS036"," BAS037"," BAS038"," BAS039"," BAS040"," BAS041"," BAS042"," BAS043"," BAS044"," BAS045"," BAS046"," BAS047"," BAS048"," BAS049"," BAS050"," BAS051"," BAS052"," BAS053"," BAS054"," BAS055"," BAS056"," BAS057"," BAS058"," BAS059"," BAS060"," BAS061"," BAS062"," BAS063"," BAS064"," BAS065"," BAS066"," BAS067"," BAS068"," BAS069"," BAS070"," BAS071"," BAS072"," BAS073"," BAS074"," BAS075"," BAS076"," BAS077"," BAS078"," BAS079"," BAS080"," BAS081"," BAS082"," BAS083"," BAS084"," BAS085"," BAS086"," BAS087"," BAS088"," BAS089"," BAS090"," BAS091"," BAS092"," BAS093"," BAS094"," BAS095"," BAS096"," BAS097"," BAS098"," BAS099"," BAS100"," BAS101"," BAS102"," BAS103"," BAS104"," BAS105"," BAS106"," BAS107"," BAS108"," BAS109"," BAS110"," BAS111"," BAS112"," BAS113"," BAS114"," BAS115"," BAS116"," BAS117"," BAS118"," BAS119"," BAS120"," BAS121"," BAS122"," BAS123"," BAS124"," BAS125"," BAS126"," BAS127"," BAS128"," BAS129"," BAS130"," BAS131"," BAS132"," BAS133"," BAS134"," BAS135"," BAS136"," BAS137"," BAS138"," BAS139"," BAS140"," BAS141"," BAS142"," BAS143"," BAS144"," BAS145"," BAS146"," BAS147"," BAS148"," BAS149"," BAS150"," BAS151"," BAS152"," BAS153"," BAS154"," BAS155"," BAS156"," BAS157"," BAS158"," BAS159"," BAS160"," BAS161"," BAS162"," BAS163"," BAS164"," BAS165"," BAS166"," BAS167"," BAS168"," BAS169"," BAS170"," BAS171"," BAS172"," BAS173"," BAS174"," BAS175"," BAS176"," BAS177"," BAS178"," BAS179"," BAS180"," BAS181"," BAS182"," BAS183"," BAS184"," BAS185"," BAS186"," BAS187"," BAS188"," BAS189"," BAS190"," BAS191"," BAS192"," BAS193"," BAS194"," BAS195"," BAS196"," BAS197"," BAS198"," BAS199"," BAS200"," BAS201"," BAS202"," BAS203"," BAS204"," BAS205"," BAS206"," BAS207"," BAS208"," BAS209"," BAS210"," BAS211"," BAS212"," BAS213"," BAS214"," BAS215"," BAS216"," BAS217"," BAS218"," BAS219"," BAS220"," BAS221"," BAS222"," BAS223"," BAS224"," BAS225"," BAS226"," BAS227"," BAS228"," BAS229"," BAS230"]
[null,{"$f":"IF(B191=B169,\"SI\",\"NO\")","v":"SI"},{"$f":"IF(C191=C169,\"SI\",\"NO\")","v":"SI"},"SI","SI","SI","SI","SI","SI","SI","SI","SI","SI","SI","SI","SI","SI","SI","SI","SI","SI","SI","SI","SI","SI","SI","SI","SI","SI","SI","SI","SI","SI","SI","SI","SI","SI","SI","SI","SI","SI","SI","SI","SI","SI","SI","SI","SI","SI","SI","SI","SI","SI","SI","SI","SI","SI","SI","SI","SI","SI","SI","SI","SI","SI","SI",{"$f":"IF(BO191=BO169,\"SI\",\"NO\")","v":"SI"},"SI","SI","SI","SI","SI","SI","SI","SI","SI","SI","SI","SI","SI","SI","SI","SI","SI","SI","SI","SI","SI","SI","SI","SI","SI","SI","SI","SI","SI","SI","SI","SI","SI","SI","SI","SI","SI","SI","SI","SI","SI","SI","SI","SI","SI","SI","SI","SI","SI","SI","SI","SI","SI","SI","SI","SI","SI","SI","SI","SI","SI","SI","SI",{"$f":"IF(EA191=EA169,\"SI\",\"NO\")","v":"SI"},"SI","SI","SI","SI","SI","SI","SI","SI","SI","SI","SI","SI","SI","SI","SI","SI","SI","SI","SI","SI","SI","SI","SI","SI","SI","SI","SI","SI","SI","SI","SI","SI","SI","SI","SI","SI","SI","SI","SI","SI","SI","SI","SI","SI","SI","SI","SI","SI","SI","SI","SI","SI","SI","SI","SI","SI","SI","SI","SI","SI","SI","SI","SI",{"$f":"IF(GM191=GM169,\"SI\",\"NO\")","v":"SI"},"SI","SI","SI","SI","SI","SI","SI","SI","SI","SI","SI","SI","SI","SI","SI","SI","SI","SI","SI","SI","SI","SI","SI","SI","SI","SI","SI","SI","SI","SI","SI","SI","SI","SI","SI","SI"]

{"sheet":"Datos","index":2,"n_rows":455,"n_cols":32,"rows_kept":455,"cut":false,"hidden":true,"merged":[]}
[]
[]
[]
[]
[]
[]
[]
[]
[null,"ANO",null,"MESES",null,"COD_RED","DESC_RED","CONCATENAR",null,"COD_RED","COD_MIC","DESC_MICRO","CONCATENAR",null,"COD_ESTAB","DESC_ESTAB","COD_RED","COD_MIC","COD_PROV","COD_DIST","REDMIC","CONCATENAR",null,"COD_PROV","DESC_PROV","CONCATENAR",null,"COD_PROV","COD_DIST","DESC_DIST","PROVDIST","CONCATENAR"]
[null,2025,null,"01-Enero",null,"00","NO TIENE ASIGNADO NINGUNA RED",{"$f":"CONCATENATE(F10,\" - \",G10)","v":"00 - NO TIENE ASIGNADO NINGUNA RED"},null,"00","00","NO PERTENECE A NINGUNA MICRORED                                                                     ",{"$f":"CONCATENATE(J10,K10,\" - \",L10)","v":"0000 - NO PERTENECE A NINGUNA MICRORED                                                                     "},null,"000000000","(All)","00","00",null,null,{"$f":"CONCATENATE(Q10,R10)","v":"0000"},{"$f":"CONCATENATE(O10,\" - \",P10)","v":"000000000 - (All)"},null,"00","(All)",{"$f":"CONCATENATE(X10,\" - \",Y10)","v":"00 - (All)"},null,"01","00","(All)",{"$f":"CONCATENATE(AB10,AC10)","v":"0100"},{"$f":"CONCATENATE(AB10,AC10,\" - \",AD10)","v":"0100 - (All)"}]
[null,null,null,"02-Febrero",null,"01","CUSCO SUR",{"$f":"CONCATENATE(F11,\" - \",G11)","v":"01 - CUSCO SUR"},null,"00","99","(All)","0099 - (All)",1,"000002289","HOSPITAL DE APOYO DEPARTAMENTAL CUSCO","00","00","01","01",{"$f":"CONCATENATE(Q11,R11)","v":"0000"},{"$f":"CONCATENATE(O11,\" - \",P11)","v":"000002289 - HOSPITAL DE APOYO DEPARTAMENTAL CUSCO"},null,"01","CUSCO",{"$f":"CONCATENATE(X11,\" - \",Y11)","v":"01 - CUSCO"},null,"01","01","CUSCO",{"$f":"CONCATENATE(AB11,AC11)","v":"0101"},{"$f":"CONCATENATE(AB11,AC11,\" - \",AD11)","v":"0101 - CUSCO"}]
[null,null,null,"03-Marzo",null,"02","CUSCO NORTE","02 - CUSCO NORTE",null,"01","00","NO PERTENECE A NINGUNA MICRORED                                                                     ","0100 - NO PERTENECE A NINGUNA MICRORED                                                                     ",{"$f":"+N11+1","v":2},"000002305","ANTONIO LORENA DEL CUSCO","00","00","01","06","0000","000002305 - ANTONIO LORENA DEL CUSCO",null,"02","ACOMAYO",{"$f":"CONCATENATE(X12,\" - \",Y12)","v":"02 - ACOMAYO"},null,"01","02","CCORCA","0102","0102 - CCORCA"]
[null,null,null,"04-Abril",null,"03","LA CONVENCION","03 - LA CONVENCION",null,"01","16","CUSCO                                                                                               ","0116 - CUSCO                                                                                               ",{"$f":"+N12+1","v":3},"999999999","(All)","00","99",null,null,"0099","999999999 - (All)",null,"03","ANTA","03 - ANTA",null,"01","03","POROY","0103","0103 - POROY"]
[null,null,null,"05-Mayo",null,"04","CANAS-CANCHIS-ESPINAR","04 - CANAS-CANCHIS-ESPINAR",null,"01","03","PARURO                                                                                              ","0103 - PARURO                                                                                              ",null,"000025210","TUPAC AMARU","01","00","01","05","0100","000025210 - TUPAC AMARU",null,"04","CALCA","04 - CALCA",null,"01","04","SAN JERONIMO","0104","0104 - SAN JERONIMO"]
[null,null,null,"06-Junio",null,"05","KIMBIRI PICHARI","05 - KIMBIRI PICHARI",null,"01","06","PAUCARTAMBO                                                                                         ","0106 - PAUCARTAMBO                                                                                         ",{"$f":"+N13+1","v":4},"000000000","(All)","01","03",null,null,"0103","000000000 - (All)",null,"05","CANAS","05 - CANAS",null,"01","05","SAN SEBASTIAN","0105","0105 - SAN SEBASTIAN"]
[null,null,null,"07-Julio",null,"06","CHUMBIVILCAS","06 - CHUMBIVILCAS",null,"01","12","URCOS                                                                                               ","0112 - URCOS                                                                                               ",null,"000002499","PARURO","01","03","10","01","0103","000002499 - PARURO",null,"06","CANCHIS","06 - CANCHIS",null,"01","06","SANTIAGO","0106","0106 - SANTIAGO"]
[null,null,null,"08-Agosto",null,"99","(All)","99 - (All)",null,"01","13","ACOMAYO                                                                                             ","0113 - ACOMAYO                                                                                             ",{"$f":"+N15+1","v":5},"000002500","ACCHA","01","03","10","02","0103","000002500 - ACCHA",null,"07","CHUMBIVILCAS","07 - CHUMBIVILCAS",null,"01","07","SAYLLA","0107","0107 - SAYLLA"]
[null,null,null,"09-Setiembre",null,null,null,null,null,"01","15","OCONGATE                                                                                            ","0115 - OCONGATE                                                                                            ",6,"000002501","CCAPI","01","03","10","03","0103","000002501 - CCAPI",null,"08","ESPINAR","08 - ESPINAR",null,"01","08","WANCHAQ","0108","0108 - WANCHAQ"]
[null,null,null,"10-Octubre",null,null,null,null,null,"01","99","(All)","0199 - (All)",7,"000002502","CCOYABAMBA","01","03","10","03","0103","000002502 - CCOYABAMBA",null,"09","LA CONVENCION","09 - LA CONVENCION",null,"02","00","(All)","0200","0200 - (All)"]
[null,null,null,"11-Noviembre",null,"EJECUTORAS",null,null,null,"02","01","BELEMPAMPA                                                                                          ","0201 - BELEMPAMPA                                                                                          ",8,"000002503","COLCHA","01","03","10","04","0103","000002503 - COLCHA",null,"10","PARURO","10 - PARURO",null,"02","01","ACOMAYO","0201","0201 - ACOMAYO"]
[null,null,null,"12-Diciembre",null,"COD_RED","DESC_RED","CONCATENAR",null,"02","02","WANCHAQ                                                                                             ","0202 - WANCHAQ                                                                                             ",9,"000006978","CCOCHIRIHUAY","01","03","10","04","0103","000006978 - CCOCHIRIHUAY",null,"11","PAUCARTAMBO","11 - PAUCARTAMBO",null,"02","02","ACOPIA","0202","0202 - ACOPIA"]
[null,null,null,null,null,"01","HOSPITAL REGIONAL CUSCO",{"$f":"CONCATENATE(F22,\" - \",G22)","v":"01 - HOSPITAL REGIONAL CUSCO"},null,"02","03","ANTA                                                                                                ","0203 - ANTA                                                                                                ",10,"000002504","HUANOQUITE","01","03","10","05","0103","000002504 - HUANOQUITE",null,"12","QUISPICANCHI","12 - QUISPICANCHI",null,"02","03","ACOS","0203","0203 - ACOS"]
[null,null,null,null,null,"02","HOSPITAL ANTONIO LORENA",{"$f":"CONCATENATE(F23,\" - \",G23)","v":"02 - HOSPITAL ANTONIO LORENA"},null,"02","04","LIMATAMBO                                                                                           ","0204 - LIMATAMBO                                                                                           ",11,"000002505","OMACHA","01","03","10","06","0103","000002505 - OMACHA",null,"13","URUBAMBA","13 - URUBAMBA",null,"02","04","MOSOC LLACTA","0204","0204 - MOSOC LLACTA"]
[null,null,null,null,null,"03","CUSCO NORTE","03 - CUSCO NORTE",null,"02","05","PISAC                                                                                               ","0205 - PISAC                                                                                               ",12,"000002506","ANTAPALLPA","01","03","10","06","0103","000002506 - ANTAPALLPA",null,null,null,null,null,"02","05","POMACANCHI","0205","0205 - POMACANCHI"]
[null,null,null,null,null,"04","CUSCO SUR","04 - CUSCO SUR",null,"02","06","CALCA                                                                                               ","0206 - CALCA                                                                                               ",13,"000007147","PUESTO DE SALUD DE HUASQUILLAY","01","03","10","06","0103","000007147 - PUESTO DE SALUD DE HUASQUILLAY",null,null,null,null,null,"02","06","RONDOCAN","0206","0206 - RONDOCAN"]
[null,null,null,null,null,"05","LA CONVENCION","05 - LA CONVENCION",null,"02","07","URUBAMBA                                                                                            ","0207 - URUBAMBA                                                                                            ",14,"000012924","SAHUA SAHUA","01","03","10","06","0103","000012924 - SAHUA SAHUA",null,null,null,null,null,"02","07","SANGARARA","0207","0207 - SANGARARA"]
[null,null,null,null,null,"06","HOSPITAL QUILLABAMBA","06 - HOSPITAL QUILLABAMBA",null,"02","08","YANATILE                                                                                            ","0208 - YANATILE                                                                                            ",15,"000002507","PACCARECTAMBO","01","03","10","07","0103","000002507 - PACCARECTAMBO",null,null,null,null,null,"03","00","(All)","0300","0300 - (All)"]
[null,null,null,null,null,"07","CANAS CANCHIS ESPINAR","07 - CANAS CANCHIS ESPINAR",null,"02","09","SIETE CUARTONES                                                                                     ","0209 - SIETE CUARTONES                                                                                     ",16,"000002509","YAURISQUE","01","03","10","09","0103","000002509 - YAURISQUE",null,null,null,null,null,"03","01","ANTA","0301","0301 - ANTA"]
[null,null,null,null,null,"08","HOSPITAL SICUANI","08 - HOSPITAL SICUANI",null,"02","99","(All)","0299 - (All)",17,"000000000","(All)","01","06",null,null,"0106","000000000 - (All)",null,null,null,null,null,"03","02","ANCAHUASI","0302","0302 - ANCAHUASI"]
[null,null,null,null,null,"09","HOSPITAL ESPINAR","09 - HOSPITAL ESPINAR",null,"03","00","NO PERTENECE A NINGUNA MICRORED                                                                     ","0300 - NO PERTENECE A NINGUNA MICRORED                                                                     ",null,"000002520","HUANCARANI","01","06","11","05","0106","000002520 - HUANCARANI",null,null,null,null,null,"03","03","CACHIMAYO","0303","0303 - CACHIMAYO"]
[null,null,null,null,null,"10","KIMBIRI PICHARI","10 - KIMBIRI PICHARI",null,"03","01","SANTA ANA                                                                                           ","0301 - SANTA ANA                                                                                           ",{"$f":"+N29+1","v":18},"000002521","PILCOPATA","01","06","11","06","0106","000002521 - PILCOPATA",null,null,null,null,null,"03","04","CHINCHAYPUJIO","0304","0304 - CHINCHAYPUJIO"]
[null,null,null,null,null,"11","CHUMBIVILCAS","11 - CHUMBIVILCAS",null,"03","02","MARANURA                                                                                            ","0302 - MARANURA                                                                                            ",19,"000002522","PATRIA","01","06","11","06","0106","000002522 - PATRIA",null,null,null,null,null,"03","05","HUAROCONDO","0305","0305 - HUAROCONDO"]
[null,null,null,null,null,"99","(ALL)",{"$f":"CONCATENATE(F33,\" - \",G33)","v":"99 - (ALL)"},null,"03","03","QUELLOUNO                                                                                           ","0303 - QUELLOUNO                                                                                           ",20,"000002510","PAUCARTAMBO","01","06","11","01","0106","000002510 - PAUCARTAMBO",null,null,null,null,null,"03","06","LIMATAMBO","0306","0306 - LIMATAMBO"]
[null,null,null,null,null,null,null,null,null,"03","04","KITENI                                                                                              ","0304 - KITENI                                                                                              ",21,"000002511","MOLLOMARCA","01","06","11","01","0106","000002511 - MOLLOMARCA",null,null,null,null,null,"03","07","MOLLEPATA","0307","0307 - MOLLEPATA"]
[null,null,null,null,null,null,null,null,null,"03","05","KAMISEA                                                                                             ","0305 - KAMISEA                                                                                             ",22,"000010077","PAUCARTAMBO -ESSALUD","01","06","11","01","0106","000010077 - PAUCARTAMBO -ESSALUD",null,null,null,null,null,"03","08","PUCYURA","0308","0308 - PUCYURA"]
[null,null,null,null,null,"SECTORES",null,null,null,"03","06","PUCYURA                                                                                             ","0306 - PUCYURA                                                                                             ",23,"000033777","MENTAL COMUNITARIO VIRGEN DEL ROSARIO","01","06","11","01","0106","000033777 - MENTAL COMUNITARIO VIRGEN DEL ROSARIO",null,null,null,null,null,"03","09","ZURITE","0309","0309 - ZURITE"]
[null,null,null,null,null,"COD_SECTOR","DESC_RED","CONCATENAR",null,"03","07","PALMA REAL","0307 - PALMA REAL",24,"000002512","CAICAY","01","06","11","02","0106","000002512 - CAICAY",null,null,null,null,null,"04","00","(All)","0400","0400 - (All)"]
[null,null,null,null,null,"1","GORE",{"$f":"CONCATENATE(F38,\" - \",G38)","v":"1 - GORE"},null,"03","99","(All)","0399 - (All)",25,"000002513","HUASAC","01","06","11","02","0106","000002513 - HUASAC",null,null,null,null,null,"04","01","CALCA","0401","0401 - CALCA"]
[null,null,null,null,null,"2","ESSALUD",{"$f":"CONCATENATE(F39,\" - \",G39)","v":"2 - ESSALUD"},null,"04","00","NO PERTENECE A NINGUNA MICRORED                                                                     ","0400 - NO PERTENECE A NINGUNA MICRORED                                                                     ",26,"000002514","CHALLABAMBA","01","06","11","03","0106","000002514 - CHALLABAMBA",null,null,null,null,null,"04","02","COYA","0402","0402 - COYA"]
[null,null,null,null,null,"3","OTROS",{"$f":"CONCATENATE(F40,\" - \",G40)","v":"3 - OTROS"},null,"04","01","YANAOCA                                                                                             ","0401 - YANAOCA                                                                                             ",27,"000002516","COLQUEPATA","01","06","11","04","0106","000002516 - COLQUEPATA",null,null,null,null,null,"04","03","LAMAY","0403","0403 - LAMAY"]
[null,null,null,null,null,"99","(ALL)",{"$f":"CONCATENATE(F41,\" - \",G41)","v":"99 - (ALL)"},null,"04","02","EL DESCANSO                                                                                         ","0402 - EL DESCANSO                                                                                         ",28,"000002517","PICHIHUA COLQUEPATA","01","06","11","04","0106","000002517 - PICHIHUA COLQUEPATA",null,null,null,null,null,"04","04","LARES","0404","0404 - LARES"]
[null,null,null,null,null,null,null,null,null,"04","03","COMBAPATA                                                                                           ","0403 - COMBAPATA                                                                                           ",29,"000002518","VIZCOCHONI","01","06","11","04","0106","000002518 - VIZCOCHONI",null,null,null,null,null,"04","05","PISAC","0405","0405 - PISAC"]
[null,null,null,null,null,null,null,null,null,"04","04","TECHO OBRERO                                                                                        ","0404 - TECHO OBRERO                                                                                        ",30,"000002519","AYRE","01","06","11","04","0106","000002519 - AYRE",null,null,null,null,null,"04","06","SAN SALVADOR","0406","0406 - SAN SALVADOR"]
[null,null,null,null,null,null,null,null,null,"04","05","PAMPAPHALLA                                                                                         ","0405 - PAMPAPHALLA                                                                                         ",31,"000006979","TOCRA","01","06","11","04","0106","000006979 - TOCRA",null,null,null,null,null,"04","07","TARAY","0407","0407 - TARAY"]
[null,null,null,null,null,null,null,null,null,"04","06","YAURI                                                                                               ","0406 - YAURI                                                                                               ",32,"000000000","(All)","01","12",null,null,"0112","000000000 - (All)",null,null,null,null,null,"04","08","YANATILE","0408","0408 - YANATILE"]
[null,null,null,null,null,null,null,null,null,"04","99","(All)","0499 - (All)",null,"000002523","URCOS","01","12","12","01","0112","000002523 - URCOS",null,null,null,null,null,"05","00","(All)","0500","0500 - (All)"]
[null,null,null,null,null,null,null,null,null,"05","00","NO PERTENECE A NINGUNA MICRORED                                                                     ","0500 - NO PERTENECE A NINGUNA MICRORED                                                                     ",{"$f":"+N45+1","v":33},"000026385","ESSALUD-URCOS","01","12","12","01","0112","000026385 - ESSALUD-URCOS",null,null,null,null,null,"05","01","YANAOCA","0501","0501 - YANAOCA"]
[null,null,null,null,null,null,null,null,null,"05","01","KIMBIRI                                                                                             ","0501 - KIMBIRI                                                                                             ",34,"000002525","ANDAHUAYLILLAS","01","12","12","02","0112","000002525 - ANDAHUAYLILLAS",null,null,null,null,null,"05","02","CHECCA","0502","0502 - CHECCA"]
[null,null,null,null,null,null,null,null,null,"05","02","PICHARI                                                                                             ","0502 - PICHARI                                                                                             ",35,"000008911","HUARA HUARA","01","12","12","05","0112","000008911 - HUARA HUARA",null,null,null,null,null,"05","03","KUNTURKANKI","0503","0503 - KUNTURKANKI"]
[null,null,null,null,null,null,null,null,null,"05","99","(All)","0599 - (All)",36,"000002530","CUSIPATA","01","12","12","06","0112","000002530 - CUSIPATA",null,null,null,null,null,"05","04","LANGUI","0504","0504 - LANGUI"]
[null,null,null,null,null,null,null,null,null,"06","00","NO PERTENECE A NINGUNA MICRORED                                                                     ","0600 - NO PERTENECE A NINGUNA MICRORED                                                                     ",37,"000006980","CHILLIHUANI","01","12","12","06","0112","000006980 - CHILLIHUANI",null,null,null,null,null,"05","05","LAYO","0505","0505 - LAYO"]
[null,null,null,null,null,null,null,null,null,"06","09","SANTO TOMAS                                                                                         ","0609 - SANTO TOMAS                                                                                         ",38,"000002532","HUARO","01","12","12","07","0112","000002532 - HUARO",null,null,null,null,null,"05","06","PAMPAMARCA","0506","0506 - PAMPAMARCA"]
[null,null,null,null,null,null,null,null,null,"06","01","LIVITACA                                                                                            ","0601 - LIVITACA                                                                                            ",39,"000002533","URPAY","01","12","12","07","0112","000002533 - URPAY",null,null,null,null,null,"05","07","QUEHUE","0507","0507 - QUEHUE"]
[null,null,null,null,null,null,null,null,null,"06","99","(All)","0699 - (All)",40,"000011747","POSTA MEDICA POLICIAL PUCUTO","01","12","12","07","0112","000011747 - POSTA MEDICA POLICIAL PUCUTO",null,null,null,null,null,"05","08","TUPAC AMARU","0508","0508 - TUPAC AMARU"]
[null,null,null,null,null,null,null,null,null,"99","99","(All)","9999 - (All)",41,"000030708","MENTAL COMUNITARIO HUARO","01","12","12","07","0112","000030708 - MENTAL COMUNITARIO HUARO",null,null,null,null,null,"06","00","(All)","0600","0600 - (All)"]
[null,null,null,null,null,null,null,null,null,null,null,null,null,42,"000002534","LUCRE","01","12","12","08","0112","000002534 - LUCRE",null,null,null,null,null,"06","01","SICUANI","0601","0601 - SICUANI"]
[null,null,null,null,null,null,null,null,null,null,null,null,null,43,"000002537","OROPESA","01","12","12","11","0112","000002537 - OROPESA",null,null,null,null,null,"06","02","CHECACUPE","0602","0602 - CHECACUPE"]
[null,null,null,null,null,null,null,null,null,null,null,null,null,44,"000002538","QUIQUIJANA","01","12","12","12","0112","000002538 - QUIQUIJANA",null,null,null,null,null,"06","03","COMBAPATA","0603","0603 - COMBAPATA"]
[null,null,null,null,null,null,null,null,null,null,null,null,null,45,"000002539","CCOLCA","01","12","12","12","0112","000002539 - CCOLCA",null,null,null,null,null,"06","04","MARANGANI","0604","0604 - MARANGANI"]
[null,null,null,null,null,null,null,null,null,null,null,null,null,46,"000000000","(All)","01","13",null,null,"0113","000000000 - (All)",null,null,null,null,null,"06","05","PITUMARCA","0605","0605 - PITUMARCA"]
[null,null,null,null,null,null,null,null,null,null,null,null,null,null,"000002317","ACOMAYO","01","13","02","01","0113","000002317 - ACOMAYO",null,null,null,null,null,"06","06","SAN PABLO","0606","0606 - SAN PABLO"]
[null,null,null,null,null,null,null,null,null,null,null,null,null,{"$f":"+N60+1","v":47},"000010076","ACOMAYO - ESSALUD","01","13","02","01","0113","000010076 - ACOMAYO - ESSALUD",null,null,null,null,null,"06","07","SAN PEDRO","0607","0607 - SAN PEDRO"]
[null,null,null,null,null,null,null,null,null,null,null,null,null,48,"000002318","ACOPIA","01","13","02","02","0113","000002318 - ACOPIA",null,null,null,null,null,"06","08","TINTA","0608","0608 - TINTA"]
[null,null,null,null,null,null,null,null,null,null,null,null,null,49,"000002319","ACOS","01","13","02","03","0113","000002319 - ACOS",null,null,null,null,null,"07","00","(All)","0700","0700 - (All)"]
[null,null,null,null,null,null,null,null,null,null,null,null,null,50,"000002321","POMACANCHI","01","13","02","05","0113","000002321 - POMACANCHI",null,null,null,null,null,"07","01","SANTO TOMAS","0701","0701 - SANTO TOMAS"]
[null,null,null,null,null,null,null,null,null,null,null,null,null,51,"000002322","SAN JUAN DE POMACANCHI","01","13","02","05","0113","000002322 - SAN JUAN DE POMACANCHI",null,null,null,null,null,"07","02","CAPACMARCA","0702","0702 - CAPACMARCA"]
[null,null,null,null,null,null,null,null,null,null,null,null,null,52,"000012926","SANTA LUCIA","01","13","02","05","0113","000012926 - SANTA LUCIA",null,null,null,null,null,"07","03","CHAMACA","0703","0703 - CHAMACA"]
[null,null,null,null,null,null,null,null,null,null,null,null,null,53,"000002324","PUESTO DE SALUD SANGARARA","01","13","02","07","0113","000002324 - PUESTO DE SALUD SANGARARA",null,null,null,null,null,"07","04","COLQUEMARCA","0704","0704 - COLQUEMARCA"]
[null,null,null,null,null,null,null,null,null,null,null,null,null,54,"000002325","PUESTO DE SALUD MARCACONGA","01","13","02","07","0113","000002325 - PUESTO DE SALUD MARCACONGA",null,null,null,null,null,"07","05","LIVITACA","0705","0705 - LIVITACA"]
[null,null,null,null,null,null,null,null,null,null,null,null,null,55,"000002508","PILLPINTO","01","13","10","08","0113","000002508 - PILLPINTO",null,null,null,null,null,"07","06","LLUSCO","0706","0706 - LLUSCO"]
[null,null,null,null,null,null,null,null,null,null,null,null,null,56,"000000000","(All)","01","15",null,null,"0115","000000000 - (All)",null,null,null,null,null,"07","07","QUIÑOTA","0707","0707 - QUIÑOTA"]
[null,null,null,null,null,null,null,null,null,null,null,null,null,null,"000002526","QUINCE MIL","01","15","12","03","0115","000002526 - QUINCE MIL",null,null,null,null,null,"07","08","VELILLE","0708","0708 - VELILLE"]
[null,null,null,null,null,null,null,null,null,null,null,null,null,{"$f":"+N71+1","v":57},"000002527","CCARHUAYO","01","15","12","04","0115","000002527 - CCARHUAYO",null,null,null,null,null,"08","00","(All)","0800","0800 - (All)"]
[null,null,null,null,null,null,null,null,null,null,null,null,null,58,"000002524","PAMPACAMARA","01","15","12","05","0115","000002524 - PAMPACAMARA",null,null,null,null,null,"08","01","ESPINAR","0801","0801 - ESPINAR"]
[null,null,null,null,null,null,null,null,null,null,null,null,null,59,"000002528","CCATCCA","01","15","12","05","0115","000002528 - CCATCCA",null,null,null,null,null,"08","02","CONDOROMA",{"$f":"CONCATENATE(AB75,AC75)","v":"0802"},{"$f":"CONCATENATE(AB75,AC75,\" - \",AD75)","v":"0802 - CONDOROMA"}]
[null,null,null,null,null,null,null,null,null,null,null,null,null,60,"000002529","KCAURY","01","15","12","05","0115","000002529 - KCAURY",null,null,null,null,null,"08","03","COPORAQUE","0803","0803 - COPORAQUE"]
[null,null,null,null,null,null,null,null,null,null,null,null,null,{"$f":"+N76+1","v":61},"000012931","CHICHINA","01","15","12","05","0115","000012931 - CHICHINA",null,null,null,null,null,"08","04","OCORURO","0804","0804 - OCORURO"]
[null,null,null,null,null,null,null,null,null,null,null,null,null,62,"000016335","CCAPANA","01","15","12","05","0115","000016335 - CCAPANA",null,null,null,null,null,"08","05","PALLPATA","0805","0805 - PALLPATA"]
[null,null,null,null,null,null,null,null,null,null,null,null,null,63,"000002535","MARCAPATA","01","15","12","09","0115","000002535 - MARCAPATA",null,null,null,null,null,"08","06","PICHIGUA","0806","0806 - PICHIGUA"]
[null,null,null,null,null,null,null,null,null,null,null,null,null,64,"000007110","INCACANCHA","01","15","12","09",{"$f":"CONCATENATE(Q80,R80)","v":"0115"},{"$f":"CONCATENATE(O80,\" - \",P80)","v":"000007110 - INCACANCHA"},null,null,null,null,null,"08","07","SUYCKUTAMBO","0807","0807 - SUYCKUTAMBO"]
[null,null,null,null,null,null,null,null,null,null,null,null,null,65,"000002536","OCONGATE","01","15","12","10","0115","000002536 - OCONGATE",null,null,null,null,null,"08","08","ALTO PICHIGUA","0808","0808 - ALTO PICHIGUA"]
[null,null,null,null,null,null,null,null,null,null,null,null,null,66,"000006977","TINKI","01","15","12","10","0115","000006977 - TINKI",null,null,null,null,null,"09","00","(All)","0900","0900 - (All)"]
[null,null,null,null,null,null,null,null,null,null,null,null,null,67,"000000000","(All)","01","16",null,null,"0116","000000000 - (All)",null,null,null,null,null,"09","01","SANTA ANA","0901","0901 - SANTA ANA"]
[null,null,null,null,null,null,null,null,null,null,null,null,null,null,"000002300","SAN JERONIMO","01","16","01","04","0116","000002300 - SAN JERONIMO",null,null,null,null,null,"09","02","ECHARATE","0902","0902 - ECHARATE"]
[null,null,null,null,null,null,null,null,null,null,null,null,null,{"$f":"+N83+1","v":68},"000007699","CONCHACALLE","01","16","01","04","0116","000007699 - CONCHACALLE",null,null,null,null,null,"09","03","HUAYOPATA","0903","0903 - HUAYOPATA"]
[null,null,null,null,null,null,null,null,null,null,null,null,null,69,"000018926","ESTABLECIMIENTO PENITENCIARIO CUSCO VARONES","01","16","01","04","0116","000018926 - ESTABLECIMIENTO PENITENCIARIO CUSCO VARONES",null,null,null,null,null,"09","04","MARANURA","0904","0904 - MARANURA"]
[null,null,null,null,null,null,null,null,null,null,null,null,null,70,"000021187","ESTABLECIMIENTO PENITENCIARIO CUSCO MUJERES","01","16","01","04","0116","000021187 - ESTABLECIMIENTO PENITENCIARIO CUSCO MUJERES",null,null,null,null,null,"09","05","OCOBAMBA","0905","0905 - OCOBAMBA"]
[null,null,null,null,null,null,null,null,null,null,null,null,null,71,"000030727","PATRÓN SAN SEBASTIAN","01","16","01","04","0116","000030727 - PATRÓN SAN SEBASTIAN",null,null,null,null,null,"09","06","QUELLOUNO","0906","0906 - QUELLOUNO"]
[null,null,null,null,null,null,null,null,null,null,null,null,null,72,"000002301","SAN SEBASTIAN","01","16","01","05","0116","000002301 - SAN SEBASTIAN",null,null,null,null,null,"09","07","KIMBIRI","0907","0907 - KIMBIRI"]
[null,null,null,null,null,null,null,null,null,null,null,null,null,73,"000002303","SANTA ROSA","01","16","01","05","0116","000002303 - SANTA ROSA",null,null,null,null,null,"09","08","SANTA TERESA","0908","0908 - SANTA TERESA"]
[null,null,null,null,null,null,null,null,null,null,null,null,null,74,"000010065","SAN SEBASTIAN ESSALUD","01","16","01","05","0116","000010065 - SAN SEBASTIAN ESSALUD",null,null,null,null,null,"09","09","VILCABAMBA","0909","0909 - VILCABAMBA"]
[null,null,null,null,null,null,null,null,null,null,null,null,null,75,"000011743","POLICIAL \"SANTA ROSA\"  CUSCO","01","16","01","05","0116","000011743 - POLICIAL \"SANTA ROSA\"  CUSCO",null,null,null,null,null,"09","10","PICHARI","0910","0910 - PICHARI"]
[null,null,null,null,null,null,null,null,null,null,null,null,null,76,"000026181","MENTAL SAN SEBASTIAN","01","16","01","05","0116","000026181 - MENTAL SAN SEBASTIAN",null,null,null,null,null,"09","11","INKAWASI                                ","0911","0911 - INKAWASI                                "]
[null,null,null,null,null,null,null,null,null,null,null,null,null,77,"000002314","SAYLLA","01","16","01","07","0116","000002314 - SAYLLA",null,null,null,null,null,"09","12","VILLA VIRGEN","0912","0912 - VILLA VIRGEN"]
[null,null,null,null,null,null,null,null,null,null,null,null,null,78,"000002323","RONDOCAN","01","16","02","06","0116","000002323 - RONDOCAN",null,null,null,null,null,"09","13","VILLA KINTIARINA","0913","0913 - VILLA KINTIARINA"]
[null,null,null,null,null,null,null,null,null,null,null,null,null,79,"999999999","(All)","01","99",null,null,"0199","999999999 - (All)",null,null,null,null,null,"09","14","MEGANTONI","0914","0914 - MEGANTONI"]
[null,null,null,null,null,null,null,null,null,null,null,null,null,null,"000000000","(All)","02","01",null,null,"0201","000000000 - (All)",null,null,null,null,null,"09","15","KUMPIRUSHIATO","0915","0915 - KUMPIRUSHIATO"]
[null,null,null,null,null,null,null,null,null,null,null,null,null,null,"000002292","INDEPENDENCIA","02","01","01","01","0201","000002292 - INDEPENDENCIA",null,null,null,null,null,"09","16","CIELO PUNCO","0916","0916 - CIELO PUNCO"]
[null,null,null,null,null,null,null,null,null,null,null,null,null,{"$f":"+N96+1","v":80},"000002297","CCORCCA","02","01","01","02","0201","000002297 - CCORCCA",null,null,null,null,null,"09","17","MANITEA","0917","0917 - MANITEA"]
[null,null,null,null,null,null,null,null,null,null,null,null,null,81,"000002306","BELEMPAMPA","02","01","01","06","0201","000002306 - BELEMPAMPA",null,null,null,null,null,"09","18","UNION ASHANINKA","0918","0918 - UNION ASHANINKA"]
[null,null,null,null,null,null,null,null,null,null,null,null,null,82,"000002308","ZARZUELA ALTA","02","01","01","06","0201","000002308 - ZARZUELA ALTA",null,null,null,null,null,"09","00","(All)","0900","0900 - (All)"]
[null,null,null,null,null,null,null,null,null,null,null,null,null,83,"000002309","DIGNIDAD NACIONAL","02","01","01","06","0201","000002309 - DIGNIDAD NACIONAL",null,null,null,null,null,"10","01","PARURO","1001","1001 - PARURO"]
[null,null,null,null,null,null,null,null,null,null,null,null,null,84,"000002313","OCCOPATA","02","01","01","06","0201","000002313 - OCCOPATA",null,null,null,null,null,"10","02","ACCHA","1002","1002 - ACCHA"]
[null,null,null,null,null,null,null,null,null,null,null,null,null,85,"000010920","QUINTA BRIGADA DE MONTAÑA","02","01","01","06","0201","000010920 - QUINTA BRIGADA DE MONTAÑA",null,null,null,null,null,"10","03","CCAPI","1003","1003 - CCAPI"]
[null,null,null,null,null,null,null,null,null,null,null,null,null,86,"000026182","MENTAL SANTIAGO","02","01","01","06","0201","000026182 - MENTAL SANTIAGO",null,null,null,null,null,"10","04","COLCHA","1004","1004 - COLCHA"]
[null,null,null,null,null,null,null,null,null,null,null,null,null,87,"000034933","SANTIAGO ESSALUD","02","01","01","06","0201","000034933 - SANTIAGO ESSALUD",null,null,null,null,null,"10","05","HUANOQUITE","1005","1005 - HUANOQUITE"]
[null,null,null,null,null,null,null,null,null,null,null,null,null,88,"000023721","EJERCITO-PERUANO 5TA BM","02","01","01","06","0201","000023721 - EJERCITO-PERUANO 5TA BM",null,null,null,null,null,"10","06","OMACHA","1006","1006 - OMACHA"]
[null,null,null,null,null,null,null,null,null,null,null,null,null,null,"000000000","(All)","02","02",null,null,"0202","000000000 - (All)",null,null,null,null,null,"10","07","PACCARITAMBO","1007","1007 - PACCARITAMBO"]
[null,null,null,null,null,null,null,null,null,null,null,null,null,{"$f":"+N107+1","v":89},"000034419","MENTAL COMUNITARIO CUSCO","02","02","01","01","0202","000034419 - MENTAL COMUNITARIO CUSCO",null,null,null,null,null,"10","08","PILLPINTO","1008","1008 - PILLPINTO"]
[null,null,null,null,null,null,null,null,null,null,null,null,null,90,"000002302","CCORAO","02","02","01","05","0202","000002302 - CCORAO",null,null,null,null,null,"10","09","YAURISQUE","1009","1009 - YAURISQUE"]
[null,null,null,null,null,null,null,null,null,null,null,null,null,91,"000002307","MANCO CAPAC","02","02","01","06","0202","000002307 - MANCO CAPAC",null,null,null,null,null,"11","00","(All)","1100","1100 - (All)"]
[null,null,null,null,null,null,null,null,null,null,null,null,null,92,"000002310","CHOCCO","02","02","01","06","0202","000002310 - CHOCCO",null,null,null,null,null,"11","01","PAUCARTAMBO","1101","1101 - PAUCARTAMBO"]
[null,null,null,null,null,null,null,null,null,null,null,null,null,93,"000002315","WANCHAQ","02","02","01","08","0202","000002315 - WANCHAQ",null,null,null,null,null,"11","02","CAICAY","1102","1102 - CAICAY"]
[null,null,null,null,null,null,null,null,null,null,null,null,null,94,"000002316","TTIO","02","02","01","08","0202","000002316 - TTIO",null,null,null,null,null,"11","03","CHALLABAMBA","1103","1103 - CHALLABAMBA"]
[null,null,null,null,null,null,null,null,null,null,null,null,null,95,"000010041","ADOLFO GUEVARA VELASCO","02","02","01","08","0202","000010041 - ADOLFO GUEVARA VELASCO",null,null,null,null,null,"11","04","COLQUEPATA","1104","1104 - COLQUEPATA"]
[null,null,null,null,null,null,null,null,null,null,null,null,null,96,"000026183","METROPOLITANO","02","02","01","08","0202","000026183 - METROPOLITANO",null,null,null,null,null,"11","05","HUANCARANI","1105","1105 - HUANCARANI"]
[null,null,null,null,null,null,null,null,null,null,null,null,null,null,"000030730","PATRON SANTIAGO","02","02","01","08","0202","000030730 - PATRON SANTIAGO",null,null,null,null,null,"11","06","KOSÑIPATA","1106","1106 - KOSÑIPATA"]
[null,null,null,null,null,null,null,null,null,null,null,null,null,{"$f":"+N116+1","v":97},"000000000","(All)","02","03",null,null,"0203","000000000 - (All)",null,null,null,null,null,"12","00","(All)","1200","1200 - (All)"]
[null,null,null,null,null,null,null,null,null,null,null,null,null,98,"000002326","ANTA","02","03","03","01","0203","000002326 - ANTA",null,null,null,null,null,"12","01","URCOS","1201","1201 - URCOS"]
[null,null,null,null,null,null,null,null,null,null,null,null,null,99,"000002328","COMPONE","02","03","03","01","0203","000002328 - COMPONE",null,null,null,null,null,"12","02","ANDAHUAYLILLAS","1202","1202 - ANDAHUAYLILLAS"]
[null,null,null,null,null,null,null,null,null,null,null,null,null,100,"000002329","CONCHACALLA","02","03","03","01","0203","000002329 - CONCHACALLA",null,null,null,null,null,"12","03","CAMANTI","1203","1203 - CAMANTI"]
[null,null,null,null,null,null,null,null,null,null,null,null,null,101,"000027790","MENTAL COMUNITARIO ANTA","02","03","03","01","0203","000027790 - MENTAL COMUNITARIO ANTA",null,null,null,null,null,"12","04","CCARHUAYO","1204","1204 - CCARHUAYO"]
[null,null,null,null,null,null,null,null,null,null,null,null,null,102,"000029514","ESSALUD ANTA","02","03","03","01","0203","000029514 - ESSALUD ANTA",null,null,null,null,null,"12","05","CCATCA","1205","1205 - CCATCA"]
[null,null,null,null,null,null,null,null,null,null,null,null,null,103,"000002330","ANCAHUASI","02","03","03","02","0203","000002330 - ANCAHUASI",null,null,null,null,null,"12","06","CUSIPATA","1206","1206 - CUSIPATA"]
[null,null,null,null,null,null,null,null,null,null,null,null,null,104,"000002331","CACHIMAYO","02","03","03","03","0203","000002331 - CACHIMAYO",null,null,null,null,null,"12","07","HUARO","1207","1207 - HUARO"]
[null,null,null,null,null,null,null,null,null,null,null,null,null,105,"000006972","PANTIPATA","02","03","03","04","0203","000006972 - PANTIPATA",null,null,null,null,null,"12","08","LUCRE","1208","1208 - LUCRE"]
[null,null,null,null,null,null,null,null,null,null,null,null,null,106,"000036240","CHINCHAYPUJIO","02","03","03","04","0203","000036240 - CHINCHAYPUJIO",null,null,null,null,null,"12","09","MARCAPATA","1209","1209 - MARCAPATA"]
[null,null,null,null,null,null,null,null,null,null,null,null,null,107,"000035838","PARCCOTICA","02","03","03","04","0203","000035838 - PARCCOTICA",null,null,null,null,null,"12","10","OCONGATE","1210","1210 - OCONGATE"]
[null,null,null,null,null,null,null,null,null,null,null,null,null,108,"000002333","HUAROCONDO","02","03","03","05","0203","000002333 - HUAROCONDO",null,null,null,null,null,"12","11","OROPESA","1211","1211 - OROPESA"]
[null,null,null,null,null,null,null,null,null,null,null,null,null,109,"000002334","HUAYLLACOCHA","02","03","03","05","0203","000002334 - HUAYLLACOCHA",null,null,null,null,null,"12","12","QUIQUIJANA","1212","1212 - QUIQUIJANA"]
[null,null,null,null,null,null,null,null,null,null,null,null,null,110,"000002339","PUCYURA ANTA","02","03","03","08","0203","000002339 - PUCYURA ANTA",null,null,null,null,null,"13","00","(All)","1300","1300 - (All)"]
[null,null,null,null,null,null,null,null,null,null,null,null,null,null,"000002340","ZURITE","02","03","03","09","0203","000002340 - ZURITE",null,null,null,null,null,"13","01","URUBAMBA","1301","1301 - URUBAMBA"]
[null,null,null,null,null,null,null,null,null,null,null,null,null,{"$f":"+N131+1","v":111},"000002327","CHACAN","02","03","03","01","0203","000002327 - CHACAN",null,null,null,null,null,"13","02","CHINCHERO","1302","1302 - CHINCHERO"]
[null,null,null,null,null,null,null,null,null,null,null,null,null,112,"000000000","(All)","02","04",null,null,"0204","000000000 - (All)",null,null,null,null,null,"13","03","HUAYLLABAMBA","1303","1303 - HUAYLLABAMBA"]
[null,null,null,null,null,null,null,null,null,null,null,null,null,113,"000002336","LIMATAMBO","02","04","03","06","0204","000002336 - LIMATAMBO",null,null,null,null,null,"13","04","MACHUPICCHU","1304","1304 - MACHUPICCHU"]
[null,null,null,null,null,null,null,null,null,null,null,null,null,114,"000002337","PAMPACONGA","02","04","03","06","0204","000002337 - PAMPACONGA",null,null,null,null,null,"13","05","MARAS","1305","1305 - MARAS"]
[null,null,null,null,null,null,null,null,null,null,null,null,null,115,"000010761","URATARI","02","04","03","06","0204","000010761 - URATARI",null,null,null,null,null,"13","06","OLLANTAYTAMBO","1306","1306 - OLLANTAYTAMBO"]
[null,null,null,null,null,null,null,null,null,null,null,null,null,null,"000002338","MOLLEPATA","02","04","03","07","0204","000002338 - MOLLEPATA",null,null,null,null,null,"13","07","YUCAY",{"$f":"CONCATENATE(AB138,AC138)","v":"1307"},"1307 - YUCAY"]
[null,null,null,null,null,null,null,null,null,null,null,null,null,{"$f":"+N137+1","v":116},"000021061","HUAMANPATA","02","04","03","07","0204","000021061 - HUAMANPATA",null,null,null,null,null,"00","00","(All)",{"$f":"CONCATENATE(AB139,AC139)","v":"0000"},"0000 - (All)"]
[null,null,null,null,null,null,null,null,null,null,null,null,null,117,"000000000","(All)","02","05",null,null,"0205","000000000 - (All)"]
[null,null,null,null,null,null,null,null,null,null,null,null,null,{"$f":"+N140+1","v":118},"000002343","COYA","02","05","04","02","0205","000002343 - COYA"]
[null,null,null,null,null,null,null,null,null,null,null,null,null,119,"000002344","LAMAY","02","05","04","03","0205","000002344 - LAMAY"]
[null,null,null,null,null,null,null,null,null,null,null,null,null,120,"000006975","SAYLLAFAYA","02","05","04","03","0205","000006975 - SAYLLAFAYA"]
[null,null,null,null,null,null,null,null,null,null,null,null,null,121,"000007145","HUAMA","02","05","04","03","0205","000007145 - HUAMA"]
[null,null,null,null,null,null,null,null,null,null,null,null,null,122,"000007146","POQUES","02","05","04","03","0205","000007146 - POQUES"]
[null,null,null,null,null,null,null,null,null,null,null,null,null,123,"000036012","HUARQUI","02","05","04","03","0205","000036012 - HUARQUI"]
[null,null,null,null,null,null,null,null,null,null,null,null,null,124,"000002348","PISAC","02","05","04","05","0205","000002348 - PISAC"]
[null,null,null,null,null,null,null,null,null,null,null,null,null,125,"000002349","CUYO CHICO","02","05","04","05","0205","000002349 - CUYO CHICO"]
[null,null,null,null,null,null,null,null,null,null,null,null,null,126,"000002350","CUYO GRANDE","02","05","04","05","0205","000002350 - CUYO GRANDE"]
[null,null,null,null,null,null,null,null,null,null,null,null,null,127,"000002351","QUELLO QUELLO","02","05","04","05",{"$f":"CONCATENATE(Q150,R150)","v":"0205"},{"$f":"CONCATENATE(O150,\" - \",P150)","v":"000002351 - QUELLO QUELLO"}]
[null,null,null,null,null,null,null,null,null,null,null,null,null,128,"000002352","SAN SALVADOR","02","05","04","06","0205","000002352 - SAN SALVADOR"]
[null,null,null,null,null,null,null,null,null,null,null,null,null,129,"000036087","TIRACANCHA","02","05","04","06","0205","000036087 - TIRACANCHA"]
[null,null,null,null,null,null,null,null,null,null,null,null,null,null,"000002353","TARAY","02","05","04","07","0205","000002353 - TARAY"]
[null,null,null,null,null,null,null,null,null,null,null,null,null,{"$f":"+N152+1","v":130},"000002354","HUANCALLE","02","05","04","07","0205","000002354 - HUANCALLE"]
[null,null,null,null,null,null,null,null,null,null,null,null,null,131,"000000000","(All)","02","06",null,null,"0206","000000000 - (All)"]
[null,null,null,null,null,null,null,null,null,null,null,null,null,132,"000002341","CALCA","02","06","04","01","0206","000002341 - CALCA"]
[null,null,null,null,null,null,null,null,null,null,null,null,null,133,"000010069","ESSALUD CALCA","02","06","04","01","0206","000010069 - ESSALUD CALCA"]
[null,null,null,null,null,null,null,null,null,null,null,null,null,134,"000010759","HUARAN","02","06","04","01","0206","000010759 - HUARAN"]
[null,null,null,null,null,null,null,null,null,null,null,null,null,135,"000010762","ACCHA ALTA - PAMPALLACTA","02","06","04","01","0206","000010762 - ACCHA ALTA - PAMPALLACTA"]
[null,null,null,null,null,null,null,null,null,null,null,null,null,136,"000026273","MENTAL COMUNITARIO VIRGEN ASUNTA DE CALCA","02","06","04","01","0206","000026273 - MENTAL COMUNITARIO VIRGEN ASUNTA DE CALCA"]
[null,null,null,null,null,null,null,null,null,null,null,null,null,137,"000002342","AMPARAES","02","06","04","04","0206","000002342 - AMPARAES"]
[null,null,null,null,null,null,null,null,null,null,null,null,null,138,"000002345","CCACHIN","02","06","04","04","0206","000002345 - CCACHIN"]
[null,null,null,null,null,null,null,null,null,null,null,null,null,139,"000002346","CHOQUECANCHA","02","06","04","04","0206","000002346 - CHOQUECANCHA"]
[null,null,null,null,null,null,null,null,null,null,null,null,null,140,"000002347","LARES","02","06","04","04","0206","000002347 - LARES"]
[null,null,null,null,null,null,null,null,null,null,null,null,null,141,"000002361","SUYO","02","06","04","04","0206","000002361 - SUYO"]
[null,null,null,null,null,null,null,null,null,null,null,null,null,142,"000007144","PATABAMBA","02","06","04","07","0206","000007144 - PATABAMBA"]
[null,null,null,null,null,null,null,null,null,null,null,null,null,143,"000002515","PAROBAMBA","02","06","11","03","0206","000002515 - PAROBAMBA"]
[null,null,null,null,null,null,null,null,null,null,null,null,null,144,"000007143","OTOCANI","02","06","11","03","0206","000007143 - OTOCANI"]
[null,null,null,null,null,null,null,null,null,null,null,null,null,145,"000000000","(All)","02","07",null,null,"0207","000000000 - (All)"]
[null,null,null,null,null,null,null,null,null,null,null,null,null,146,"000002540","URUBAMBA","02","07","13","01","0207","000002540 - URUBAMBA"]
[null,null,null,null,null,null,null,null,null,null,null,null,null,147,"000002541","YANAHUARA","02","07","13","01","0207","000002541 - YANAHUARA"]
[null,null,null,null,null,null,null,null,null,null,null,null,null,148,"000010060","CAS URUBAMBA -ESSALUD","02","07","13","01","0207","000010060 - CAS URUBAMBA -ESSALUD"]
[null,null,null,null,null,null,null,null,null,null,null,null,null,149,"000030666","MENTAL COMUNITARIO URUBAMBA","02","07","13","01","0207","000030666 - MENTAL COMUNITARIO URUBAMBA"]
[null,null,null,null,null,null,null,null,null,null,null,null,null,150,"000035851","URUBAMBA - ESSALUD","02","07","13","01","0207","000035851 - URUBAMBA - ESSALUD"]
[null,null,null,null,null,null,null,null,null,null,null,null,null,151,"000002543","CHINCHERO","02","07","13","02","0207","000002543 - CHINCHERO"]
[null,null,null,null,null,null,null,null,null,null,null,null,null,152,"000002544","OCCOTUAN","02","07","13","02","0207","000002544 - OCCOTUAN"]
[null,null,null,null,null,null,null,null,null,null,null,null,null,153,"000002545","HUAYLLABAMBA","02","07","13","03","0207","000002545 - HUAYLLABAMBA"]
[null,null,null,null,null,null,null,null,null,null,null,null,null,154,"000002546","MACHUPICCHU","02","07","13","04","0207","000002546 - MACHUPICCHU"]
[null,null,null,null,null,null,null,null,null,null,null,null,null,155,"000002547","COLLPANI","02","07","13","04","0207","000002547 - COLLPANI"]
[null,null,null,null,null,null,null,null,null,null,null,null,null,156,"000006974","CAMINO INCA HUAYLLABAMBA","02","07","13","04","0207","000006974 - CAMINO INCA HUAYLLABAMBA"]
[null,null,null,null,null,null,null,null,null,null,null,null,null,157,"000010073","MACHU PICCHU - ESSALUD","02","07","13","04","0207","000010073 - MACHU PICCHU - ESSALUD"]
[null,null,null,null,null,null,null,null,null,null,null,null,null,158,"000002548","MARAS","02","07","13","05","0207","000002548 - MARAS"]
[null,null,null,null,null,null,null,null,null,null,null,null,null,159,"000010758","CRUZPATA","02","07","13","05","0207","000010758 - CRUZPATA"]
[null,null,null,null,null,null,null,null,null,null,null,null,null,160,"000002549","OLLANTAYTAMBO","02","07","13","06","0207","000002549 - OLLANTAYTAMBO"]
[null,null,null,null,null,null,null,null,null,null,null,null,null,161,"000002550","CHILLCA","02","07","13","06","0207","000002550 - CHILLCA"]
[null,null,null,null,null,null,null,null,null,null,null,null,null,162,"000010760","PATACANCHA","02","07","13","06","0207","000010760 - PATACANCHA"]
[null,null,null,null,null,null,null,null,null,null,null,null,null,163,"000002551","YUCAY","02","07","13","07","0207","000002551 - YUCAY"]
[null,null,null,null,null,null,null,null,null,null,null,null,null,164,"000000000","(All)","02","08",null,null,"0208","000000000 - (All)"]
[null,null,null,null,null,null,null,null,null,null,null,null,null,165,"000002355","LA QUEBRADA","02","08","04","08","0208","000002355 - LA QUEBRADA"]
[null,null,null,null,null,null,null,null,null,null,null,null,null,166,"000002356","CCORIMAYO","02","08","04","08","0208","000002356 - CCORIMAYO"]
[null,null,null,null,null,null,null,null,null,null,null,null,null,167,"000002357","COLCCA YANATILE","02","08","04","08","0208","000002357 - COLCCA YANATILE"]
[null,null,null,null,null,null,null,null,null,null,null,null,null,168,"000002358","MUYUPAY","02","08","04","08","0208","000002358 - MUYUPAY"]
[null,null,null,null,null,null,null,null,null,null,null,null,null,169,"000002359","PUTUCUSI","02","08","04","08","0208","000002359 - PUTUCUSI"]
[null,null,null,null,null,null,null,null,null,null,null,null,null,170,"000002360","QUESQUENTO","02","08","04","08","0208","000002360 - QUESQUENTO"]
[null,null,null,null,null,null,null,null,null,null,null,null,null,171,"000002362","HUACHIBAMBA","02","08","04","08","0208","000002362 - HUACHIBAMBA"]
[null,null,null,null,null,null,null,null,null,null,null,null,null,172,"000006971","COMBAPATA YANATILE","02","08","04","08","0208","000006971 - COMBAPATA YANATILE"]
[null,null,null,null,null,null,null,null,null,null,null,null,null,173,"000006973","BELLAVISTA","02","08","04","08","0208","000006973 - BELLAVISTA"]
[null,null,null,null,null,null,null,null,null,null,null,null,null,174,"000007142","CHANCAMAYO","02","08","04","08","0208","000007142 - CHANCAMAYO"]
[null,null,null,null,null,null,null,null,null,null,null,null,null,175,"000002464","VERSALLES","02","08","09","05","0208","000002464 - VERSALLES"]
[null,null,null,null,null,null,null,null,null,null,null,null,null,176,"000002467","PUENTE SANTIAGO","02","08","09","06","0208","000002467 - PUENTE SANTIAGO"]
[null,null,null,null,null,null,null,null,null,null,null,null,null,177,"000000000","(All)","02","09",null,null,"0209","000000000 - (All)"]
[null,null,null,null,null,null,null,null,null,null,null,null,null,178,"000002290","SAN PEDRO CUSCO","02","09","01","01","0209","000002290 - SAN PEDRO CUSCO"]
[null,null,null,null,null,null,null,null,null,null,null,null,null,179,"000002291","SIETE CUARTONES","02","09","01","01","0209","000002291 - SIETE CUARTONES"]
[null,null,null,null,null,null,null,null,null,null,null,null,null,180,"000002293","MIRAFLORES","02","09","01","01","0209","000002293 - MIRAFLORES"]
[null,null,null,null,null,null,null,null,null,null,null,null,null,{"$f":"+N204+1","v":181},"000002294","PICCHU LA RINCONADA","02","09","01","01","0209","000002294 - PICCHU LA RINCONADA"]
[null,null,null,null,null,null,null,null,null,null,null,null,null,182,"000002295","BUENA VISTA","02","09","01","01","0209","000002295 - BUENA VISTA"]
[null,null,null,null,null,null,null,null,null,null,null,null,null,183,"000002299","POROY","02","09","01","03","0209","000002299 - POROY"]
[null,null,null,null,null,null,null,null,null,null,null,null,null,184,"999999999","(All)","02","99",null,null,"0299","999999999 - (All)"]
[null,null,null,null,null,null,null,null,null,null,null,null,null,185,"000002421","QUILLABAMBA","03","00","09","01","0300","000002421 - QUILLABAMBA"]
[null,null,null,null,null,null,null,null,null,null,null,null,null,186,"000000000","(All)","03","01",null,null,"0301","000000000 - (All)"]
[null,null,null,null,null,null,null,null,null,null,null,null,null,187,"000002422","HUAYANAY","03","01","09","01","0301","000002422 - HUAYANAY"]
[null,null,null,null,null,null,null,null,null,null,null,null,null,188,"000002423","IDMA","03","01","09","01","0301","000002423 - IDMA"]
[null,null,null,null,null,null,null,null,null,null,null,null,null,189,"000002424","POTRERO","03","01","09","01","0301","000002424 - POTRERO"]
[null,null,null,null,null,null,null,null,null,null,null,null,null,190,"000008910","SANTA ANA","03","01","09","01","0301","000008910 - SANTA ANA"]
[null,null,null,null,null,null,null,null,null,null,null,null,null,191,"000010062","QUILLABAMBA - ESSALUD","03","01","09","01","0301","000010062 - QUILLABAMBA - ESSALUD"]
[null,null,null,null,null,null,null,null,null,null,null,null,null,192,"000011744","POSTA MEDICO POLICIAL LA CONVENCION - QUILLABAMBA","03","01","09","01","0301","000011744 - POSTA MEDICO POLICIAL LA CONVENCION - QUILLABAMBA"]
[null,null,null,null,null,null,null,null,null,null,null,null,null,193,"000015842","PAVAYOC","03","01","09","01",{"$f":"CONCATENATE(Q217,R217)","v":"0301"},{"$f":"CONCATENATE(O217,\" - \",P217)","v":"000015842 - PAVAYOC"}]
[null,null,null,null,null,null,null,null,null,null,null,null,null,194,"000024653","INPE QUILLABAMBA","03","01","09","01","0301","000024653 - INPE QUILLABAMBA"]
[null,null,null,null,null,null,null,null,null,null,null,null,null,195,"000026386","MENTAL QUILLABAMBA","03","01","09","01","0301","000026386 - MENTAL QUILLABAMBA"]
[null,null,null,null,null,null,null,null,null,null,null,null,null,196,"000002425","ECHARATE","03","01","09","02","0301","000002425 - ECHARATE"]
[null,null,null,null,null,null,null,null,null,null,null,null,null,197,"000002430","PAMPA CONCEPCION","03","01","09","02","0301","000002430 - PAMPA CONCEPCION"]
[null,null,null,null,null,null,null,null,null,null,null,null,null,198,"000002446","CHACCO","03","01","09","02","0301","000002446 - CHACCO"]
[null,null,null,null,null,null,null,null,null,null,null,null,null,199,"000002451","CHAHUARES","03","01","09","02","0301","000002451 - CHAHUARES"]
[null,null,null,null,null,null,null,null,null,null,null,null,null,200,"000033273","SAN ISIDRO LABRADOR - ECHARATI","03","01","09","02","0301","000033273 - SAN ISIDRO LABRADOR - ECHARATI"]
[null,null,null,null,null,null,null,null,null,null,null,null,null,201,"000024296","EJERCITO-MIARIA 334","03","01","09","02","0301","000024296 - EJERCITO-MIARIA 334"]
[null,null,null,null,null,null,null,null,null,null,null,null,null,202,"000000000","(All)","03","02",null,null,"0302","000000000 - (All)"]
[null,null,null,null,null,null,null,null,null,null,null,null,null,203,"000002453","HUYRO","03","02","09","03","0302","000002453 - HUYRO"]
[null,null,null,null,null,null,null,null,null,null,null,null,null,204,"000002454","ALFAMAYO","03","02","09","03","0302","000002454 - ALFAMAYO"]
[null,null,null,null,null,null,null,null,null,null,null,null,null,205,"000002455","HUAYOPATA","03","02","09","03","0302","000002455 - HUAYOPATA"]
[null,null,null,null,null,null,null,null,null,null,null,null,null,206,"000002456","AMAYBAMBA","03","02","09","03","0302","000002456 - AMAYBAMBA"]
[null,null,null,null,null,null,null,null,null,null,null,null,null,207,"000002457","SAN PABLO HUAYOPATA","03","02","09","03","0302","000002457 - SAN PABLO HUAYOPATA"]
[null,null,null,null,null,null,null,null,null,null,null,null,null,208,"000010075","CAP HUYRO - ESSALUD","03","02","09","03","0302","000010075 - CAP HUYRO - ESSALUD"]
[null,null,null,null,null,null,null,null,null,null,null,null,null,209,"000002458","MARANURA","03","02","09","04","0302","000002458 - MARANURA"]
[null,null,null,null,null,null,null,null,null,null,null,null,null,210,"000002460","SANTA MARIA","03","02","09","04","0302","000002460 - SANTA MARIA"]
[null,null,null,null,null,null,null,null,null,null,null,null,null,211,"000002461","UCHUMAYO","03","02","09","04","0302","000002461 - UCHUMAYO"]
[null,null,null,null,null,null,null,null,null,null,null,null,null,212,"000002476","SANTA TERESA","03","02","09","08","0302","000002476 - SANTA TERESA"]
[null,null,null,null,null,null,null,null,null,null,null,null,null,213,"000002477","SULLUCUYOC","03","02","09","08","0302","000002477 - SULLUCUYOC"]
[null,null,null,null,null,null,null,null,null,null,null,null,null,214,"000002478","TOTORA","03","02","09","08","0302","000002478 - TOTORA"]
[null,null,null,null,null,null,null,null,null,null,null,null,null,215,"000000000","(All)","03","03",null,null,"0303","000000000 - (All)"]
[null,null,null,null,null,null,null,null,null,null,null,null,null,216,"000002363","TUPAC AMARU QUELLOUNO","03","03","04","08","0303","000002363 - TUPAC AMARU QUELLOUNO"]
[null,null,null,null,null,null,null,null,null,null,null,null,null,217,"000002462","OCCOBAMBA LACONVENCION","03","03","09","05","0303","000002462 - OCCOBAMBA LACONVENCION"]
[null,null,null,null,null,null,null,null,null,null,null,null,null,218,"000002463","CHINGANILLA","03","03","09","05","0303","000002463 - CHINGANILLA"]
[null,null,null,null,null,null,null,null,null,null,null,null,null,219,"000002465","QUELLOUNO","03","03","09","06","0303","000002465 - QUELLOUNO"]
[null,null,null,null,null,null,null,null,null,null,null,null,null,220,"000002466","HUILLCAPAMPA","03","03","09","06","0303","000002466 - HUILLCAPAMPA"]
[null,null,null,null,null,null,null,null,null,null,null,null,null,221,"000002468","SAN MARTIN","03","03","09","06","0303","000002468 - SAN MARTIN"]
[null,null,null,null,null,null,null,null,null,null,null,null,null,222,"000008906","ESTRELLA","03","03","09","06","0303","000008906 - ESTRELLA"]
[null,null,null,null,null,null,null,null,null,null,null,null,null,223,"000008907","MATORIATO","03","03","09","06","0303","000008907 - MATORIATO"]
[null,null,null,null,null,null,null,null,null,null,null,null,null,224,"000008908","CHIRUMBIA","03","03","09","06","0303","000008908 - CHIRUMBIA"]
[null,null,null,null,null,null,null,null,null,null,null,null,null,225,"000008909","CHAPO BOYERO","03","03","09","06","0303","000008909 - CHAPO BOYERO"]
[null,null,null,null,null,null,null,null,null,null,null,null,null,226,"000000000","(All)","03","04",null,null,"0304","000000000 - (All)"]
[null,null,null,null,null,null,null,null,null,null,null,null,null,227,"000002427","KITENI","03","04","09","02","0304","000002427 - KITENI"]
[null,null,null,null,null,null,null,null,null,null,null,null,null,228,"000002431","IVOCHOTE","03","04","09","02","0304","000002431 - IVOCHOTE"]
[null,null,null,null,null,null,null,null,null,null,null,null,null,229,"000002438","PACHIRI","03","04","09","02","0304","000002438 - PACHIRI"]
[null,null,null,null,null,null,null,null,null,null,null,null,null,230,"000002440","PANGOA","03","04","09","02","0304","000002440 - PANGOA"]
[null,null,null,null,null,null,null,null,null,null,null,null,null,231,"000002443","SANIRIATO","03","04","09","02","0304","000002443 - SANIRIATO"]
[null,null,null,null,null,null,null,null,null,null,null,null,null,232,"000002447","KAMANQUIRIATO","03","04","09","02","0304","000002447 - KAMANQUIRIATO"]
[null,null,null,null,null,null,null,null,null,null,null,null,null,233,"000014531","CAP I ECHARATE - KITENI","03","04","09","02","0304","000014531 - CAP I ECHARATE - KITENI"]
[null,null,null,null,null,null,null,null,null,null,null,null,null,234,"000024583","BCT N° 314 - KEPASHIATO","03","04","09","02","0304","000024583 - BCT N° 314 - KEPASHIATO"]
[null,null,null,null,null,null,null,null,null,null,null,null,null,235,"000002489","YUVENI","03","04","09","09","0304","000002489 - YUVENI"]
[null,null,null,null,null,null,null,null,null,null,null,null,null,236,"000002493","SELVA ALEGRE","03","04","09","09","0304","000002493 - SELVA ALEGRE"]
[null,null,null,null,null,null,null,null,null,null,null,null,null,237,"000006976","CHONTABAMBA","03","04","09","09","0304","000006976 - CHONTABAMBA"]
[null,null,null,null,null,null,null,null,null,null,null,null,null,238,"000002432","KEPASHIATO","03","04","09","15","0304","000002432 - KEPASHIATO"]
[null,null,null,null,null,null,null,null,null,null,null,null,null,239,"000002434","MATERIATO","03","04","09","15","0304","000002434 - MATERIATO"]
[null,null,null,null,null,null,null,null,null,null,null,null,null,240,"000013068","TRIO RIO","03","04","09","15","0304","000013068 - TRIO RIO"]
[null,null,null,null,null,null,null,null,null,null,null,null,null,241,"000013069","PUGUIENTIMARI","03","04","09","15","0304","000013069 - PUGUIENTIMARI"]
[null,null,null,null,null,null,null,null,null,null,null,null,null,242,"000000000","(All)","03","05",null,null,"0305","000000000 - (All)"]
[null,null,null,null,null,null,null,null,null,null,null,null,null,243,"000002426","KIRIGUETI","03","05","09","14","0305","000002426 - KIRIGUETI"]
[null,null,null,null,null,null,null,null,null,null,null,null,null,244,"000002428","CHOCORIARI","03","05","09","14","0305","000002428 - CHOCORIARI"]
[null,null,null,null,null,null,null,null,null,null,null,null,null,{"$f":"+N268+1","v":245},"000002435","MIARIA","03","05","09","14","0305","000002435 - MIARIA"]
[null,null,null,null,null,null,null,null,null,null,null,null,null,246,"000002436","NUEVA LUZ","03","05","09","14","0305","000002436 - NUEVA LUZ"]
[null,null,null,null,null,null,null,null,null,null,null,null,null,247,"000002437","NUEVO MUNDO","03","05","09","14","0305","000002437 - NUEVO MUNDO"]
[null,null,null,null,null,null,null,null,null,null,null,null,null,248,"000002441","PUERTO HUALLANA","03","05","09","14","0305","000002441 - PUERTO HUALLANA"]
[null,null,null,null,null,null,null,null,null,null,null,null,null,249,"000002442","PUERTO RICO","03","05","09","14","0305","000002442 - PUERTO RICO"]
[null,null,null,null,null,null,null,null,null,null,null,null,null,250,"000002444","SENSA","03","05","09","14","0305","000002444 - SENSA"]
[null,null,null,null,null,null,null,null,null,null,null,null,null,251,"000002445","TIMPIA","03","05","09","14","0305","000002445 - TIMPIA"]
[null,null,null,null,null,null,null,null,null,null,null,null,null,252,"000002448","KAMISEA","03","05","09","14","0305","000002448 - KAMISEA"]
[null,null,null,null,null,null,null,null,null,null,null,null,null,253,"000002452","SHIVANKORENI","03","05","09","14","0305","000002452 - SHIVANKORENI"]
[null,null,null,null,null,null,null,null,null,null,null,null,null,254,"000013066","MONTETONI","03","05","09","14","0305","000013066 - MONTETONI"]
[null,null,null,null,null,null,null,null,null,null,null,null,null,255,"000013067","TANGOSHIARI","03","05","09","14","0305","000013067 - TANGOSHIARI"]
[null,null,null,null,null,null,null,null,null,null,null,null,null,256,"000015235","NUEVA VIDA","03","05","09","14","0305","000015235 - NUEVA VIDA"]
[null,null,null,null,null,null,null,null,null,null,null,null,null,257,"000015843","CASHIRIARI","03","05","09","14",{"$f":"CONCATENATE(Q281,R281)","v":"0305"},{"$f":"CONCATENATE(O281,\" - \",P281)","v":"000015843 - CASHIRIARI"}]
[null,null,null,null,null,null,null,null,null,null,null,null,null,258,"000015844","CAMANA","03","05","09","14","0305","000015844 - CAMANA"]
[null,null,null,null,null,null,null,null,null,null,null,null,null,259,"000000000","(All)","03","06",null,null,"0306","000000000 - (All)"]
[null,null,null,null,null,null,null,null,null,null,null,null,null,260,"000002480","PUCYURA","03","06","09","09","0306","000002480 - PUCYURA"]
[null,null,null,null,null,null,null,null,null,null,null,null,null,261,"000002484","OYARA","03","06","09","09","0306","000002484 - OYARA"]
[null,null,null,null,null,null,null,null,null,null,null,null,null,262,"000002486","PAMPACONAS","03","06","09","09","0306","000002486 - PAMPACONAS"]
[null,null,null,null,null,null,null,null,null,null,null,null,null,263,"000002490","ARMA","03","06","09","09","0306","000002490 - ARMA"]
[null,null,null,null,null,null,null,null,null,null,null,null,null,264,"000002492","PALTAYBAMBA","03","06","09","09","0306","000002492 - PALTAYBAMBA"]
[null,null,null,null,null,null,null,null,null,null,null,null,null,265,"000002481","CCARCCO","03","06","09","11","0306","000002481 - CCARCCO"]
[null,null,null,null,null,null,null,null,null,null,null,null,null,266,"000002482","INCAHUASI","03","06","09","11","0306","000002482 - INCAHUASI"]
[null,null,null,null,null,null,null,null,null,null,null,null,null,267,"000002485","PACCAYBAMBA","03","06","09","11","0306","000002485 - PACCAYBAMBA"]
[null,null,null,null,null,null,null,null,null,null,null,null,null,268,"000002487","CHOQUETIRA","03","06","09","11","0306","000002487 - CHOQUETIRA"]
[null,null,null,null,null,null,null,null,null,null,null,null,null,269,"000002491","LUCMAHUAYCO","03","06","09","11","0306","000002491 - LUCMAHUAYCO"]
[null,null,null,null,null,null,null,null,null,null,null,null,null,270,"000035520","CHANCAVINE","03","06","09","12","0306","000035520 - CHANCAVINE"]
[null,null,null,null,null,null,null,null,null,null,null,null,null,271,"000000000","(All)","03","07",null,null,"0307","000000000 - (All)"]
[null,null,null,null,null,null,null,null,null,null,null,null,null,272,"000002429","CIRIALO","03","07","09","02","0307","000002429 - CIRIALO"]
[null,null,null,null,null,null,null,null,null,null,null,null,null,273,"000002433","KORIBENI","03","07","09","02","0307","000002433 - KORIBENI"]
[null,null,null,null,null,null,null,null,null,null,null,null,null,274,"000002439","PALMA REAL","03","07","09","02","0307","000002439 - PALMA REAL"]
[null,null,null,null,null,null,null,null,null,null,null,null,null,275,"000002449","ICHIQUIATO","03","07","09","02","0307","000002449 - ICHIQUIATO"]
[null,null,null,null,null,null,null,null,null,null,null,null,null,276,"000002450","SAN ANTONIO","03","07","09","02","0307","000002450 - SAN ANTONIO"]
[null,null,null,null,null,null,null,null,null,null,null,null,null,277,"999999999","(All)","03","99",null,null,"0399","999999999 - (All)"]
[null,null,null,null,null,null,null,null,null,null,null,null,null,278,"000000000","(All)","04","00",null,null,"0400","000000000 - (All)"]
[null,null,null,null,null,null,null,null,null,null,null,null,null,279,"000002378","SICUANI","04","00","06","01","0400","000002378 - SICUANI"]
[null,null,null,null,null,null,null,null,null,null,null,null,null,280,"000007135","ESPINAR","04","00","08","01","0400","000007135 - ESPINAR"]
[null,null,null,null,null,null,null,null,null,null,null,null,null,281,"000000000","(All)","04","01",null,null,"0401","000000000 - (All)"]
[null,null,null,null,null,null,null,null,null,null,null,null,null,282,"000002364","YANAOCA","04","01","05","01","0401","000002364 - YANAOCA"]
[null,null,null,null,null,null,null,null,null,null,null,null,null,283,"000002365","PONGOÑA","04","01","05","01","0401","000002365 - PONGOÑA"]
[null,null,null,null,null,null,null,null,null,null,null,null,null,284,"000018241","HAMPATURA","04","01","05","01","0401","000018241 - HAMPATURA"]
[null,null,null,null,null,null,null,null,null,null,null,null,null,285,"000002367","CHITIBAMBA","04","01","05","02","0401","000002367 - CHITIBAMBA"]
[null,null,null,null,null,null,null,null,null,null,null,null,null,286,"000002372","PAMPAMARCA","04","01","05","06","0401","000002372 - PAMPAMARCA"]
[null,null,null,null,null,null,null,null,null,null,null,null,null,287,"000002373","QUEHUE","04","01","05","07","0401","000002373 - QUEHUE"]
[null,null,null,null,null,null,null,null,null,null,null,null,null,288,"000002374","HUINCHIRI","04","01","05","07","0401","000002374 - HUINCHIRI"]
[null,null,null,null,null,null,null,null,null,null,null,null,null,289,"000034449","CHAUPIBANDA","04","01","05","07","0401","000034449 - CHAUPIBANDA"]
[null,null,null,null,null,null,null,null,null,null,null,null,null,290,"000002375","SURIMANA","04","01","05","08","0401","000002375 - SURIMANA"]
[null,null,null,null,null,null,null,null,null,null,null,null,null,291,"000002376","TUNGASUCA","04","01","05","08","0401","000002376 - TUNGASUCA"]
[null,null,null,null,null,null,null,null,null,null,null,null,null,292,"000002377","TOCCOCCORI","04","01","05","08","0401","000002377 - TOCCOCCORI"]
[null,null,null,null,null,null,null,null,null,null,null,null,null,293,"000032339","CCOCHAPATA","04","01","05","08","0401","000032339 - CCOCHAPATA"]
[null,null,null,null,null,null,null,null,null,null,null,null,null,294,"000000000","(All)","04","02",null,null,"0402","000000000 - (All)"]
[null,null,null,null,null,null,null,null,null,null,null,null,null,295,"000002366","CHECCA","04","02","05","02","0402","000002366 - CHECCA"]
[null,null,null,null,null,null,null,null,null,null,null,null,null,296,"000007700","EL DESCANSO","04","02","05","03","0402","000007700 - EL DESCANSO"]
[null,null,null,null,null,null,null,null,null,null,null,null,null,297,"000002369","LANGUI","04","02","05","04","0402","000002369 - LANGUI"]
[null,null,null,null,null,null,null,null,null,null,null,null,null,298,"000002370","CONDEVILUYO","04","02","05","04","0402","000002370 - CONDEVILUYO"]
[null,null,null,null,null,null,null,null,null,null,null,null,null,299,"000002371","LAYO","04","02","05","05","0402","000002371 - LAYO"]
[null,null,null,null,null,null,null,null,null,null,null,null,null,300,"000000000","(All)","04","03",null,null,"0403","000000000 - (All)"]
[null,null,null,null,null,null,null,null,null,null,null,null,null,301,"000002320","MOSOCLLACTA","04","03","02","04","0403","000002320 - MOSOCLLACTA"]
[null,null,null,null,null,null,null,null,null,null,null,null,null,302,"000034929","CHECACUPE","04","03","06","02","0403","000034929 - CHECACUPE"]
[null,null,null,null,null,null,null,null,null,null,null,null,null,303,"000002386","COMBAPATA CANCHIS","04","03","06","03","0403","000002386 - COMBAPATA CANCHIS"]
[null,null,null,null,null,null,null,null,null,null,null,null,null,304,"000034448","CHIARA","04","03","06","03","0403","000034448 - CHIARA"]
[null,null,null,null,null,null,null,null,null,null,null,null,null,305,"000034887","PITUMARCA","04","03","06","05","0403","000034887 - PITUMARCA"]
[null,null,null,null,null,null,null,null,null,null,null,null,null,306,"000002397","TINTA","04","03","06","08","0403","000002397 - TINTA"]
[null,null,null,null,null,null,null,null,null,null,null,null,null,307,"000000000","(All)","04","04",null,null,"0404","000000000 - (All)"]
[null,null,null,null,null,null,null,null,null,null,null,null,null,308,"000002379","HERCCA","04","04","06","01","0404","000002379 - HERCCA"]
[null,null,null,null,null,null,null,null,null,null,null,null,null,{"$f":"+N332+1","v":309},"000002380","TECHO OBRERO","04","04","06","01","0404","000002380 - TECHO OBRERO"]
[null,null,null,null,null,null,null,null,null,null,null,null,null,310,"000010063","ESSALUD SICUANI","04","04","06","01","0404","000010063 - ESSALUD SICUANI"]
[null,null,null,null,null,null,null,null,null,null,null,null,null,311,"000024639","INPE SICUANI","04","04","06","01","0404","000024639 - INPE SICUANI"]
[null,null,null,null,null,null,null,null,null,null,null,null,null,312,"000024663","SANIDAD PNP  SICUANI","04","04","06","01","0404","000024663 - SANIDAD PNP  SICUANI"]
[null,null,null,null,null,null,null,null,null,null,null,null,null,313,"000002388","MARANGANI","04","04","06","04","0404","000002388 - MARANGANI"]
[null,null,null,null,null,null,null,null,null,null,null,null,null,314,"000002389","CHECTUYOC","04","04","06","04","0404","000002389 - CHECTUYOC"]
[null,null,null,null,null,null,null,null,null,null,null,null,null,315,"000002390","CCUYO","04","04","06","04","0404","000002390 - CCUYO"]
[null,null,null,null,null,null,null,null,null,null,null,null,null,316,"000002391","OCCOBAMBA MARANGANI","04","04","06","04","0404","000002391 - OCCOBAMBA MARANGANI"]
[null,null,null,null,null,null,null,null,null,null,null,null,null,317,"000000000","(All)","04","05",null,null,"0405","000000000 - (All)"]
[null,null,null,null,null,null,null,null,null,null,null,null,null,318,"000002381","QUEHUAR","04","05","06","01","0405","000002381 - QUEHUAR"]
[null,null,null,null,null,null,null,null,null,null,null,null,null,319,"000002382","UZCUPATA","04","05","06","01","0405","000002382 - UZCUPATA"]
[null,null,null,null,null,null,null,null,null,null,null,null,null,320,"000002383","LA FLORIDA","04","05","06","01","0405","000002383 - LA FLORIDA"]
[null,null,null,null,null,null,null,null,null,null,null,null,null,321,"000026387","MENTAL COMUNITARIO SICUANI","04","05","06","01","0405","000026387 - MENTAL COMUNITARIO SICUANI"]
[null,null,null,null,null,null,null,null,null,null,null,null,null,322,"000032923","SR DE PAMPACUCHO-SICUANI","04","05","06","01","0405","000032923 - SR DE PAMPACUCHO-SICUANI"]
[null,null,null,null,null,null,null,null,null,null,null,null,null,323,"000035845","PAMPAPHALLA","04","05","06","01","0405","000035845 - PAMPAPHALLA"]
[null,null,null,null,null,null,null,null,null,null,null,null,null,324,"000035848","MENTAL COMUNITARIO SICUANI","04","05","06","01",{"$f":"CONCATENATE(Q348,R348)","v":"0405"},{"$f":"CONCATENATE(O348,\" - \",P348)","v":"000035848 - MENTAL COMUNITARIO SICUANI"}]
[null,null,null,null,null,null,null,null,null,null,null,null,null,325,"000002393","PHINAYA","04","05","06","05","0405","000002393 - PHINAYA"]
[null,null,null,null,null,null,null,null,null,null,null,null,null,326,"000002394","SAN PABLO CANCHIS","04","05","06","06","0405","000002394 - SAN PABLO CANCHIS"]
[null,null,null,null,null,null,null,null,null,null,null,null,null,327,"000002395","SANTA BARBARA","04","05","06","06","0405","000002395 - SANTA BARBARA"]
[null,null,null,null,null,null,null,null,null,null,null,null,null,328,"000002396","SAN PEDRO CANCHIS","04","05","06","07","0405","000002396 - SAN PEDRO CANCHIS"]
[null,null,null,null,null,null,null,null,null,null,null,null,null,329,"000000000","(All)","04","06",null,null,"0406","000000000 - (All)"]
[null,null,null,null,null,null,null,null,null,null,null,null,null,330,"000002410","YAURI","04","06","08","01","0406","000002410 - YAURI"]
[null,null,null,null,null,null,null,null,null,null,null,null,null,331,"000006745","TINTAYA MARQUIRI","04","06","08","01","0406","000006745 - TINTAYA MARQUIRI"]
[null,null,null,null,null,null,null,null,null,null,null,null,null,332,"000010061","ESPINAR - ESSALUD","04","06","08","01","0406","000010061 - ESPINAR - ESSALUD"]
[null,null,null,null,null,null,null,null,null,null,null,null,null,333,"000030366","MENTAL COMUNITARIO ESPINAR \"MUSUQ KAWSAY\"","04","06","08","01","0406","000030366 - MENTAL COMUNITARIO ESPINAR \"MUSUQ KAWSAY\""]
[null,null,null,null,null,null,null,null,null,null,null,null,null,334,"000002411","CONDOROMA","04","06","08","02","0406","000002411 - CONDOROMA"]
[null,null,null,null,null,null,null,null,null,null,null,null,null,335,"000002412","COPORAQUE","04","06","08","03","0406","000002412 - COPORAQUE"]
[null,null,null,null,null,null,null,null,null,null,null,null,null,336,"000002413","URINSAYA","04","06","08","03","0406","000002413 - URINSAYA"]
[null,null,null,null,null,null,null,null,null,null,null,null,null,337,"000002414","HUAYHUAHUASI","04","06","08","03","0406","000002414 - HUAYHUAHUASI"]
[null,null,null,null,null,null,null,null,null,null,null,null,null,338,"000002415","OCCORURO","04","06","08","04","0406","000002415 - OCCORURO"]
[null,null,null,null,null,null,null,null,null,null,null,null,null,339,"000002416","PALLPATA","04","06","08","05","0406","000002416 - PALLPATA"]
[null,null,null,null,null,null,null,null,null,null,null,null,null,340,"000002418","SAN MIGUEL","04","06","08","06","0406","000002418 - SAN MIGUEL"]
[null,null,null,null,null,null,null,null,null,null,null,null,null,341,"000034450","PICHIGUA ESPINAR","04","06","08","06","0406","000034450 - PICHIGUA ESPINAR"]
[null,null,null,null,null,null,null,null,null,null,null,null,null,342,"000002419","SUYKUTAMBO","04","06","08","07","0406","000002419 - SUYKUTAMBO"]
[null,null,null,null,null,null,null,null,null,null,null,null,null,343,"000002420","ACCOCUNCA","04","06","08","08","0406","000002420 - ACCOCUNCA"]
[null,null,null,null,null,null,null,null,null,null,null,null,null,344,"999999999","(All)","04","99",null,null,"0499","999999999 - (All)"]
[null,null,null,null,null,null,null,null,null,null,null,null,null,345,"000002469","SAN JUAN DE KIMBIRI-VRAEM","05","00","09","07","0500","000002469 - SAN JUAN DE KIMBIRI-VRAEM"]
[null,null,null,null,null,null,null,null,null,null,null,null,null,346,"000000000","(All)","05","01",null,null,"0501","000000000 - (All)"]
[null,null,null,null,null,null,null,null,null,null,null,null,null,347,"000002472","MAPITUNARI","05","01","09","07","0501","000002472 - MAPITUNARI"]
[null,null,null,null,null,null,null,null,null,null,null,null,null,348,"000002474","SAMANIATO","05","01","09","07","0501","000002474 - SAMANIATO"]
[null,null,null,null,null,null,null,null,null,null,null,null,null,349,"000002475","KIMBIRI ALTO","05","01","09","07","0501","000002475 - KIMBIRI ALTO"]
[null,null,null,null,null,null,null,null,null,null,null,null,null,350,"000008285","ANGELES","05","01","09","07","0501","000008285 - ANGELES"]
[null,null,null,null,null,null,null,null,null,null,null,null,null,351,"000002479","VILLA VIRGEN","05","01","09","12","0501","000002479 - VILLA VIRGEN"]
[null,null,null,null,null,null,null,null,null,null,null,null,null,352,"000024957","BTC LA OROYA  N°34 VILLA VIRGEN","05","01","09","12","0501","000024957 - BTC LA OROYA  N°34 VILLA VIRGEN"]
[null,null,null,null,null,null,null,null,null,null,null,null,null,353,"000002488","VILLA KINTIARINA","05","01","09","13","0501","000002488 - VILLA KINTIARINA"]
[null,null,null,null,null,null,null,null,null,null,null,null,null,354,"000008283","PUEBLO LIBRE","05","01","09","13","0501","000008283 - PUEBLO LIBRE"]
[null,null,null,null,null,null,null,null,null,null,null,null,null,355,"000002470","CHIRUMPIARI","05","01","09","16","0501","000002470 - CHIRUMPIARI"]
[null,null,null,null,null,null,null,null,null,null,null,null,null,356,"000002471","LOBO TAHUANTINSUYO","05","01","09","17","0501","000002471 - LOBO TAHUANTINSUYO"]
[null,null,null,null,null,null,null,null,null,null,null,null,null,357,"000002473","UNION ROSALES","05","01","09","17","0501","000002473 - UNION ROSALES"]
[null,null,null,null,null,null,null,null,null,null,null,null,null,358,"000008284","MANITEA ALTA","05","01","09","17","0501","000008284 - MANITEA ALTA"]
[null,null,null,null,null,null,null,null,null,null,null,null,null,359,"000000000","(All)","05","02",null,null,"0502","000000000 - (All)"]
[null,null,null,null,null,null,null,null,null,null,null,null,null,360,"000002496","OMAYA","05","02","09","10","0502","000002496 - OMAYA"]
[null,null,null,null,null,null,null,null,null,null,null,null,null,361,"000002497","OTARI","05","02","09","10","0502","000002497 - OTARI"]
[null,null,null,null,null,null,null,null,null,null,null,null,null,362,"000002498","PUERTO MAYO","05","02","09","10","0502","000002498 - PUERTO MAYO"]
[null,null,null,null,null,null,null,null,null,null,null,null,null,363,"000007113","NATIVIDAD","05","02","09","10","0502","000007113 - NATIVIDAD"]
[null,null,null,null,null,null,null,null,null,null,null,null,null,364,"000007114","QUISTO CENTRAL","05","02","09","10","0502","000007114 - QUISTO CENTRAL"]
[null,null,null,null,null,null,null,null,null,null,null,null,null,365,"000015104","TAMBO DEL ENE","05","02","09","10","0502","000015104 - TAMBO DEL ENE"]
[null,null,null,null,null,null,null,null,null,null,null,null,null,366,"000015170","PICHARI BAJA","05","02","09","10","0502","000015170 - PICHARI BAJA"]
[null,null,null,null,null,null,null,null,null,null,null,null,null,367,"000024638","MILITAR PICHARI","05","02","09","10","0502","000024638 - MILITAR PICHARI"]
[null,null,null,null,null,null,null,null,null,null,null,null,null,368,"000027230","MEDICA POLICIAL PICHARI","05","02","09","10","0502","000027230 - MEDICA POLICIAL PICHARI"]
[null,null,null,null,null,null,null,null,null,null,null,null,null,369,"000027948","ESSALUD PICHARI","05","02","09","10","0502","000027948 - ESSALUD PICHARI"]
[null,null,null,null,null,null,null,null,null,null,null,null,null,370,"000032211","NUEVO PROGRESO","05","02","09","10","0502","000032211 - NUEVO PROGRESO"]
[null,null,null,null,null,null,null,null,null,null,null,null,null,371,"000033988","MENTAL COMUNITARIO PICHARI","05","02","09","10","0502","000033988 - MENTAL COMUNITARIO PICHARI"]
[null,null,null,null,null,null,null,null,null,null,null,null,null,372,"000034418","PICHARI VRAEM","05","02","09","10","0502","000034418 - PICHARI VRAEM"]
[null,null,null,null,null,null,null,null,null,null,null,null,null,{"$f":"+N396+1","v":373},"000024637","EJERCITO-INCAHUASI 331","05","02","09","10","0502","000024637 - EJERCITO-INCAHUASI 331"]
[null,null,null,null,null,null,null,null,null,null,null,null,null,374,"000034417","CAP I ECHARATE - KITENI","05","02","09","10","0502","000034417 - CAP I ECHARATE - KITENI"]
[null,null,null,null,null,null,null,null,null,null,null,null,null,375,"000002495","MANTARO","05","02","09","18","0502","000002495 - MANTARO"]
[null,null,null,null,null,null,null,null,null,null,null,null,null,376,"000015169","PITIRINQUINI","05","02","09","18","0502","000015169 - PITIRINQUINI"]
[null,null,null,null,null,null,null,null,null,null,null,null,null,377,"999999999","(All)","05","99",null,null,"0599","999999999 - (All)"]
[null,null,null,null,null,null,null,null,null,null,null,null,null,378,"000002398","SANTO TOMAS","06","00","07","01","0600","000002398 - SANTO TOMAS"]
[null,null,null,null,null,null,null,null,null,null,null,null,null,379,"000000000","(All)","06","01",null,null,"0601","000000000 - (All)"]
[null,null,null,null,null,null,null,null,null,null,null,null,null,380,"000035864","CANGALLE","06","01","07","01","0601","000035864 - CANGALLE"]
[null,null,null,null,null,null,null,null,null,null,null,null,null,381,"000002402","CHAMACA","06","01","07","03","0601","000002402 - CHAMACA"]
[null,null,null,null,null,null,null,null,null,null,null,null,null,382,"000002403","AÑAHUICHI","06","01","07","03","0601","000002403 - AÑAHUICHI"]
[null,null,null,null,null,null,null,null,null,null,null,null,null,383,"000016328","UCCHUCCARCCO","06","01","07","03","0601","000016328 - UCCHUCCARCCO"]
[null,null,null,null,null,null,null,null,null,null,null,null,null,384,"000016329","INGATA","06","01","07","03","0601","000016329 - INGATA"]
[null,null,null,null,null,null,null,null,null,null,null,null,null,385,"000016330","CCONCHACCOLLO","06","01","07","03","0601","000016330 - CCONCHACCOLLO"]
[null,null,null,null,null,null,null,null,null,null,null,null,null,386,"000035861","CCACHO","06","01","07","03","0601","000035861 - CCACHO"]
[null,null,null,null,null,null,null,null,null,null,null,null,null,387,"000035863","TINCURCA","06","01","07","03","0601","000035863 - TINCURCA"]
[null,null,null,null,null,null,null,null,null,null,null,null,null,388,"000002406","LIVITACA","06","01","07","05","0601","000002406 - LIVITACA"]
[null,null,null,null,null,null,null,null,null,null,null,null,null,389,"000016325","CHILLOROYA - LIVITACA","06","01","07","05","0601","000016325 - CHILLOROYA - LIVITACA"]
[null,null,null,null,null,null,null,null,null,null,null,null,null,390,"000016327","AUSANTA","06","01","07","05","0601","000016327 - AUSANTA"]
[null,null,null,null,null,null,null,null,null,null,null,null,null,391,"000016332","PATAQUEÑA - LIVITACA","06","01","07","05","0601","000016332 - PATAQUEÑA - LIVITACA"]
[null,null,null,null,null,null,null,null,null,null,null,null,null,392,"000016334","KISIO","06","01","07","05","0601","000016334 - KISIO"]
[null,null,null,null,null,null,null,null,null,null,null,null,null,393,"000025739","PISQUICOCHA","06","01","07","05","0601","000025739 - PISQUICOCHA"]
[null,null,null,null,null,null,null,null,null,null,null,null,null,394,"000025740","TOTORA - REYNA DE LOS ANGELES","06","01","07","05","0601","000025740 - TOTORA - REYNA DE LOS ANGELES"]
[null,null,null,null,null,null,null,null,null,null,null,null,null,395,"000035860","KAYNO","06","01","07","05",{"$f":"CONCATENATE(Q419,R419)","v":"0601"},{"$f":"CONCATENATE(O419,\" - \",P419)","v":"000035860 - KAYNO"}]
[null,null,null,null,null,null,null,null,null,null,null,null,null,396,"000035862","SANTA ISABEL JALCCO","06","01","07","05","0601","000035862 - SANTA ISABEL JALCCO"]
[null,null,null,null,null,null,null,null,null,null,null,null,null,397,"000000000","(All)","06","09",null,null,"0609","000000000 - (All)"]
[null,null,null,null,null,null,null,null,null,null,null,null,null,398,"000002399","PULPERA","06","09","07","01","0609","000002399 - PULPERA"]
[null,null,null,null,null,null,null,null,null,null,null,null,null,399,"000002400","ALHUACCHULLO","06","09","07","01","0609","000002400 - ALHUACCHULLO"]
[null,null,null,null,null,null,null,null,null,null,null,null,null,400,"000006746","LLIQUE","06","09","07","01","0609","000006746 - LLIQUE"]
[null,null,null,null,null,null,null,null,null,null,null,null,null,401,"000006981","CCOYO","06","09","07","01","0609","000006981 - CCOYO"]
[null,null,null,null,null,null,null,null,null,null,null,null,null,402,"000006982","MELLOTOTORA","06","09","07","01","0609","000006982 - MELLOTOTORA"]
[null,null,null,null,null,null,null,null,null,null,null,null,null,403,"000006983","ORCCOMA","06","09","07","01","0609","000006983 - ORCCOMA"]
[null,null,null,null,null,null,null,null,null,null,null,null,null,404,"000007111","YAVINA","06","09","07","01","0609","000007111 - YAVINA"]
[null,null,null,null,null,null,null,null,null,null,null,null,null,405,"000008915","PFULLPURI CONDEPAMPA","06","09","07","01","0609","000008915 - PFULLPURI CONDEPAMPA"]
[null,null,null,null,null,null,null,null,null,null,null,null,null,406,"000013185","CAP I SANTO TOMÁS  ESSALUD","06","09","07","01","0609","000013185 - CAP I SANTO TOMÁS  ESSALUD"]
[null,null,null,null,null,null,null,null,null,null,null,null,null,407,"000030940","ARCANGEL SAN MIGUEL DE ESQUINA CONGUNYA","06","09","07","01","0609","000030940 - ARCANGEL SAN MIGUEL DE ESQUINA CONGUNYA"]
[null,null,null,null,null,null,null,null,null,null,null,null,null,408,"000002401","CCAPACMARCA","06","09","07","02","0609","000002401 - CCAPACMARCA"]
[null,null,null,null,null,null,null,null,null,null,null,null,null,409,"000009963","CANCAHUANI","06","09","07","02","0609","000009963 - CANCAHUANI"]
[null,null,null,null,null,null,null,null,null,null,null,null,null,410,"000027009","TAHUAY","06","09","07","02","0609","000027009 - TAHUAY"]
[null,null,null,null,null,null,null,null,null,null,null,null,null,411,"000002404","COLQUEMARCA","06","09","07","04","0609","000002404 - COLQUEMARCA"]
[null,null,null,null,null,null,null,null,null,null,null,null,null,412,"000002405","CHARAMURAY","06","09","07","04","0609","000002405 - CHARAMURAY"]
[null,null,null,null,null,null,null,null,null,null,null,null,null,413,"000008913","HUARACO","06","09","07","04","0609","000008913 - HUARACO"]
[null,null,null,null,null,null,null,null,null,null,null,null,null,414,"000008914","HUAYLLANI","06","09","07","04","0609","000008914 - HUAYLLANI"]
[null,null,null,null,null,null,null,null,null,null,null,null,null,415,"000012932","YANQUE","06","09","07","04","0609","000012932 - YANQUE"]
[null,null,null,null,null,null,null,null,null,null,null,null,null,416,"000002407","LLUSCO","06","09","07","06","0609","000002407 - LLUSCO"]
[null,null,null,null,null,null,null,null,null,null,null,null,null,417,"000006747","LUTTO","06","09","07","06","0609","000006747 - LUTTO"]
[null,null,null,null,null,null,null,null,null,null,null,null,null,418,"000006748","COLLPA","06","09","07","06","0609","000006748 - COLLPA"]
[null,null,null,null,null,null,null,null,null,null,null,null,null,419,"000006985","TOTORAPALLCA","06","09","07","06","0609","000006985 - TOTORAPALLCA"]
[null,null,null,null,null,null,null,null,null,null,null,null,null,420,"000027008","ANTUYO","06","09","07","06","0609","000027008 - ANTUYO"]
[null,null,null,null,null,null,null,null,null,null,null,null,null,421,"000002408","QUIÑOTA","06","09","07","07","0609","000002408 - QUIÑOTA"]
[null,null,null,null,null,null,null,null,null,null,null,null,null,422,"000006984","CCOLLANA","06","09","07","07","0609","000006984 - CCOLLANA"]
[null,null,null,null,null,null,null,null,null,null,null,null,null,423,"000007112","YORENCCA","06","09","07","07","0609","000007112 - YORENCCA"]
[null,null,null,null,null,null,null,null,null,null,null,null,null,424,"000025369","PUMALLACTA","06","09","07","07","0609","000025369 - PUMALLACTA"]
[null,null,null,null,null,null,null,null,null,null,null,null,null,425,"000002409","VELILLE","06","09","07","08","0609","000002409 - VELILLE"]
[null,null,null,null,null,null,null,null,null,null,null,null,null,426,"000008912","ALCCA VICTORIA","06","09","07","08","0609","000008912 - ALCCA VICTORIA"]
[null,null,null,null,null,null,null,null,null,null,null,null,null,427,"000025371","TUNTUMA","06","09","07","08","0609","000025371 - TUNTUMA"]
[null,null,null,null,null,null,null,null,null,null,null,null,null,428,"000027011","AYACCASI","06","09","07","08","0609","000027011 - AYACCASI"]
[null,null,null,null,null,null,null,null,null,null,null,null,null,429,"000027016","HUAYCUÑUTA - URCURUTA","06","09","07","08","0609","000027016 - HUAYCUÑUTA - URCURUTA"]
[null,null,null,null,null,null,null,null,null,null,null,null,null,430,"000000000","(All)","06","99",null,null,"0699","000000000 - (All)"]
[null,null,null,null,null,null,null,null,null,null,null,null,null,null,"999999999","(All)","99","99",null,null,{"$f":"CONCATENATE(Q455,R455)","v":"9999"},{"$f":"CONCATENATE(O455,\" - \",P455)","v":"999999999 - (All)"}]

{"sheet":"INFORME","index":3,"n_rows":174,"n_cols":99,"rows_kept":174,"cut":false,"hidden":false,"merged":[[45,14,45,16],[41,4,41,7],[42,4,42,7],[43,4,43,7],[44,4,44,7],[45,4,45,7],[46,4,46,7],[40,10,40,11],[41,10,41,11],[42,10,42,11],[43,10,43,11],[44,10,44,11],[45,10,45,11],[40,4,40,7],[135,0,136,1],[137,0,137,1],[77,0,77,1],[78,0,78,1],[79,0,79,1],[80,0,80,1],[102,0,105,1],[108,0,108,1],[129,0,129,2],[130,0,130,2],[131,0,131,2],[109,0,109,1],[110,0,110,1],[76,0,76,1],[52,0,52,1],[53,0,53,1],[54,0,54,1],[55,0,55,1],[56,0,56,1],[61,0,63,1],[111,0,111,1],[112,0,112,1],[64,0,64,1],[65,0,65,1],[66,0,66,1],[44,0,44,1],[45,0,45,1],[46,0,46,1],[49,0,49,1],[50,0,50,1],[51,0,51,1],[32,0,32,1],[33,0,33,1],[40,0,40,1],[41,0,41,1],[42,0,42,1],[43,0,43,1],[26,0,26,1],[27,0,27,1],[28,0,28,1],[29,0,29,1],[30,0,30,1],[31,0,31,1],[16,2,16,3],[17,2,17,3],[21,0,22,1],[23,0,23,1],[24,0,24,1],[25,0,25,1],[11,6,11,9],[12,2,12,3],[13,2,13,3],[13,6,13,7],[14,2,14,3],[15,2,15,3],[92,0,92,3],[93,0,93,3],[7,2,7,3],[7,6,7,7],[8,2,8,3],[9,2,9,3],[9,6,9,9],[10,2,10,3],[11,2,11,3],[86,0,86,3],[87,0,87,3],[88,0,88,3],[89,0,89,3],[90,0,90,3],[91,0,91,3],[61,2,62,4],[61,5,61,19],[62,5,62,11],[74,8,74,9],[46,10,46,11],[74,3,75,3],[74,4,75,4],[74,5,75,5],[74,6,75,6],[74,7,75,7],[48,10,48,11],[67,0,67,1],[68,0,68,1],[69,0,69,1],[70,0,70,1],[74,0,75,1],[47,10,47,11],[49,4,49,7],[50,4,50,7],[51,4,51,7],[52,4,52,7],[53,4,53,7],[54,4,54,7],[55,4,55,7],[139,0,140,0],[139,2,140,3],[135,2,135,3],[135,4,135,5],[135,6,135,7],[84,0,84,3],[94,0,94,3],[115,0,115,5],[100,0,100,5],[85,0,85,3],[117,6,117,9],[123,0,123,20],[124,0,125,2],[124,3,124,5],[124,6,124,8],[124,9,124,11],[124,12,124,14],[124,15,124,17],[124,18,125,18],[135,8,135,9],[135,10,135,11],[126,0,126,2],[127,0,127,2],[128,0,128,2],[146,4,146,7],[147,4,147,7],[148,4,148,7],[149,4,149,7],[150,4,150,7],[143,4,143,7],[139,15,140,15],[141,4,141,7],[141,10,141,13],[142,4,142,7],[142,10,142,13],[139,4,140,7],[139,8,140,9],[139,10,140,13],[143,10,143,13],[144,4,144,7],[144,10,144,13],[145,4,145,7],[145,10,145,13],[139,14,140,14],[20,22,21,24],[102,6,103,7],[102,8,103,9],[102,10,103,11],[102,12,102,15],[102,2,102,5],[103,2,103,3],[103,4,103,5],[104,15,105,15],[103,12,103,13],[103,14,103,15],[104,12,105,12],[104,13,105,13],[104,14,105,14],[62,12,62,19],[74,2,75,2],[46,14,46,16],[47,14,47,16],[48,14,48,16],[40,14,40,16],[41,14,41,16],[42,14,42,16],[43,14,43,16],[44,14,44,16],[20,31,21,32],[21,2,22,2],[21,3,22,3],[21,4,22,4],[21,5,22,5],[21,6,22,6],[21,7,22,7],[0,0,0,32],[1,0,1,32],[3,0,3,32],[4,0,4,27],[20,25,21,27],[20,28,21,30],[21,10,22,10],[21,11,22,11],[21,12,22,12],[21,13,22,13],[21,14,22,14],[21,15,22,15],[21,8,22,8],[21,9,22,9],[20,0,20,15],[20,16,21,18],[20,19,21,21],[164,0,164,2],[167,0,167,2],[168,0,168,2],[169,0,169,2],[170,0,170,2],[171,0,171,2],[172,0,172,2],[155,0,155,2],[156,0,156,2],[157,0,157,2],[158,0,158,2],[159,0,159,2],[160,0,160,2],[161,0,161,2],[162,0,162,2],[163,0,163,2]]}
["GERENCIA REGIONAL DE SALUD CUSCO"]
["DIRECCION DE ESTADISTICA E INFORMATICA Y TELECOMUNICACION"]
[]
["INFORME  MENSUAL  DEL CUIDADO INTEGRAL DEL NIÑO(A)"]
[]
[]
[]
[null,"DIRESA","CUSCO"]
[]
[null,"RED DE SALUD ",{"$f":"+TABLAS!O9","v":""},null,null,"EJECUTORA",{"$f":"+TABLAS!O14","v":""},null,null,null,null,"AÑO",{"$f":"+TABLAS!J16","v":"2025"}]
[]
[null,"MICRO RED",{"$f":"+TABLAS!O10","v":""},null,null,null,null,null,null,null,null,"MES",{"$f":"+TABLAS!N26","v":"ENE - MAY"}]
[]
[null,"EE.SS.",{"$f":"+TABLAS!O11","v":""},null,null,null,null,null,null,null,null,null,null,null,null,null,null,null,null,null,null,null,null,null,null,null,null,null,null,null,null,null,null,null,null,null,null,null,null,null,null,null,null,null,null,null,null,null,null,null,null,null,null,null,null,null,null,null,null,null,null,null,null,null,null,null,null,null,null,"=+IMPORTARDATOSDINAMICOS(\" BAS"]
[]
[null,"PROVINCIA",{"$f":"+TABLAS!O12","v":""},null,null,null,null,null,null,null,null,null,null,null,null,null,null,null,null,null,null,null,null,null,null,null,null,null,null,null,null,null,null,null,null,null,null,null,null,null,null,null,null,null,null,null,null,null,null,null,null,null,null,null,null,null,null,null,null,null,null,null,null,null,null,null,null,null,null,"\"|TABLAS!$A$59)"]
[]
[null,"DISTRITO",{"$f":"+TABLAS!O13","v":""},null,null,null,null,null,null,null,null,null,null,null,null,null,null,null,null,null,null,null,null,null,null,null,null,null,null,null,null,null,null,null,null,null,null,null,null,null,null,null,null,null,null,null,null,null,null,null,null,null,null,null,null,null,null,null,null,null,null,null,null,null,null,null,null,null,null,{"$f":"+GETPIVOTDATA(\" BAS001\",TABLAS!$A$59)","v":482}]
[]
[null,null,null,{"$f":"+C20+1","v":1},2,3,4,5,6,7,8,9,10,11,12,13,14,null,null,{"$f":"+Q20+1","v":15},null,null,{"$f":"+T20+1","v":16},null,null,{"$f":"+W20+1","v":17},null,null,{"$f":"+Z20+1","v":18},null,null,{"$f":"+AC20+1","v":19},{"$f":"+AF20+1","v":20}]
["Nro de  Controles de  Crecimiento y Desarrollo  de 0 a 11 años  ",null,null,null,null,null,null,null,null,null,null,null,null,null,null,null," Niños  con Desarrollo\nNormal",null,null,"Niños con Crecimiento\nAdecuado o Normal ",null,null,"Niños con Lactancia materna exclusiva ",null,null,"Niños con Lactancia materna prolongada   ",null,null,"Niños con  Alimentacion complementaria ",null,null," Plan  de Atencion Integral  de Salud (*)  (Z01.9)",null,null,null,null,null,null,null,null,null,null,null,null,null,null,null,null,null,null,null,null,null,null,null,null,null,null,null,null,null,null,null,null,null,null,null,null,null,{"$f":"+BQ21+1","v":1},2,3,4,5,6,7,8,9,10,11,12,13,14,null,null,{"$f":"+CE21+1","v":15},null,null,{"$f":"+CH21+1","v":16},null,null,{"$f":"+CK21+1","v":17},null,null,{"$f":"+CN21+1","v":18},null,null,{"$f":"+CQ21+1","v":19},{"$f":"+CT21+1","v":20}]
["GRUPO  \nETAREO ",null,"PROGRAMACION","Atencion  Inmediata de  recien Nacido ","Recien Nacido de parto Domiciliario /Trayecto ","1er \n Ctrol ","2do  \nCtrol","3er \nCtrol","4to  \nCtrol","5to \nCtrol","6to  \nCtrol","7mo \nCtrol","8vo \nCtrol","9no \nCtrol","10mo \nCtrol","11vo Ctrol",null,null,null,null,null,null,null,null,null,null,null,null,null,null,null,null,null,null,null,null,1,{"$f":"+AK22+1","v":2},3,4,5,6,7,8,9,10,11,12,13,14,null,null,{"$f":"+AX22+1","v":15},null,null,{"$f":"+BA22+1","v":16},null,null,{"$f":"+BD22+1","v":17},null,null,{"$f":"+BG22+1","v":18},null,null,{"$f":"+BJ22+1","v":19},{"$f":"+BM22+1","v":20}]
[null,null,null,null,null,null,null,null,null,null,null,null,null,null,null,null,"Mens","Acum","%","Mens","Acum","%","Mens","Acum","%","Mens","Acum","%","Mens","Acum","%","ATD (Inicio del Plan  AIS)","Niños controlados con plan de  AIS completo"]
["Recien  Nacido Sano ",null,null,{"$f":"+GETPIVOTDATA(\" BAS001\",TABLAS!$A$59)","v":482},{"$f":"+GETPIVOTDATA(\" BAS002\",TABLAS!$A$59)","v":0},{"$f":"+GETPIVOTDATA(\" BAS003\",TABLAS!$A$59)","v":545},{"$f":"+GETPIVOTDATA(\" BAS004\",TABLAS!$A$59)","v":553},{"$f":"+GETPIVOTDATA(\" BAS005\",TABLAS!$A$59)","v":551},{"$f":"+GETPIVOTDATA(\" BAS006\",TABLAS!$A$59)","v":550},{"$f":"+GETPIVOTDATA(\" BAS007\",TABLAS!$A$59)","v":1},{"$f":"+GETPIVOTDATA(\" BAS008\",TABLAS!$A$59)","v":0},{"$f":"+GETPIVOTDATA(\" BAS009\",TABLAS!$A$59)","v":0},{"$f":"+GETPIVOTDATA(\" BAS010\",TABLAS!$A$59)","v":0},{"$f":"+GETPIVOTDATA(\" BAS011\",TABLAS!$A$59)","v":0},{"$f":"+GETPIVOTDATA(\" BAS012\",TABLAS!$A$59)","v":0},{"$f":"+GETPIVOTDATA(\" BAS013\",TABLAS!$A$59)","v":0},{"$f":"+GETPIVOTDATA(\" BAS014\",TABLAS!$A$59)","v":164},null,null,{"$f":"+GETPIVOTDATA(\" BAS015\",TABLAS!$A$59)","v":163},null,null,{"$f":"+GETPIVOTDATA(\" BAS016\",TABLAS!$A$59)","v":0},null,null,{"$f":"+GETPIVOTDATA(\" BAS017\",TABLAS!$A$59)","v":0},null,null,{"$f":"+GETPIVOTDATA(\" BAS018\",TABLAS!$A$59)","v":0},null,null,{"$f":"+GETPIVOTDATA(\" BAS019\",TABLAS!$A$59)","v":0},{"$f":"+GETPIVOTDATA(\" BAS020\",TABLAS!$A$59)","v":0},null,null,null,1,{"$f":"+AK24+1","v":2},3,4,5,6,7,8,9,10,11,12,13,14,null,null,{"$f":"+AX24+1","v":15},null,null,{"$f":"+BA24+1","v":16},null,null,{"$f":"+BD24+1","v":17},null,null,{"$f":"+BG24+1","v":18},null,null,{"$f":"+BJ24+1","v":19},{"$f":"+BM24+1","v":20},null,null,null,{"$f":"IF(AK24<10,CONCATENATE($BR$14,\"00\",AK24,$BR$16),IF(AND(AK24>9,AK24<100),CONCATENATE($BR$14,\"0\",AK24,$BR$16),IF(AK24>99,CONCATENATE($BR$14,AK24,$BR$16))))","v":"=+IMPORTARDATOSDINAMICOS(\" BAS001\"|TABLAS!$A$59)"},{"$f":"IF(AL24<10,CONCATENATE($BR$14,\"00\",AL24,$BR$16),IF(AND(AL24>9,AL24<100),CONCATENATE($BR$14,\"0\",AL24,$BR$16),IF(AL24>99,CONCATENATE($BR$14,AL24,$BR$16))))","v":"=+IMPORTARDATOSDINAMICOS(\" BAS002\"|TABLAS!$A$59)"},"=+IMPORTARDATOSDINAMICOS(\" BAS003\"|TABLAS!$A$59)","=+IMPORTARDATOSDINAMICOS(\" BAS004\"|TABLAS!$A$59)","=+IMPORTARDATOSDINAMICOS(\" BAS005\"|TABLAS!$A$59)","=+IMPORTARDATOSDINAMICOS(\" BAS006\"|TABLAS!$A$59)","=+IMPORTARDATOSDINAMICOS(\" BAS007\"|TABLAS!$A$59)","=+IMPORTARDATOSDINAMICOS(\" BAS008\"|TABLAS!$A$59)","=+IMPORTARDATOSDINAMICOS(\" BAS009\"|TABLAS!$A$59)","=+IMPORTARDATOSDINAMICOS(\" BAS010\"|TABLAS!$A$59)","=+IMPORTARDATOSDINAMICOS(\" BAS011\"|TABLAS!$A$59)","=+IMPORTARDATOSDINAMICOS(\" BAS012\"|TABLAS!$A$59)","=+IMPORTARDATOSDINAMICOS(\" BAS013\"|TABLAS!$A$59)","=+IMPORTARDATOSDINAMICOS(\" BAS014\"|TABLAS!$A$59)",null,null,"=+IMPORTARDATOSDINAMICOS(\" BAS015\"|TABLAS!$A$59)",null,null,"=+IMPORTARDATOSDINAMICOS(\" BAS016\"|TABLAS!$A$59)",null,null,"=+IMPORTARDATOSDINAMICOS(\" BAS017\"|TABLAS!$A$59)",null,null,"=+IMPORTARDATOSDINAMICOS(\" BAS018\"|TABLAS!$A$59)",null,null,"=+IMPORTARDATOSDINAMICOS(\" BAS019\"|TABLAS!$A$59)","=+IMPORTARDATOSDINAMICOS(\" BAS020\"|TABLAS!$A$59)"]
["RN  Bajo Peso ",null,null,{"$f":"+GETPIVOTDATA(\" BAS021\",TABLAS!$A$59)","v":7},{"$f":"+GETPIVOTDATA(\" BAS022\",TABLAS!$A$59)","v":0},{"$f":"+GETPIVOTDATA(\" BAS023\",TABLAS!$A$59)","v":15},{"$f":"+GETPIVOTDATA(\" BAS024\",TABLAS!$A$59)","v":14},{"$f":"+GETPIVOTDATA(\" BAS025\",TABLAS!$A$59)","v":11},{"$f":"+GETPIVOTDATA(\" BAS026\",TABLAS!$A$59)","v":8},{"$f":"+GETPIVOTDATA(\" BAS027\",TABLAS!$A$59)","v":0},{"$f":"+GETPIVOTDATA(\" BAS028\",TABLAS!$A$59)","v":0},{"$f":"+GETPIVOTDATA(\" BAS029\",TABLAS!$A$59)","v":0},{"$f":"+GETPIVOTDATA(\" BAS030\",TABLAS!$A$59)","v":0},{"$f":"+GETPIVOTDATA(\" BAS031\",TABLAS!$A$59)","v":0},{"$f":"+GETPIVOTDATA(\" BAS032\",TABLAS!$A$59)","v":0},{"$f":"+GETPIVOTDATA(\" BAS033\",TABLAS!$A$59)","v":0},{"$f":"+GETPIVOTDATA(\" BAS034\",TABLAS!$A$59)","v":0},null,null,{"$f":"+GETPIVOTDATA(\" BAS035\",TABLAS!$A$59)","v":0},null,null,{"$f":"+GETPIVOTDATA(\" BAS036\",TABLAS!$A$59)","v":0},null,null,{"$f":"+GETPIVOTDATA(\" BAS037\",TABLAS!$A$59)","v":0},null,null,{"$f":"+GETPIVOTDATA(\" BAS038\",TABLAS!$A$59)","v":0},null,null,{"$f":"+GETPIVOTDATA(\" BAS039\",TABLAS!$A$59)","v":0},{"$f":"+GETPIVOTDATA(\" BAS040\",TABLAS!$A$59)","v":0},null,null,null,{"$f":"+BN24+1","v":21},{"$f":"+AK25+1","v":22},23,24,25,26,27,28,29,30,31,32,33,34,null,null,35,null,null,36,null,null,37,null,null,38,null,null,39,{"$f":"+BM25+1","v":40},null,null,null,{"$f":"IF(AK25<10,CONCATENATE($BR$14,\"00\",AK25,$BR$16),IF(AND(AK25>9,AK25<100),CONCATENATE($BR$14,\"0\",AK25,$BR$16),IF(AK25>99,CONCATENATE($BR$14,AK25,$BR$16))))","v":"=+IMPORTARDATOSDINAMICOS(\" BAS021\"|TABLAS!$A$59)"},{"$f":"IF(AL25<10,CONCATENATE($BR$14,\"00\",AL25,$BR$16),IF(AND(AL25>9,AL25<100),CONCATENATE($BR$14,\"0\",AL25,$BR$16),IF(AL25>99,CONCATENATE($BR$14,AL25,$BR$16))))","v":"=+IMPORTARDATOSDINAMICOS(\" BAS022\"|TABLAS!$A$59)"},{"$f":"IF(AM25<10,CONCATENATE($BR$14,\"00\",AM25,$BR$16),IF(AND(AM25>9,AM25<100),CONCATENATE($BR$14,\"0\",AM25,$BR$16),IF(AM25>99,CONCATENATE($BR$14,AM25,$BR$16))))","v":"=+IMPORTARDATOSDINAMICOS(\" BAS023\"|TABLAS!$A$59)"},{"$f":"IF(AN25<10,CONCATENATE($BR$14,\"00\",AN25,$BR$16),IF(AND(AN25>9,AN25<100),CONCATENATE($BR$14,\"0\",AN25,$BR$16),IF(AN25>99,CONCATENATE($BR$14,AN25,$BR$16))))","v":"=+IMPORTARDATOSDINAMICOS(\" BAS024\"|TABLAS!$A$59)"},{"$f":"IF(AO25<10,CONCATENATE($BR$14,\"00\",AO25,$BR$16),IF(AND(AO25>9,AO25<100),CONCATENATE($BR$14,\"0\",AO25,$BR$16),IF(AO25>99,CONCATENATE($BR$14,AO25,$BR$16))))","v":"=+IMPORTARDATOSDINAMICOS(\" BAS025\"|TABLAS!$A$59)"},{"$f":"IF(AP25<10,CONCATENATE($BR$14,\"00\",AP25,$BR$16),IF(AND(AP25>9,AP25<100),CONCATENATE($BR$14,\"0\",AP25,$BR$16),IF(AP25>99,CONCATENATE($BR$14,AP25,$BR$16))))","v":"=+IMPORTARDATOSDINAMICOS(\" BAS026\"|TABLAS!$A$59)"},{"$f":"IF(AQ25<10,CONCATENATE($BR$14,\"00\",AQ25,$BR$16),IF(AND(AQ25>9,AQ25<100),CONCATENATE($BR$14,\"0\",AQ25,$BR$16),IF(AQ25>99,CONCATENATE($BR$14,AQ25,$BR$16))))","v":"=+IMPORTARDATOSDINAMICOS(\" BAS027\"|TABLAS!$A$59)"},{"$f":"IF(AR25<10,CONCATENATE($BR$14,\"00\",AR25,$BR$16),IF(AND(AR25>9,AR25<100),CONCATENATE($BR$14,\"0\",AR25,$BR$16),IF(AR25>99,CONCATENATE($BR$14,AR25,$BR$16))))","v":"=+IMPORTARDATOSDINAMICOS(\" BAS028\"|TABLAS!$A$59)"},{"$f":"IF(AS25<10,CONCATENATE($BR$14,\"00\",AS25,$BR$16),IF(AND(AS25>9,AS25<100),CONCATENATE($BR$14,\"0\",AS25,$BR$16),IF(AS25>99,CONCATENATE($BR$14,AS25,$BR$16))))","v":"=+IMPORTARDATOSDINAMICOS(\" BAS029\"|TABLAS!$A$59)"},{"$f":"IF(AT25<10,CONCATENATE($BR$14,\"00\",AT25,$BR$16),IF(AND(AT25>9,AT25<100),CONCATENATE($BR$14,\"0\",AT25,$BR$16),IF(AT25>99,CONCATENATE($BR$14,AT25,$BR$16))))","v":"=+IMPORTARDATOSDINAMICOS(\" BAS030\"|TABLAS!$A$59)"},{"$f":"IF(AU25<10,CONCATENATE($BR$14,\"00\",AU25,$BR$16),IF(AND(AU25>9,AU25<100),CONCATENATE($BR$14,\"0\",AU25,$BR$16),IF(AU25>99,CONCATENATE($BR$14,AU25,$BR$16))))","v":"=+IMPORTARDATOSDINAMICOS(\" BAS031\"|TABLAS!$A$59)"},{"$f":"IF(AV25<10,CONCATENATE($BR$14,\"00\",AV25,$BR$16),IF(AND(AV25>9,AV25<100),CONCATENATE($BR$14,\"0\",AV25,$BR$16),IF(AV25>99,CONCATENATE($BR$14,AV25,$BR$16))))","v":"=+IMPORTARDATOSDINAMICOS(\" BAS032\"|TABLAS!$A$59)"},{"$f":"IF(AW25<10,CONCATENATE($BR$14,\"00\",AW25,$BR$16),IF(AND(AW25>9,AW25<100),CONCATENATE($BR$14,\"0\",AW25,$BR$16),IF(AW25>99,CONCATENATE($BR$14,AW25,$BR$16))))","v":"=+IMPORTARDATOSDINAMICOS(\" BAS033\"|TABLAS!$A$59)"},{"$f":"IF(AX25<10,CONCATENATE($BR$14,\"00\",AX25,$BR$16),IF(AND(AX25>9,AX25<100),CONCATENATE($BR$14,\"0\",AX25,$BR$16),IF(AX25>99,CONCATENATE($BR$14,AX25,$BR$16))))","v":"=+IMPORTARDATOSDINAMICOS(\" BAS034\"|TABLAS!$A$59)"},null,null,{"$f":"IF(BA25<10,CONCATENATE($BR$14,\"00\",BA25,$BR$16),IF(AND(BA25>9,BA25<100),CONCATENATE($BR$14,\"0\",BA25,$BR$16),IF(BA25>99,CONCATENATE($BR$14,BA25,$BR$16))))","v":"=+IMPORTARDATOSDINAMICOS(\" BAS035\"|TABLAS!$A$59)"},null,null,{"$f":"IF(BD25<10,CONCATENATE($BR$14,\"00\",BD25,$BR$16),IF(AND(BD25>9,BD25<100),CONCATENATE($BR$14,\"0\",BD25,$BR$16),IF(BD25>99,CONCATENATE($BR$14,BD25,$BR$16))))","v":"=+IMPORTARDATOSDINAMICOS(\" BAS036\"|TABLAS!$A$59)"},null,null,{"$f":"IF(BG25<10,CONCATENATE($BR$14,\"00\",BG25,$BR$16),IF(AND(BG25>9,BG25<100),CONCATENATE($BR$14,\"0\",BG25,$BR$16),IF(BG25>99,CONCATENATE($BR$14,BG25,$BR$16))))","v":"=+IMPORTARDATOSDINAMICOS(\" BAS037\"|TABLAS!$A$59)"},null,null,{"$f":"IF(BJ25<10,CONCATENATE($BR$14,\"00\",BJ25,$BR$16),IF(AND(BJ25>9,BJ25<100),CONCATENATE($BR$14,\"0\",BJ25,$BR$16),IF(BJ25>99,CONCATENATE($BR$14,BJ25,$BR$16))))","v":"=+IMPORTARDATOSDINAMICOS(\" BAS038\"|TABLAS!$A$59)"},null,null,{"$f":"IF(BM25<10,CONCATENATE($BR$14,\"00\",BM25,$BR$16),IF(AND(BM25>9,BM25<100),CONCATENATE($BR$14,\"0\",BM25,$BR$16),IF(BM25>99,CONCATENATE($BR$14,BM25,$BR$16))))","v":"=+IMPORTARDATOSDINAMICOS(\" BAS039\"|TABLAS!$A$59)"},{"$f":"IF(BN25<10,CONCATENATE($BR$14,\"00\",BN25,$BR$16),IF(AND(BN25>9,BN25<100),CONCATENATE($BR$14,\"0\",BN25,$BR$16),IF(BN25>99,CONCATENATE($BR$14,BN25,$BR$16))))","v":"=+IMPORTARDATOSDINAMICOS(\" BAS040\"|TABLAS!$A$59)"}]
["RN  Prematuro ",null,null,{"$f":"+GETPIVOTDATA(\" BAS041\",TABLAS!$A$59)","v":0},{"$f":"+GETPIVOTDATA(\" BAS042\",TABLAS!$A$59)","v":0},{"$f":"+GETPIVOTDATA(\" BAS043\",TABLAS!$A$59)","v":0},{"$f":"+GETPIVOTDATA(\" BAS044\",TABLAS!$A$59)","v":0},{"$f":"+GETPIVOTDATA(\" BAS045\",TABLAS!$A$59)","v":0},{"$f":"+GETPIVOTDATA(\" BAS046\",TABLAS!$A$59)","v":0},{"$f":"+GETPIVOTDATA(\" BAS047\",TABLAS!$A$59)","v":0},{"$f":"+GETPIVOTDATA(\" BAS048\",TABLAS!$A$59)","v":0},{"$f":"+GETPIVOTDATA(\" BAS049\",TABLAS!$A$59)","v":0},{"$f":"+GETPIVOTDATA(\" BAS050\",TABLAS!$A$59)","v":0},{"$f":"+GETPIVOTDATA(\" BAS051\",TABLAS!$A$59)","v":0},{"$f":"+GETPIVOTDATA(\" BAS052\",TABLAS!$A$59)","v":0},{"$f":"+GETPIVOTDATA(\" BAS053\",TABLAS!$A$59)","v":0},{"$f":"+GETPIVOTDATA(\" BAS054\",TABLAS!$A$59)","v":0},null,null,{"$f":"+GETPIVOTDATA(\" BAS055\",TABLAS!$A$59)","v":0},null,null,{"$f":"+GETPIVOTDATA(\" BAS056\",TABLAS!$A$59)","v":0},null,null,{"$f":"+GETPIVOTDATA(\" BAS057\",TABLAS!$A$59)","v":0},null,null,{"$f":"+GETPIVOTDATA(\" BAS058\",TABLAS!$A$59)","v":0},null,null,{"$f":"+GETPIVOTDATA(\" BAS059\",TABLAS!$A$59)","v":0},{"$f":"+GETPIVOTDATA(\" BAS060\",TABLAS!$A$59)","v":0},null,null,null,{"$f":"+BN25+1","v":41},{"$f":"+AK26+1","v":42},43,44,45,46,47,48,49,50,51,52,53,54,null,null,55,null,null,56,null,null,57,null,null,58,null,null,59,60,null,null,null,"=+IMPORTARDATOSDINAMICOS(\" BAS041\"|TABLAS!$A$59)","=+IMPORTARDATOSDINAMICOS(\" BAS042\"|TABLAS!$A$59)","=+IMPORTARDATOSDINAMICOS(\" BAS043\"|TABLAS!$A$59)","=+IMPORTARDATOSDINAMICOS(\" BAS044\"|TABLAS!$A$59)","=+IMPORTARDATOSDINAMICOS(\" BAS045\"|TABLAS!$A$59)","=+IMPORTARDATOSDINAMICOS(\" BAS046\"|TABLAS!$A$59)","=+IMPORTARDATOSDINAMICOS(\" BAS047\"|TABLAS!$A$59)","=+IMPORTARDATOSDINAMICOS(\" BAS048\"|TABLAS!$A$59)","=+IMPORTARDATOSDINAMICOS(\" BAS049\"|TABLAS!$A$59)","=+IMPORTARDATOSDINAMICOS(\" BAS050\"|TABLAS!$A$59)","=+IMPORTARDATOSDINAMICOS(\" BAS051\"|TABLAS!$A$59)","=+IMPORTARDATOSDINAMICOS(\" BAS052\"|TABLAS!$A$59)","=+IMPORTARDATOSDINAMICOS(\" BAS053\"|TABLAS!$A$59)","=+IMPORTARDATOSDINAMICOS(\" BAS054\"|TABLAS!$A$59)",null,null,"=+IMPORTARDATOSDINAMICOS(\" BAS055\"|TABLAS!$A$59)",null,null,"=+IMPORTARDATOSDINAMICOS(\" BAS056\"|TABLAS!$A$59)",null,null,"=+IMPORTARDATOSDINAMICOS(\" BAS057\"|TABLAS!$A$59)",null,null,"=+IMPORTARDATOSDINAMICOS(\" BAS058\"|TABLAS!$A$59)",null,null,"=+IMPORTARDATOSDINAMICOS(\" BAS059\"|TABLAS!$A$59)","=+IMPORTARDATOSDINAMICOS(\" BAS060\"|TABLAS!$A$59)"]
["RN con complicaciones ",null,null,{"$f":"+GETPIVOTDATA(\" BAS061\",TABLAS!$A$59)","v":0},{"$f":"+GETPIVOTDATA(\" BAS062\",TABLAS!$A$59)","v":0},{"$f":"+GETPIVOTDATA(\" BAS063\",TABLAS!$A$59)","v":0},{"$f":"+GETPIVOTDATA(\" BAS064\",TABLAS!$A$59)","v":0},{"$f":"+GETPIVOTDATA(\" BAS065\",TABLAS!$A$59)","v":0},{"$f":"+GETPIVOTDATA(\" BAS066\",TABLAS!$A$59)","v":0},{"$f":"+GETPIVOTDATA(\" BAS067\",TABLAS!$A$59)","v":0},{"$f":"+GETPIVOTDATA(\" BAS068\",TABLAS!$A$59)","v":0},{"$f":"+GETPIVOTDATA(\" BAS069\",TABLAS!$A$59)","v":0},{"$f":"+GETPIVOTDATA(\" BAS070\",TABLAS!$A$59)","v":0},{"$f":"+GETPIVOTDATA(\" BAS071\",TABLAS!$A$59)","v":0},{"$f":"+GETPIVOTDATA(\" BAS072\",TABLAS!$A$59)","v":0},{"$f":"+GETPIVOTDATA(\" BAS073\",TABLAS!$A$59)","v":0},{"$f":"+GETPIVOTDATA(\" BAS074\",TABLAS!$A$59)","v":0},null,null,{"$f":"+GETPIVOTDATA(\" BAS075\",TABLAS!$A$59)","v":0},null,null,{"$f":"+GETPIVOTDATA(\" BAS076\",TABLAS!$A$59)","v":0},null,null,{"$f":"+GETPIVOTDATA(\" BAS077\",TABLAS!$A$59)","v":0},null,null,{"$f":"+GETPIVOTDATA(\" BAS078\",TABLAS!$A$59)","v":0},null,null,{"$f":"+GETPIVOTDATA(\" BAS079\",TABLAS!$A$59)","v":0},{"$f":"+GETPIVOTDATA(\" BAS080\",TABLAS!$A$59)","v":0},null,null,null,61,{"$f":"+AK27+1","v":62},63,64,65,66,67,68,69,70,71,72,73,74,null,null,75,null,null,76,null,null,77,null,null,78,null,null,79,80,null,null,null,"=+IMPORTARDATOSDINAMICOS(\" BAS061\"|TABLAS!$A$59)","=+IMPORTARDATOSDINAMICOS(\" BAS062\"|TABLAS!$A$59)","=+IMPORTARDATOSDINAMICOS(\" BAS063\"|TABLAS!$A$59)","=+IMPORTARDATOSDINAMICOS(\" BAS064\"|TABLAS!$A$59)","=+IMPORTARDATOSDINAMICOS(\" BAS065\"|TABLAS!$A$59)","=+IMPORTARDATOSDINAMICOS(\" BAS066\"|TABLAS!$A$59)","=+IMPORTARDATOSDINAMICOS(\" BAS067\"|TABLAS!$A$59)","=+IMPORTARDATOSDINAMICOS(\" BAS068\"|TABLAS!$A$59)","=+IMPORTARDATOSDINAMICOS(\" BAS069\"|TABLAS!$A$59)","=+IMPORTARDATOSDINAMICOS(\" BAS070\"|TABLAS!$A$59)","=+IMPORTARDATOSDINAMICOS(\" BAS071\"|TABLAS!$A$59)","=+IMPORTARDATOSDINAMICOS(\" BAS072\"|TABLAS!$A$59)","=+IMPORTARDATOSDINAMICOS(\" BAS073\"|TABLAS!$A$59)","=+IMPORTARDATOSDINAMICOS(\" BAS074\"|TABLAS!$A$59)",null,null,"=+IMPORTARDATOSDINAMICOS(\" BAS075\"|TABLAS!$A$59)",null,null,"=+IMPORTARDATOSDINAMICOS(\" BAS076\"|TABLAS!$A$59)",null,null,"=+IMPORTARDATOSDINAMICOS(\" BAS077\"|TABLAS!$A$59)",null,null,"=+IMPORTARDATOSDINAMICOS(\" BAS078\"|TABLAS!$A$59)",null,null,"=+IMPORTARDATOSDINAMICOS(\" BAS079\"|TABLAS!$A$59)","=+IMPORTARDATOSDINAMICOS(\" BAS080\"|TABLAS!$A$59)"]
["< 1a",null,null,null,null,{"$f":"+GETPIVOTDATA(\" BAS081\",TABLAS!$A$59)","v":640},{"$f":"+GETPIVOTDATA(\" BAS082\",TABLAS!$A$59)","v":629},{"$f":"+GETPIVOTDATA(\" BAS083\",TABLAS!$A$59)","v":626},{"$f":"+GETPIVOTDATA(\" BAS084\",TABLAS!$A$59)","v":647},{"$f":"+GETPIVOTDATA(\" BAS085\",TABLAS!$A$59)","v":636},{"$f":"+GETPIVOTDATA(\" BAS086\",TABLAS!$A$59)","v":631},{"$f":"+GETPIVOTDATA(\" BAS087\",TABLAS!$A$59)","v":614},{"$f":"+GETPIVOTDATA(\" BAS088\",TABLAS!$A$59)","v":606},{"$f":"+GETPIVOTDATA(\" BAS089\",TABLAS!$A$59)","v":596},{"$f":"+GETPIVOTDATA(\" BAS090\",TABLAS!$A$59)","v":583},{"$f":"+GETPIVOTDATA(\" BAS091\",TABLAS!$A$59)","v":550},{"$f":"+GETPIVOTDATA(\" BAS092\",TABLAS!$A$59)","v":5304},null,null,{"$f":"+GETPIVOTDATA(\" BAS093\",TABLAS!$A$59)","v":5257},null,null,{"$f":"+GETPIVOTDATA(\" BAS094\",TABLAS!$A$59)","v":0},null,null,{"$f":"+GETPIVOTDATA(\" BAS095\",TABLAS!$A$59)","v":0},null,null,{"$f":"+GETPIVOTDATA(\" BAS096\",TABLAS!$A$59)","v":0},null,null,{"$f":"+GETPIVOTDATA(\" BAS097\",TABLAS!$A$59)","v":0},{"$f":"+GETPIVOTDATA(\" BAS098\",TABLAS!$A$59)","v":0},null,null,null,null,null,{"$f":"+BN27+1","v":81},{"$f":"+AM28+1","v":82},83,84,85,86,87,88,89,90,91,92,null,null,93,null,null,94,null,null,95,null,null,96,null,null,97,98,null,null,null,"=+IMPORTARDATOSDINAMICOS(\" BAS00\"|TABLAS!$A$59)","=+IMPORTARDATOSDINAMICOS(\" BAS00\"|TABLAS!$A$59)","=+IMPORTARDATOSDINAMICOS(\" BAS081\"|TABLAS!$A$59)","=+IMPORTARDATOSDINAMICOS(\" BAS082\"|TABLAS!$A$59)","=+IMPORTARDATOSDINAMICOS(\" BAS083\"|TABLAS!$A$59)","=+IMPORTARDATOSDINAMICOS(\" BAS084\"|TABLAS!$A$59)","=+IMPORTARDATOSDINAMICOS(\" BAS085\"|TABLAS!$A$59)","=+IMPORTARDATOSDINAMICOS(\" BAS086\"|TABLAS!$A$59)","=+IMPORTARDATOSDINAMICOS(\" BAS087\"|TABLAS!$A$59)","=+IMPORTARDATOSDINAMICOS(\" BAS088\"|TABLAS!$A$59)","=+IMPORTARDATOSDINAMICOS(\" BAS089\"|TABLAS!$A$59)","=+IMPORTARDATOSDINAMICOS(\" BAS090\"|TABLAS!$A$59)","=+IMPORTARDATOSDINAMICOS(\" BAS091\"|TABLAS!$A$59)","=+IMPORTARDATOSDINAMICOS(\" BAS092\"|TABLAS!$A$59)",null,null,"=+IMPORTARDATOSDINAMICOS(\" BAS093\"|TABLAS!$A$59)",null,null,"=+IMPORTARDATOSDINAMICOS(\" BAS094\"|TABLAS!$A$59)",null,null,"=+IMPORTARDATOSDINAMICOS(\" BAS095\"|TABLAS!$A$59)",null,null,"=+IMPORTARDATOSDINAMICOS(\" BAS096\"|TABLAS!$A$59)",null,null,"=+IMPORTARDATOSDINAMICOS(\" BAS097\"|TABLAS!$A$59)","=+IMPORTARDATOSDINAMICOS(\" BAS098\"|TABLAS!$A$59)"]
["1 año",null,null,null,null,{"$f":"+GETPIVOTDATA(\" BAS099\",TABLAS!$A$59)","v":654},{"$f":"+GETPIVOTDATA(\" BAS100\",TABLAS!$A$59)","v":663},{"$f":"+GETPIVOTDATA(\" BAS101\",TABLAS!$A$59)","v":651},{"$f":"+GETPIVOTDATA(\" BAS102\",TABLAS!$A$59)","v":670},{"$f":"+GETPIVOTDATA(\" BAS103\",TABLAS!$A$59)","v":581},{"$f":"+GETPIVOTDATA(\" BAS104\",TABLAS!$A$59)","v":493},{"$f":"+GETPIVOTDATA(\" BAS105\",TABLAS!$A$59)","v":0},{"$f":"+GETPIVOTDATA(\" BAS106\",TABLAS!$A$59)","v":0},{"$f":"+GETPIVOTDATA(\" BAS107\",TABLAS!$A$59)","v":0},{"$f":"+GETPIVOTDATA(\" BAS108\",TABLAS!$A$59)","v":0},{"$f":"+GETPIVOTDATA(\" BAS109\",TABLAS!$A$59)","v":0},{"$f":"+GETPIVOTDATA(\" BAS110\",TABLAS!$A$59)","v":2864},null,null,{"$f":"+GETPIVOTDATA(\" BAS111\",TABLAS!$A$59)","v":2839},null,null,{"$f":"+GETPIVOTDATA(\" BAS112\",TABLAS!$A$59)","v":0},null,null,{"$f":"+GETPIVOTDATA(\" BAS113\",TABLAS!$A$59)","v":0},null,null,{"$f":"+GETPIVOTDATA(\" BAS114\",TABLAS!$A$59)","v":0},null,null,{"$f":"+GETPIVOTDATA(\" BAS115\",TABLAS!$A$59)","v":0},{"$f":"+GETPIVOTDATA(\" BAS116\",TABLAS!$A$59)","v":0},null,null,null,null,null,99,{"$f":"+AM29+1","v":100},101,102,103,104,105,106,107,108,109,110,null,null,111,null,null,112,null,null,113,null,null,114,null,null,115,116,null,null,null,"=+IMPORTARDATOSDINAMICOS(\" BAS00\"|TABLAS!$A$59)","=+IMPORTARDATOSDINAMICOS(\" BAS00\"|TABLAS!$A$59)","=+IMPORTARDATOSDINAMICOS(\" BAS099\"|TABLAS!$A$59)","=+IMPORTARDATOSDINAMICOS(\" BAS100\"|TABLAS!$A$59)","=+IMPORTARDATOSDINAMICOS(\" BAS101\"|TABLAS!$A$59)","=+IMPORTARDATOSDINAMICOS(\" BAS102\"|TABLAS!$A$59)","=+IMPORTARDATOSDINAMICOS(\" BAS103\"|TABLAS!$A$59)","=+IMPORTARDATOSDINAMICOS(\" BAS104\"|TABLAS!$A$59)","=+IMPORTARDATOSDINAMICOS(\" BAS105\"|TABLAS!$A$59)","=+IMPORTARDATOSDINAMICOS(\" BAS106\"|TABLAS!$A$59)","=+IMPORTARDATOSDINAMICOS(\" BAS107\"|TABLAS!$A$59)","=+IMPORTARDATOSDINAMICOS(\" BAS108\"|TABLAS!$A$59)","=+IMPORTARDATOSDINAMICOS(\" BAS109\"|TABLAS!$A$59)","=+IMPORTARDATOSDINAMICOS(\" BAS110\"|TABLAS!$A$59)",null,null,"=+IMPORTARDATOSDINAMICOS(\" BAS111\"|TABLAS!$A$59)",null,null,"=+IMPORTARDATOSDINAMICOS(\" BAS112\"|TABLAS!$A$59)",null,null,"=+IMPORTARDATOSDINAMICOS(\" BAS113\"|TABLAS!$A$59)",null,null,"=+IMPORTARDATOSDINAMICOS(\" BAS114\"|TABLAS!$A$59)",null,null,"=+IMPORTARDATOSDINAMICOS(\" BAS115\"|TABLAS!$A$59)","=+IMPORTARDATOSDINAMICOS(\" BAS116\"|TABLAS!$A$59)"]
["2 años",null,null,null,null,{"$f":"+GETPIVOTDATA(\" BAS117\",TABLAS!$A$59)","v":664},{"$f":"+GETPIVOTDATA(\" BAS118\",TABLAS!$A$59)","v":597},{"$f":"+GETPIVOTDATA(\" BAS119\",TABLAS!$A$59)","v":514},{"$f":"+GETPIVOTDATA(\" BAS120\",TABLAS!$A$59)","v":508},{"$f":"+GETPIVOTDATA(\" BAS121\",TABLAS!$A$59)","v":1},{"$f":"+GETPIVOTDATA(\" BAS122\",TABLAS!$A$59)","v":8},{"$f":"+GETPIVOTDATA(\" BAS123\",TABLAS!$A$59)","v":0},{"$f":"+GETPIVOTDATA(\" BAS124\",TABLAS!$A$59)","v":0},{"$f":"+GETPIVOTDATA(\" BAS125\",TABLAS!$A$59)","v":0},{"$f":"+GETPIVOTDATA(\" BAS126\",TABLAS!$A$59)","v":0},{"$f":"+GETPIVOTDATA(\" BAS127\",TABLAS!$A$59)","v":0},{"$f":"+GETPIVOTDATA(\" BAS128\",TABLAS!$A$59)","v":1848},null,null,{"$f":"+GETPIVOTDATA(\" BAS129\",TABLAS!$A$59)","v":1836},null,null,{"$f":"+GETPIVOTDATA(\" BAS130\",TABLAS!$A$59)","v":0},null,null,{"$f":"+GETPIVOTDATA(\" BAS131\",TABLAS!$A$59)","v":0},null,null,{"$f":"+GETPIVOTDATA(\" BAS132\",TABLAS!$A$59)","v":0},null,null,{"$f":"+GETPIVOTDATA(\" BAS133\",TABLAS!$A$59)","v":0},{"$f":"+GETPIVOTDATA(\" BAS134\",TABLAS!$A$59)","v":0},null,null,null,null,null,117,{"$f":"+AM30+1","v":118},119,120,121,122,123,124,125,126,127,128,null,null,129,null,null,130,null,null,131,null,null,132,null,null,133,134,null,null,null,"=+IMPORTARDATOSDINAMICOS(\" BAS00\"|TABLAS!$A$59)","=+IMPORTARDATOSDINAMICOS(\" BAS00\"|TABLAS!$A$59)","=+IMPORTARDATOSDINAMICOS(\" BAS117\"|TABLAS!$A$59)","=+IMPORTARDATOSDINAMICOS(\" BAS118\"|TABLAS!$A$59)","=+IMPORTARDATOSDINAMICOS(\" BAS119\"|TABLAS!$A$59)","=+IMPORTARDATOSDINAMICOS(\" BAS120\"|TABLAS!$A$59)","=+IMPORTARDATOSDINAMICOS(\" BAS121\"|TABLAS!$A$59)","=+IMPORTARDATOSDINAMICOS(\" BAS122\"|TABLAS!$A$59)","=+IMPORTARDATOSDINAMICOS(\" BAS123\"|TABLAS!$A$59)","=+IMPORTARDATOSDINAMICOS(\" BAS124\"|TABLAS!$A$59)","=+IMPORTARDATOSDINAMICOS(\" BAS125\"|TABLAS!$A$59)","=+IMPORTARDATOSDINAMICOS(\" BAS126\"|TABLAS!$A$59)","=+IMPORTARDATOSDINAMICOS(\" BAS127\"|TABLAS!$A$59)","=+IMPORTARDATOSDINAMICOS(\" BAS128\"|TABLAS!$A$59)",null,null,"=+IMPORTARDATOSDINAMICOS(\" BAS129\"|TABLAS!$A$59)",null,null,"=+IMPORTARDATOSDINAMICOS(\" BAS130\"|TABLAS!$A$59)",null,null,"=+IMPORTARDATOSDINAMICOS(\" BAS131\"|TABLAS!$A$59)",null,null,"=+IMPORTARDATOSDINAMICOS(\" BAS132\"|TABLAS!$A$59)",null,null,"=+IMPORTARDATOSDINAMICOS(\" BAS133\"|TABLAS!$A$59)","=+IMPORTARDATOSDINAMICOS(\" BAS134\"|TABLAS!$A$59)"]
["3 años",null,null,null,null,{"$f":"+GETPIVOTDATA(\" BAS135\",TABLAS!$A$59)","v":650},{"$f":"+GETPIVOTDATA(\" BAS136\",TABLAS!$A$59)","v":554},{"$f":"+GETPIVOTDATA(\" BAS137\",TABLAS!$A$59)","v":452},{"$f":"+GETPIVOTDATA(\" BAS138\",TABLAS!$A$59)","v":416},{"$f":"+GETPIVOTDATA(\" BAS139\",TABLAS!$A$59)","v":1},{"$f":"+GETPIVOTDATA(\" BAS140\",TABLAS!$A$59)","v":1},{"$f":"+GETPIVOTDATA(\" BAS141\",TABLAS!$A$59)","v":0},{"$f":"+GETPIVOTDATA(\" BAS142\",TABLAS!$A$59)","v":0},{"$f":"+GETPIVOTDATA(\" BAS143\",TABLAS!$A$59)","v":0},{"$f":"+GETPIVOTDATA(\" BAS144\",TABLAS!$A$59)","v":0},{"$f":"+GETPIVOTDATA(\" BAS145\",TABLAS!$A$59)","v":0},{"$f":"+GETPIVOTDATA(\" BAS146\",TABLAS!$A$59)","v":1608},null,null,{"$f":"+GETPIVOTDATA(\" BAS147\",TABLAS!$A$59)","v":1590},null,null,{"$f":"+GETPIVOTDATA(\" BAS148\",TABLAS!$A$59)","v":0},null,null,{"$f":"+GETPIVOTDATA(\" BAS149\",TABLAS!$A$59)","v":0},null,null,{"$f":"+GETPIVOTDATA(\" BAS150\",TABLAS!$A$59)","v":0},null,null,{"$f":"+GETPIVOTDATA(\" BAS151\",TABLAS!$A$59)","v":0},{"$f":"+GETPIVOTDATA(\" BAS152\",TABLAS!$A$59)","v":0},null,null,null,null,null,135,{"$f":"+AM31+1","v":136},137,138,139,140,141,142,143,144,145,146,null,null,147,null,null,148,null,null,149,null,null,150,null,null,151,152,null,null,null,"=+IMPORTARDATOSDINAMICOS(\" BAS00\"|TABLAS!$A$59)","=+IMPORTARDATOSDINAMICOS(\" BAS00\"|TABLAS!$A$59)","=+IMPORTARDATOSDINAMICOS(\" BAS135\"|TABLAS!$A$59)","=+IMPORTARDATOSDINAMICOS(\" BAS136\"|TABLAS!$A$59)","=+IMPORTARDATOSDINAMICOS(\" BAS137\"|TABLAS!$A$59)","=+IMPORTARDATOSDINAMICOS(\" BAS138\"|TABLAS!$A$59)","=+IMPORTARDATOSDINAMICOS(\" BAS139\"|TABLAS!$A$59)","=+IMPORTARDATOSDINAMICOS(\" BAS140\"|TABLAS!$A$59)","=+IMPORTARDATOSDINAMICOS(\" BAS141\"|TABLAS!$A$59)","=+IMPORTARDATOSDINAMICOS(\" BAS142\"|TABLAS!$A$59)","=+IMPORTARDATOSDINAMICOS(\" BAS143\"|TABLAS!$A$59)","=+IMPORTARDATOSDINAMICOS(\" BAS144\"|TABLAS!$A$59)","=+IMPORTARDATOSDINAMICOS(\" BAS145\"|TABLAS!$A$59)","=+IMPORTARDATOSDINAMICOS(\" BAS146\"|TABLAS!$A$59)",null,null,"=+IMPORTARDATOSDINAMICOS(\" BAS147\"|TABLAS!$A$59)",null,null,"=+IMPORTARDATOSDINAMICOS(\" BAS148\"|TABLAS!$A$59)",null,null,"=+IMPORTARDATOSDINAMICOS(\" BAS149\"|TABLAS!$A$59)",null,null,"=+IMPORTARDATOSDINAMICOS(\" BAS150\"|TABLAS!$A$59)",null,null,"=+IMPORTARDATOSDINAMICOS(\" BAS151\"|TABLAS!$A$59)","=+IMPORTARDATOSDINAMICOS(\" BAS152\"|TABLAS!$A$59)"]
["4 años",null,null,null,null,{"$f":"+GETPIVOTDATA(\" BAS153\",TABLAS!$A$59)","v":704},{"$f":"+GETPIVOTDATA(\" BAS154\",TABLAS!$A$59)","v":498},{"$f":"+GETPIVOTDATA(\" BAS155\",TABLAS!$A$59)","v":396},{"$f":"+GETPIVOTDATA(\" BAS156\",TABLAS!$A$59)","v":319},{"$f":"+GETPIVOTDATA(\" BAS157\",TABLAS!$A$59)","v":0},{"$f":"+GETPIVOTDATA(\" BAS158\",TABLAS!$A$59)","v":0},{"$f":"+GETPIVOTDATA(\" BAS159\",TABLAS!$A$59)","v":0},{"$f":"+GETPIVOTDATA(\" BAS160\",TABLAS!$A$59)","v":0},{"$f":"+GETPIVOTDATA(\" BAS161\",TABLAS!$A$59)","v":0},{"$f":"+GETPIVOTDATA(\" BAS162\",TABLAS!$A$59)","v":0},{"$f":"+GETPIVOTDATA(\" BAS163\",TABLAS!$A$59)","v":0},{"$f":"+GETPIVOTDATA(\" BAS164\",TABLAS!$A$59)","v":1375},null,null,{"$f":"+GETPIVOTDATA(\" BAS165\",TABLAS!$A$59)","v":1361},null,null,{"$f":"+GETPIVOTDATA(\" BAS166\",TABLAS!$A$59)","v":0},null,null,{"$f":"+GETPIVOTDATA(\" BAS167\",TABLAS!$A$59)","v":0},null,null,{"$f":"+GETPIVOTDATA(\" BAS168\",TABLAS!$A$59)","v":0},null,null,{"$f":"+GETPIVOTDATA(\" BAS169\",TABLAS!$A$59)","v":0},{"$f":"+GETPIVOTDATA(\" BAS170\",TABLAS!$A$59)","v":0},null,null,null,null,null,153,{"$f":"+AM32+1","v":154},155,156,157,158,159,160,161,162,163,164,null,null,165,null,null,166,null,null,167,null,null,168,null,null,169,170,null,null,null,"=+IMPORTARDATOSDINAMICOS(\" BAS00\"|TABLAS!$A$59)","=+IMPORTARDATOSDINAMICOS(\" BAS00\"|TABLAS!$A$59)","=+IMPORTARDATOSDINAMICOS(\" BAS153\"|TABLAS!$A$59)","=+IMPORTARDATOSDINAMICOS(\" BAS154\"|TABLAS!$A$59)","=+IMPORTARDATOSDINAMICOS(\" BAS155\"|TABLAS!$A$59)","=+IMPORTARDATOSDINAMICOS(\" BAS156\"|TABLAS!$A$59)","=+IMPORTARDATOSDINAMICOS(\" BAS157\"|TABLAS!$A$59)","=+IMPORTARDATOSDINAMICOS(\" BAS158\"|TABLAS!$A$59)","=+IMPORTARDATOSDINAMICOS(\" BAS159\"|TABLAS!$A$59)","=+IMPORTARDATOSDINAMICOS(\" BAS160\"|TABLAS!$A$59)","=+IMPORTARDATOSDINAMICOS(\" BAS161\"|TABLAS!$A$59)","=+IMPORTARDATOSDINAMICOS(\" BAS162\"|TABLAS!$A$59)","=+IMPORTARDATOSDINAMICOS(\" BAS163\"|TABLAS!$A$59)","=+IMPORTARDATOSDINAMICOS(\" BAS164\"|TABLAS!$A$59)",null,null,"=+IMPORTARDATOSDINAMICOS(\" BAS165\"|TABLAS!$A$59)",null,null,"=+IMPORTARDATOSDINAMICOS(\" BAS166\"|TABLAS!$A$59)",null,null,"=+IMPORTARDATOSDINAMICOS(\" BAS167\"|TABLAS!$A$59)",null,null,"=+IMPORTARDATOSDINAMICOS(\" BAS168\"|TABLAS!$A$59)",null,null,"=+IMPORTARDATOSDINAMICOS(\" BAS169\"|TABLAS!$A$59)","=+IMPORTARDATOSDINAMICOS(\" BAS170\"|TABLAS!$A$59)"]
["5-9 años",null,null,null,null,{"$f":"+GETPIVOTDATA(\" BAS171\",TABLAS!$A$59)","v":1125},null,null,null,null,null,null,null,null,null,null,{"$f":"+GETPIVOTDATA(\" BAS172\",TABLAS!$A$59)","v":318},null,null,{"$f":"+GETPIVOTDATA(\" BAS173\",TABLAS!$A$59)","v":317},null,null,{"$f":"+GETPIVOTDATA(\" BAS174\",TABLAS!$A$59)","v":0},null,null,{"$f":"+GETPIVOTDATA(\" BAS175\",TABLAS!$A$59)","v":0},null,null,{"$f":"+GETPIVOTDATA(\" BAS176\",TABLAS!$A$59)","v":0},null,null,{"$f":"+GETPIVOTDATA(\" BAS177\",TABLAS!$A$59)","v":0},{"$f":"+GETPIVOTDATA(\" BAS178\",TABLAS!$A$59)","v":0},null,null,null,null,null,171,null,null,null,null,null,null,null,null,null,null,{"$f":"+AM33+1","v":172},null,null,173,null,null,174,null,null,175,null,null,176,null,null,177,178,null,null,null,"=+IMPORTARDATOSDINAMICOS(\" BAS00\"|TABLAS!$A$59)","=+IMPORTARDATOSDINAMICOS(\" BAS00\"|TABLAS!$A$59)","=+IMPORTARDATOSDINAMICOS(\" BAS171\"|TABLAS!$A$59)","=+IMPORTARDATOSDINAMICOS(\" BAS00\"|TABLAS!$A$59)","=+IMPORTARDATOSDINAMICOS(\" BAS00\"|TABLAS!$A$59)","=+IMPORTARDATOSDINAMICOS(\" BAS00\"|TABLAS!$A$59)","=+IMPORTARDATOSDINAMICOS(\" BAS00\"|TABLAS!$A$59)","=+IMPORTARDATOSDINAMICOS(\" BAS00\"|TABLAS!$A$59)","=+IMPORTARDATOSDINAMICOS(\" BAS00\"|TABLAS!$A$59)","=+IMPORTARDATOSDINAMICOS(\" BAS00\"|TABLAS!$A$59)","=+IMPORTARDATOSDINAMICOS(\" BAS00\"|TABLAS!$A$59)","=+IMPORTARDATOSDINAMICOS(\" BAS00\"|TABLAS!$A$59)","=+IMPORTARDATOSDINAMICOS(\" BAS00\"|TABLAS!$A$59)","=+IMPORTARDATOSDINAMICOS(\" BAS172\"|TABLAS!$A$59)",null,null,"=+IMPORTARDATOSDINAMICOS(\" BAS173\"|TABLAS!$A$59)",null,null,"=+IMPORTARDATOSDINAMICOS(\" BAS174\"|TABLAS!$A$59)",null,null,"=+IMPORTARDATOSDINAMICOS(\" BAS175\"|TABLAS!$A$59)",null,null,"=+IMPORTARDATOSDINAMICOS(\" BAS176\"|TABLAS!$A$59)",null,null,"=+IMPORTARDATOSDINAMICOS(\" BAS177\"|TABLAS!$A$59)","=+IMPORTARDATOSDINAMICOS(\" BAS178\"|TABLAS!$A$59)"]
["10-11 años",null,null,null,null,{"$f":"+GETPIVOTDATA(\" BAS179\",TABLAS!$A$59)","v":357},null,null,null,null,null,null,null,null,null,null,{"$f":"+GETPIVOTDATA(\" BAS180\",TABLAS!$A$59)","v":83},null,null,{"$f":"+GETPIVOTDATA(\" BAS181\",TABLAS!$A$59)","v":83},null,null,{"$f":"+GETPIVOTDATA(\" BAS182\",TABLAS!$A$59)","v":0},null,null,{"$f":"+GETPIVOTDATA(\" BAS183\",TABLAS!$A$59)","v":0},null,null,{"$f":"+GETPIVOTDATA(\" BAS184\",TABLAS!$A$59)","v":0},null,null,{"$f":"+GETPIVOTDATA(\" BAS185\",TABLAS!$A$59)","v":0},{"$f":"+GETPIVOTDATA(\" BAS186\",TABLAS!$A$59)","v":0},null,null,null,null,null,179,null,null,null,null,null,null,null,null,null,null,{"$f":"+AM34+1","v":180},null,null,181,null,null,182,null,null,183,null,null,184,null,null,185,186,null,null,null,"=+IMPORTARDATOSDINAMICOS(\" BAS00\"|TABLAS!$A$59)","=+IMPORTARDATOSDINAMICOS(\" BAS00\"|TABLAS!$A$59)","=+IMPORTARDATOSDINAMICOS(\" BAS179\"|TABLAS!$A$59)","=+IMPORTARDATOSDINAMICOS(\" BAS00\"|TABLAS!$A$59)","=+IMPORTARDATOSDINAMICOS(\" BAS00\"|TABLAS!$A$59)","=+IMPORTARDATOSDINAMICOS(\" BAS00\"|TABLAS!$A$59)","=+IMPORTARDATOSDINAMICOS(\" BAS00\"|TABLAS!$A$59)","=+IMPORTARDATOSDINAMICOS(\" BAS00\"|TABLAS!$A$59)","=+IMPORTARDATOSDINAMICOS(\" BAS00\"|TABLAS!$A$59)","=+IMPORTARDATOSDINAMICOS(\" BAS00\"|TABLAS!$A$59)","=+IMPORTARDATOSDINAMICOS(\" BAS00\"|TABLAS!$A$59)","=+IMPORTARDATOSDINAMICOS(\" BAS00\"|TABLAS!$A$59)","=+IMPORTARDATOSDINAMICOS(\" BAS00\"|TABLAS!$A$59)","=+IMPORTARDATOSDINAMICOS(\" BAS180\"|TABLAS!$A$59)",null,null,"=+IMPORTARDATOSDINAMICOS(\" BAS181\"|TABLAS!$A$59)",null,null,"=+IMPORTARDATOSDINAMICOS(\" BAS182\"|TABLAS!$A$59)",null,null,"=+IMPORTARDATOSDINAMICOS(\" BAS183\"|TABLAS!$A$59)",null,null,"=+IMPORTARDATOSDINAMICOS(\" BAS184\"|TABLAS!$A$59)",null,null,"=+IMPORTARDATOSDINAMICOS(\" BAS185\"|TABLAS!$A$59)","=+IMPORTARDATOSDINAMICOS(\" BAS186\"|TABLAS!$A$59)"]
["TOTAL",null,null,null,null,null,null,null,null,null,null,null,null,null,null,null,null,null,null,null,null,null,null,null,null,null,null,null,null,null,null,"99801 + LB=8","99801 + LB=TA"]
[]
[" I. ATENCIÓN DEL RECIÉN NACIDO"]
[]
["A) Atención Inmediata",null,null,null,"C) Atención de Recién Nacido en Alojamiento Conjunto",null,null,null,null,null,"D) Resultados del Tamizaje Neonatal",null,null,null,"E) Atención de Recién Nacido en la visita domiciliaria",null,null,null,null,null,null,null,null,null,null,null,null,null,null,null,null,null,null,null,null,null,null,null,null,null,null,null,null,null,null,null,null,null,null,null,null,null,null,null,null,null,null,null,null,null,null,null,null,null,null,null,null,null,null,null,null,{"$f":"+GETPIVOTDATA(\" BAS001\",TABLAS!$A$95)","v":496}]
[null,null,null,null,null,null,null,null,null,null,null,null,null,null,null,null,null,"Nº"]
["ACTIVIDADES",null,"Nº",null,"ACTIVIDADES",null,null,null,"Nº",null,"DIAGNÓSTICOS",null,"Nº",null,"DIAGNÓSTICOS",null,null,"Nº",null,null,null,null,null,null,null,null,null,null,null,null,null,null,null,null,null,null,null,null,null,null,null,null,null,null,null,null,null,null,null,null,null,null,null,null,null,null,null,null,null,null,null,null,null,null,null,null,null,null,null,null,null,"\"|TABLAS!$A$95)"]
["Atención Inmediata del RN",null,{"$f":"+GETPIVOTDATA(\" BAS001\",TABLAS!$A$95)","v":496},null,"Atención del recien nacido en Alojamiento Conjunto",null,null,null,{"$f":"+GETPIVOTDATA(\" BAS007\",TABLAS!$A$95)","v":407},null,"Hipotiroidismo Congénito",null,{"$f":"+GETPIVOTDATA(\" BAS013\",TABLAS!$A$95)","v":0},null,"Visita domiciliaria para el cuidado y evaluación neonatal ",null,null,{"$f":"+GETPIVOTDATA(\" BAS021\",TABLAS!$A$95)","v":6},null,null,null,null,null,null,null,null,null,null,null,null,null,null,null,null,null,null,null,null,1,null,{"$f":"+AM47+1","v":7},null,{"$f":"+AO47+1","v":13},null,{"$f":"+AQ49+1","v":21},null,null,null,null,null,null,null,null,null,null,null,null,null,null,null,null,null,null,null,null,null,null,null,null,null,null,{"$f":"IF(AM42<10,CONCATENATE($BR$14,\"00\",AM42,$BT$41),IF(AND(AM42>9,AM42<100),CONCATENATE($BR$14,\"0\",AM42,$BT$41),IF(AM42>99,CONCATENATE($BR$14,AM42,$BT$41))))","v":"=+IMPORTARDATOSDINAMICOS(\" BAS001\"|TABLAS!$A$95)"},null,{"$f":"IF(AO42<10,CONCATENATE($BR$14,\"00\",AO42,$BT$41),IF(AND(AO42>9,AO42<100),CONCATENATE($BR$14,\"0\",AO42,$BT$41),IF(AO42>99,CONCATENATE($BR$14,AO42,$BT$41))))","v":"=+IMPORTARDATOSDINAMICOS(\" BAS007\"|TABLAS!$A$95)"},null,{"$f":"IF(AQ42<10,CONCATENATE($BR$14,\"00\",AQ42,$BT$41),IF(AND(AQ42>9,AQ42<100),CONCATENATE($BR$14,\"0\",AQ42,$BT$41),IF(AQ42>99,CONCATENATE($BR$14,AQ42,$BT$41))))","v":"=+IMPORTARDATOSDINAMICOS(\" BAS013\"|TABLAS!$A$95)"},null,{"$f":"IF(AS42<10,CONCATENATE($BR$14,\"00\",AS42,$BT$41),IF(AND(AS42>9,AS42<100),CONCATENATE($BR$14,\"0\",AS42,$BT$41),IF(AS42>99,CONCATENATE($BR$14,AS42,$BT$41))))","v":"=+IMPORTARDATOSDINAMICOS(\" BAS021\"|TABLAS!$A$95)"}]
["Tamizaje Neonatal (Enfermed. Metabólicas)",null,{"$f":"+GETPIVOTDATA(\" BAS002\",TABLAS!$A$95)","v":458},null,"Evaluación médica del recién nacido ",null,null,null,{"$f":"+GETPIVOTDATA(\" BAS008\",TABLAS!$A$95)","v":48},null,"Fenilcetonuria Clásica",null,{"$f":"+GETPIVOTDATA(\" BAS014\",TABLAS!$A$95)","v":0},null,"Anamnesis y el examen físico del recién nacido normal",null,null,{"$f":"+GETPIVOTDATA(\" BAS022\",TABLAS!$A$95)","v":498},null,null,null,null,null,null,null,null,null,null,null,null,null,null,null,null,null,null,null,null,{"$f":"+AM42+1","v":2},null,{"$f":"+AO42+1","v":8},null,{"$f":"+AQ42+1","v":14},null,{"$f":"+AS42+1","v":22},null,null,null,null,null,null,null,null,null,null,null,null,null,null,null,null,null,null,null,null,null,null,null,null,null,null,"=+IMPORTARDATOSDINAMICOS(\" BAS002\"|TABLAS!$A$95)",null,"=+IMPORTARDATOSDINAMICOS(\" BAS008\"|TABLAS!$A$95)",null,"=+IMPORTARDATOSDINAMICOS(\" BAS014\"|TABLAS!$A$95)",null,"=+IMPORTARDATOSDINAMICOS(\" BAS022\"|TABLAS!$A$95)"]
["Tamizaje Visual y Auditivo",null,{"$f":"+GETPIVOTDATA(\" BAS003\",TABLAS!$A$95)","v":2},null,"Tamizaje neonatal metabolico: toma de muestra ",null,null,null,{"$f":"+GETPIVOTDATA(\" BAS009\",TABLAS!$A$95)","v":1},null,"Hiperplasia Suprarrenal Congénita",null,{"$f":"+GETPIVOTDATA(\" BAS015\",TABLAS!$A$95)","v":0},null,"Consejería en higiene del recién nacido, niño o niña y cuidado en el hogar",null,null,{"$f":"+GETPIVOTDATA(\" BAS023\",TABLAS!$A$95)","v":238},null,null,null,null,null,null,null,null,null,null,null,null,null,null,null,null,null,null,null,null,{"$f":"+AM43+1","v":3},null,{"$f":"+AO43+1","v":9},null,15,null,23,null,null,null,null,null,null,null,null,null,null,null,null,null,null,null,null,null,null,null,null,null,null,null,null,null,null,"=+IMPORTARDATOSDINAMICOS(\" BAS003\"|TABLAS!$A$95)",null,"=+IMPORTARDATOSDINAMICOS(\" BAS009\"|TABLAS!$A$95)",null,"=+IMPORTARDATOSDINAMICOS(\" BAS015\"|TABLAS!$A$95)",null,"=+IMPORTARDATOSDINAMICOS(\" BAS023\"|TABLAS!$A$95)"]
["Contacto Piel a Piel con la madre",null,{"$f":"+GETPIVOTDATA(\" BAS004\",TABLAS!$A$95)","v":491},null," Tamizaje de hipoacusia congenita",null,null,null,{"$f":"+GETPIVOTDATA(\" BAS010\",TABLAS!$A$95)","v":0},null,"Tamizaje de Cardiopatia Congenita",null,{"$f":"+GETPIVOTDATA(\" BAS016\",TABLAS!$A$95)","v":0},null,"Consejería en el cuidado del cordón umbilical",null,null,{"$f":"+GETPIVOTDATA(\" BAS024\",TABLAS!$A$95)","v":418},null,null,null,null,null,null,null,null,null,null,null,null,null,null,null,null,null,null,null,null,{"$f":"+AM44+1","v":4},null,{"$f":"+AO44+1","v":10},null,16,null,24,null,null,null,null,null,null,null,null,null,null,null,null,null,null,null,null,null,null,null,null,null,null,null,null,null,null,"=+IMPORTARDATOSDINAMICOS(\" BAS004\"|TABLAS!$A$95)",null,"=+IMPORTARDATOSDINAMICOS(\" BAS010\"|TABLAS!$A$95)",null,"=+IMPORTARDATOSDINAMICOS(\" BAS016\"|TABLAS!$A$95)",null,"=+IMPORTARDATOSDINAMICOS(\" BAS024\"|TABLAS!$A$95)"]
["Alojamiento Conjunto",null,{"$f":"+GETPIVOTDATA(\" BAS005\",TABLAS!$A$95)","v":411},null,"Tamizaje de catarata congénita ",null,null,null,{"$f":"+GETPIVOTDATA(\" BAS011\",TABLAS!$A$95)","v":1},null,"Fibrosis quística, sin otra especificación",null,{"$f":"+GETPIVOTDATA(\" BAS017\",TABLAS!$A$95)","v":0},null,"Consejería en importancia del control de crecimiento y desarrollo (4 controles)",null,null,{"$f":"+GETPIVOTDATA(\" BAS025\",TABLAS!$A$95)","v":339},null,null,null,null,null,null,null,null,null,null,null,null,null,null,null,null,null,null,null,null,{"$f":"+AM45+1","v":5},null,{"$f":"+AO45+1","v":11},null,17,null,25,null,null,null,null,null,null,null,null,null,null,null,null,null,null,null,null,null,null,null,null,null,null,null,null,null,null,"=+IMPORTARDATOSDINAMICOS(\" BAS005\"|TABLAS!$A$95)",null,"=+IMPORTARDATOSDINAMICOS(\" BAS011\"|TABLAS!$A$95)",null,"=+IMPORTARDATOSDINAMICOS(\" BAS017\"|TABLAS!$A$95)",null,"=+IMPORTARDATOSDINAMICOS(\" BAS025\"|TABLAS!$A$95)"]
["Lactancia Materna en la 1º Hora (FUENTE CNV)",null,{"$f":"+GETPIVOTDATA(\" BAS006\",TABLAS!$A$95)","v":423},null,"Tamizaje de cardiopatía congénita",null,null,null,{"$f":"+GETPIVOTDATA(\" BAS012\",TABLAS!$A$95)","v":0},null,"Catarata Congénita",null,{"$f":"+GETPIVOTDATA(\" BAS018\",TABLAS!$A$95)","v":0},null,"Consejería de idenficación de signos de alarma ",null,null,{"$f":"+GETPIVOTDATA(\" BAS026\",TABLAS!$A$95)","v":348},null,null,null,null,null,null,null,null,null,null,null,null,null,null,null,null,null,null,null,null,{"$f":"+AM46+1","v":6},null,{"$f":"+AO46+1","v":12},null,18,null,26,null,null,null,null,null,null,null,null,null,null,null,null,null,null,null,null,null,null,null,null,null,null,null,null,null,null,"=+IMPORTARDATOSDINAMICOS(\" BAS006\"|TABLAS!$A$95)",null,"=+IMPORTARDATOSDINAMICOS(\" BAS012\"|TABLAS!$A$95)",null,"=+IMPORTARDATOSDINAMICOS(\" BAS018\"|TABLAS!$A$95)",null,"=+IMPORTARDATOSDINAMICOS(\" BAS026\"|TABLAS!$A$95)"]
[null,null,null,null,null,null,null,null,null,null,"Cardiopatía congénita",null,{"$f":"+GETPIVOTDATA(\" BAS019\",TABLAS!$A$95)","v":0},null,"Consejería en higiene de manos",null,null,{"$f":"+GETPIVOTDATA(\" BAS027\",TABLAS!$A$95)","v":0},null,null,null,null,null,null,null,null,null,null,null,null,null,null,null,null,null,null,null,null,null,null,null,null,19,null,27,null,null,null,null,null,null,null,null,null,null,null,null,null,null,null,null,null,null,null,null,null,null,null,null,null,null,null,null,"=+IMPORTARDATOSDINAMICOS(\" BAS00\"|TABLAS!$A$95)",null,"=+IMPORTARDATOSDINAMICOS(\" BAS019\"|TABLAS!$A$95)",null,"=+IMPORTARDATOSDINAMICOS(\" BAS027\"|TABLAS!$A$95)"]
["B) Condicion de Nacimiento del Recien Nacido",null,null,null,"F) Consejeria en En Atencion del Reci en  Nacido  Alojamiento Conjunto",null,null,null,"Nº",null,"Hipoacusia conductiva, sin otra especificación ",null,{"$f":"+GETPIVOTDATA(\" BAS020\",TABLAS!$A$95)","v":0},null,"Consejería en Lactancia Materna Exclusiva hasta los 6 meses ",null,null,{"$f":"+GETPIVOTDATA(\" BAS028\",TABLAS!$A$95)","v":5606},null,null,null,null,null,null,null,null,null,null,null,null,null,null,null,null,null,null,null,null,null,null,null,null,20,null,28,null,null,null,null,null,null,null,null,null,null,null,null,null,null,null,null,null,null,null,null,null,null,null,null,null,null,null,null,null,null,"=+IMPORTARDATOSDINAMICOS(\" BAS020\"|TABLAS!$A$95)",null,"=+IMPORTARDATOSDINAMICOS(\" BAS028\"|TABLAS!$A$95)"]
["ACTIVIDADES",null,"Nº",null,"ACTIVIDADES",null,null,null,"Nº"]
["Extremadamente bajo peso",null,{"$f":"+GETPIVOTDATA(\" BAS029\",TABLAS!$A$95)","v":0},null,"Consejería y acompañamiento en alimentación con sucedáneos de leche materna a neonatos expuestos al VIH ",null,null,null,{"$f":"+GETPIVOTDATA(\" BAS036\",TABLAS!$A$95)","v":1},null,null,null,null,null,null,null,null,null,null,null,null,null,null,null,null,null,null,null,null,null,null,null,null,null,null,null,null,null,{"$f":"+AS49+1","v":29},null,{"$f":"+AM57+1","v":36},null,null,null,null,null,null,null,null,null,null,null,null,null,null,null,null,null,null,null,null,null,null,null,null,null,null,null,null,null,null,{"$f":"IF(AM51<10,CONCATENATE($BR$14,\"00\",AM51,$BT$41),IF(AND(AM51>9,AM51<100),CONCATENATE($BR$14,\"0\",AM51,$BT$41),IF(AM51>99,CONCATENATE($BR$14,AM51,$BT$41))))","v":"=+IMPORTARDATOSDINAMICOS(\" BAS029\"|TABLAS!$A$95)"},null,{"$f":"IF(AO51<10,CONCATENATE($BR$14,\"00\",AO51,$BT$41),IF(AND(AO51>9,AO51<100),CONCATENATE($BR$14,\"0\",AO51,$BT$41),IF(AO51>99,CONCATENATE($BR$14,AO51,$BT$41))))","v":"=+IMPORTARDATOSDINAMICOS(\" BAS036\"|TABLAS!$A$95)"}]
["Muy bajo peso al nacer",null,{"$f":"+GETPIVOTDATA(\" BAS030\",TABLAS!$A$95)","v":0},null,null,null,null,null,null,null,null,null,null,null,null,null,null,null,null,null,null,null,null,null,null,null,null,null,null,null,null,null,null,null,null,null,null,null,{"$f":"+AM51+1","v":30},null,{"$f":"+AO51+1","v":37},null,null,null,null,null,null,null,null,null,null,null,null,null,null,null,null,null,null,null,null,null,null,null,null,null,null,null,null,null,null,"=+IMPORTARDATOSDINAMICOS(\" BAS030\"|TABLAS!$A$95)",null,"=+IMPORTARDATOSDINAMICOS(\" BAS037\"|TABLAS!$A$95)"]
["Bajo peso al nacer",null,{"$f":"+GETPIVOTDATA(\" BAS031\",TABLAS!$A$95)","v":29},null,null,null,null,null,null,null,null,null,null,null,null,null,null,null,null,null,null,null,null,null,null,null,null,null,null,null,null,null,null,null,null,null,null,null,31,null,38,null,null,null,null,null,null,null,null,null,null,null,null,null,null,null,null,null,null,null,null,null,null,null,null,null,null,null,null,null,null,"=+IMPORTARDATOSDINAMICOS(\" BAS031\"|TABLAS!$A$95)",null,"=+IMPORTARDATOSDINAMICOS(\" BAS038\"|TABLAS!$A$95)"]
["Macrosomico",null,{"$f":"+GETPIVOTDATA(\" BAS032\",TABLAS!$A$95)","v":4},null,null,null,null,null,null,null,null,null,null,null,null,null,null,null,null,null,null,null,null,null,null,null,null,null,null,null,null,null,null,null,null,null,null,null,32,null,39,null,null,null,null,null,null,null,null,null,null,null,null,null,null,null,null,null,null,null,null,null,null,null,null,null,null,null,null,null,null,"=+IMPORTARDATOSDINAMICOS(\" BAS032\"|TABLAS!$A$95)",null,"=+IMPORTARDATOSDINAMICOS(\" BAS039\"|TABLAS!$A$95)"]
["Microcefalia",null,{"$f":"+GETPIVOTDATA(\" BAS033\",TABLAS!$A$95)","v":1},null,null,null,null,null,null,null,null,null,null,null,null,null,null,null,null,null,null,null,null,null,null,null,null,null,null,null,null,null,null,null,null,null,null,null,33,null,40,null,null,null,null,null,null,null,null,null,null,null,null,null,null,null,null,null,null,null,null,null,null,null,null,null,null,null,null,null,null,"=+IMPORTARDATOSDINAMICOS(\" BAS033\"|TABLAS!$A$95)",null,"=+IMPORTARDATOSDINAMICOS(\" BAS040\"|TABLAS!$A$95)"]
["Recien nacido prematuro",null,{"$f":"+GETPIVOTDATA(\" BAS034\",TABLAS!$A$95)","v":16},null,null,null,null,null,null,null,null,null,null,null,null,null,null,null,null,null,null,null,null,null,null,null,null,null,null,null,null,null,null,null,null,null,null,null,34,null,41,null,null,null,null,null,null,null,null,null,null,null,null,null,null,null,null,null,null,null,null,null,null,null,null,null,null,null,null,null,null,"=+IMPORTARDATOSDINAMICOS(\" BAS034\"|TABLAS!$A$95)",null,"=+IMPORTARDATOSDINAMICOS(\" BAS041\"|TABLAS!$A$95)"]
["Recien Nacido Normal",null,{"$f":"+GETPIVOTDATA(\" BAS035\",TABLAS!$A$95)","v":647},null,null,null,null,null,null,null,null,null,null,null,null,null,null,null,null,null,null,null,null,null,null,null,null,null,null,null,null,null,null,null,null,null,null,null,35,null,42,null,null,null,null,null,null,null,null,null,null,null,null,null,null,null,null,null,null,null,null,null,null,null,null,null,null,null,null,null,null,"=+IMPORTARDATOSDINAMICOS(\" BAS035\"|TABLAS!$A$95)",null,"=+IMPORTARDATOSDINAMICOS(\" BAS042\"|TABLAS!$A$95)"]
[]
[]
["EVALUACION DEL DESARROLLO",null,null,null,null,null,null,null,null,null,null,null,null,null,null,null,null,null,null,null,null,null,null,null,"º"]
[]
["Grupo de Edad",null,"RETARDO  DEL  DESARROLLO - META",null,null,"TRANSTORNO / DEFICIT DEL  DESARROLLO "]
[null,null,null,null,null,"Diagnosticado",null,null,null,null,null,null,"Recuperado"]
[null,null,"Mensual","Acum","%","L","M","S","C","COG","Mens","%","L","M","S","C","COG","Mens","Acum","%"]
["< 1 año",null,null,null,null,{"$f":"+GETPIVOTDATA(\" BAS043\",TABLAS!$A$95)","v":0},{"$f":"+GETPIVOTDATA(\" BAS044\",TABLAS!$A$95)","v":0},{"$f":"+GETPIVOTDATA(\" BAS045\",TABLAS!$A$95)","v":0},{"$f":"+GETPIVOTDATA(\" BAS046\",TABLAS!$A$95)","v":0},{"$f":"+GETPIVOTDATA(\" BAS047\",TABLAS!$A$95)","v":0},{"$f":"SUM(F65:I65)","v":0},null,{"$f":"+GETPIVOTDATA(\" BAS048\",TABLAS!$A$95)","v":0},{"$f":"+GETPIVOTDATA(\" BAS049\",TABLAS!$A$95)","v":0},{"$f":"+GETPIVOTDATA(\" BAS050\",TABLAS!$A$95)","v":0},{"$f":"+GETPIVOTDATA(\" BAS051\",TABLAS!$A$95)","v":0},{"$f":"+GETPIVOTDATA(\" BAS052\",TABLAS!$A$95)","v":0},{"$f":"SUM(M65:P65)","v":0},null,null,null,null,null,null,null,null,null,null,null,null,null,null,null,null,null,{"$f":"+AO57+1","v":43},{"$f":"+AJ65+1","v":44},45,46,47,null,null,{"$f":"+AN65+1","v":48},{"$f":"+AQ65+1","v":49},50,51,52,null,null,null,null,null,null,null,null,null,null,null,null,null,null,null,null,null,null,null,null,null,{"$f":"IF(AJ65<10,CONCATENATE($BR$14,\"00\",AJ65,$BT$41),IF(AND(AJ65>9,AJ65<100),CONCATENATE($BR$14,\"0\",AJ65,$BT$41),IF(AJ65>99,CONCATENATE($BR$14,AJ65,$BT$41))))","v":"=+IMPORTARDATOSDINAMICOS(\" BAS043\"|TABLAS!$A$95)"},"=+IMPORTARDATOSDINAMICOS(\" BAS044\"|TABLAS!$A$95)","=+IMPORTARDATOSDINAMICOS(\" BAS045\"|TABLAS!$A$95)","=+IMPORTARDATOSDINAMICOS(\" BAS046\"|TABLAS!$A$95)","=+IMPORTARDATOSDINAMICOS(\" BAS047\"|TABLAS!$A$95)",null,null,{"$f":"IF(AQ65<10,CONCATENATE($BR$14,\"00\",AQ65,$BT$41),IF(AND(AQ65>9,AQ65<100),CONCATENATE($BR$14,\"0\",AQ65,$BT$41),IF(AQ65>99,CONCATENATE($BR$14,AQ65,$BT$41))))","v":"=+IMPORTARDATOSDINAMICOS(\" BAS048\"|TABLAS!$A$95)"},"=+IMPORTARDATOSDINAMICOS(\" BAS049\"|TABLAS!$A$95)","=+IMPORTARDATOSDINAMICOS(\" BAS050\"|TABLAS!$A$95)","=+IMPORTARDATOSDINAMICOS(\" BAS051\"|TABLAS!$A$95)","=+IMPORTARDATOSDINAMICOS(\" BAS052\"|TABLAS!$A$95)"]
["1 año",null,null,null,null,{"$f":"+GETPIVOTDATA(\" BAS053\",TABLAS!$A$95)","v":0},{"$f":"+GETPIVOTDATA(\" BAS054\",TABLAS!$A$95)","v":0},{"$f":"+GETPIVOTDATA(\" BAS055\",TABLAS!$A$95)","v":0},{"$f":"+GETPIVOTDATA(\" BAS056\",TABLAS!$A$95)","v":0},{"$f":"+GETPIVOTDATA(\" BAS057\",TABLAS!$A$95)","v":0},{"$f":"SUM(F66:I66)","v":0},null,{"$f":"+GETPIVOTDATA(\" BAS058\",TABLAS!$A$95)","v":0},{"$f":"+GETPIVOTDATA(\" BAS059\",TABLAS!$A$95)","v":0},{"$f":"+GETPIVOTDATA(\" BAS060\",TABLAS!$A$95)","v":0},{"$f":"+GETPIVOTDATA(\" BAS061\",TABLAS!$A$95)","v":0},{"$f":"+GETPIVOTDATA(\" BAS062\",TABLAS!$A$95)","v":0},{"$f":"SUM(M66:P66)","v":0},null,null,null,null,null,null,null,null,null,null,null,null,null,null,null,null,null,{"$f":"+AU65+1","v":53},54,55,56,57,null,null,58,59,60,61,62,null,null,null,null,null,null,null,null,null,null,null,null,null,null,null,null,null,null,null,null,null,"=+IMPORTARDATOSDINAMICOS(\" BAS053\"|TABLAS!$A$95)","=+IMPORTARDATOSDINAMICOS(\" BAS054\"|TABLAS!$A$95)","=+IMPORTARDATOSDINAMICOS(\" BAS055\"|TABLAS!$A$95)","=+IMPORTARDATOSDINAMICOS(\" BAS056\"|TABLAS!$A$95)","=+IMPORTARDATOSDINAMICOS(\" BAS057\"|TABLAS!$A$95)",null,null,"=+IMPORTARDATOSDINAMICOS(\" BAS058\"|TABLAS!$A$95)","=+IMPORTARDATOSDINAMICOS(\" BAS059\"|TABLAS!$A$95)","=+IMPORTARDATOSDINAMICOS(\" BAS060\"|TABLAS!$A$95)","=+IMPORTARDATOSDINAMICOS(\" BAS061\"|TABLAS!$A$95)","=+IMPORTARDATOSDINAMICOS(\" BAS062\"|TABLAS!$A$95)"]
["2 años",null,null,null,null,{"$f":"+GETPIVOTDATA(\" BAS063\",TABLAS!$A$95)","v":1},{"$f":"+GETPIVOTDATA(\" BAS064\",TABLAS!$A$95)","v":1},{"$f":"+GETPIVOTDATA(\" BAS065\",TABLAS!$A$95)","v":0},{"$f":"+GETPIVOTDATA(\" BAS066\",TABLAS!$A$95)","v":0},{"$f":"+GETPIVOTDATA(\" BAS067\",TABLAS!$A$95)","v":0},{"$f":"SUM(F67:I67)","v":2},null,{"$f":"+GETPIVOTDATA(\" BAS068\",TABLAS!$A$95)","v":0},{"$f":"+GETPIVOTDATA(\" BAS069\",TABLAS!$A$95)","v":0},{"$f":"+GETPIVOTDATA(\" BAS070\",TABLAS!$A$95)","v":0},{"$f":"+GETPIVOTDATA(\" BAS071\",TABLAS!$A$95)","v":0},{"$f":"+GETPIVOTDATA(\" BAS072\",TABLAS!$A$95)","v":0},{"$f":"SUM(M67:P67)","v":0},null,null,null,null,null,null,null,null,null,null,null,null,null,null,null,null,null,{"$f":"+AU66+1","v":63},64,65,66,67,null,null,68,69,70,71,72,null,null,null,null,null,null,null,null,null,null,null,null,null,null,null,null,null,null,null,null,null,"=+IMPORTARDATOSDINAMICOS(\" BAS063\"|TABLAS!$A$95)","=+IMPORTARDATOSDINAMICOS(\" BAS064\"|TABLAS!$A$95)","=+IMPORTARDATOSDINAMICOS(\" BAS065\"|TABLAS!$A$95)","=+IMPORTARDATOSDINAMICOS(\" BAS066\"|TABLAS!$A$95)","=+IMPORTARDATOSDINAMICOS(\" BAS067\"|TABLAS!$A$95)",null,null,"=+IMPORTARDATOSDINAMICOS(\" BAS068\"|TABLAS!$A$95)","=+IMPORTARDATOSDINAMICOS(\" BAS069\"|TABLAS!$A$95)","=+IMPORTARDATOSDINAMICOS(\" BAS070\"|TABLAS!$A$95)","=+IMPORTARDATOSDINAMICOS(\" BAS071\"|TABLAS!$A$95)","=+IMPORTARDATOSDINAMICOS(\" BAS072\"|TABLAS!$A$95)"]
["3 años",null,null,null,null,{"$f":"+GETPIVOTDATA(\" BAS073\",TABLAS!$A$95)","v":1},{"$f":"+GETPIVOTDATA(\" BAS074\",TABLAS!$A$95)","v":0},{"$f":"+GETPIVOTDATA(\" BAS075\",TABLAS!$A$95)","v":0},{"$f":"+GETPIVOTDATA(\" BAS076\",TABLAS!$A$95)","v":0},{"$f":"+GETPIVOTDATA(\" BAS077\",TABLAS!$A$95)","v":0},{"$f":"SUM(F68:I68)","v":1},null,{"$f":"+GETPIVOTDATA(\" BAS078\",TABLAS!$A$95)","v":0},{"$f":"+GETPIVOTDATA(\" BAS079\",TABLAS!$A$95)","v":0},{"$f":"+GETPIVOTDATA(\" BAS080\",TABLAS!$A$95)","v":0},{"$f":"+GETPIVOTDATA(\" BAS081\",TABLAS!$A$95)","v":0},{"$f":"+GETPIVOTDATA(\" BAS082\",TABLAS!$A$95)","v":0},{"$f":"SUM(M68:P68)","v":0},null,null,null,null,null,null,null,null,null,null,null,null,null,null,null,null,null,{"$f":"+AU67+1","v":73},74,75,76,77,null,null,78,79,80,81,82,null,null,null,null,null,null,null,null,null,null,null,null,null,null,null,null,null,null,null,null,null,"=+IMPORTARDATOSDINAMICOS(\" BAS073\"|TABLAS!$A$95)","=+IMPORTARDATOSDINAMICOS(\" BAS074\"|TABLAS!$A$95)","=+IMPORTARDATOSDINAMICOS(\" BAS075\"|TABLAS!$A$95)","=+IMPORTARDATOSDINAMICOS(\" BAS076\"|TABLAS!$A$95)","=+IMPORTARDATOSDINAMICOS(\" BAS077\"|TABLAS!$A$95)",null,null,"=+IMPORTARDATOSDINAMICOS(\" BAS078\"|TABLAS!$A$95)","=+IMPORTARDATOSDINAMICOS(\" BAS079\"|TABLAS!$A$95)","=+IMPORTARDATOSDINAMICOS(\" BAS080\"|TABLAS!$A$95)","=+IMPORTARDATOSDINAMICOS(\" BAS081\"|TABLAS!$A$95)","=+IMPORTARDATOSDINAMICOS(\" BAS082\"|TABLAS!$A$95)"]
["4 años",null,null,null,null,{"$f":"+GETPIVOTDATA(\" BAS083\",TABLAS!$A$95)","v":0},{"$f":"+GETPIVOTDATA(\" BAS084\",TABLAS!$A$95)","v":0},{"$f":"+GETPIVOTDATA(\" BAS085\",TABLAS!$A$95)","v":0},{"$f":"+GETPIVOTDATA(\" BAS086\",TABLAS!$A$95)","v":0},{"$f":"+GETPIVOTDATA(\" BAS087\",TABLAS!$A$95)","v":0},{"$f":"SUM(F69:I69)","v":0},null,{"$f":"+GETPIVOTDATA(\" BAS088\",TABLAS!$A$95)","v":0},{"$f":"+GETPIVOTDATA(\" BAS089\",TABLAS!$A$95)","v":0},{"$f":"+GETPIVOTDATA(\" BAS090\",TABLAS!$A$95)","v":0},{"$f":"+GETPIVOTDATA(\" BAS091\",TABLAS!$A$95)","v":0},{"$f":"+GETPIVOTDATA(\" BAS092\",TABLAS!$A$95)","v":0},{"$f":"SUM(M69:P69)","v":0},null,null,null,null,null,null,null,null,null,null,null,null,null,null,null,null,null,{"$f":"+AU68+1","v":83},84,85,86,87,null,null,88,89,90,91,92,null,null,null,null,null,null,null,null,null,null,null,null,null,null,null,null,null,null,null,null,null,"=+IMPORTARDATOSDINAMICOS(\" BAS083\"|TABLAS!$A$95)","=+IMPORTARDATOSDINAMICOS(\" BAS084\"|TABLAS!$A$95)","=+IMPORTARDATOSDINAMICOS(\" BAS085\"|TABLAS!$A$95)","=+IMPORTARDATOSDINAMICOS(\" BAS086\"|TABLAS!$A$95)","=+IMPORTARDATOSDINAMICOS(\" BAS087\"|TABLAS!$A$95)",null,null,"=+IMPORTARDATOSDINAMICOS(\" BAS088\"|TABLAS!$A$95)","=+IMPORTARDATOSDINAMICOS(\" BAS089\"|TABLAS!$A$95)","=+IMPORTARDATOSDINAMICOS(\" BAS090\"|TABLAS!$A$95)","=+IMPORTARDATOSDINAMICOS(\" BAS091\"|TABLAS!$A$95)","=+IMPORTARDATOSDINAMICOS(\" BAS092\"|TABLAS!$A$95)"]
["5-11 años",null,null,null,null,{"$f":"+GETPIVOTDATA(\" BAS093\",TABLAS!$A$95)","v":1},{"$f":"+GETPIVOTDATA(\" BAS094\",TABLAS!$A$95)","v":1},{"$f":"+GETPIVOTDATA(\" BAS095\",TABLAS!$A$95)","v":0},{"$f":"+GETPIVOTDATA(\" BAS096\",TABLAS!$A$95)","v":0},{"$f":"+GETPIVOTDATA(\" BAS097\",TABLAS!$A$95)","v":1},null,null,{"$f":"+GETPIVOTDATA(\" BAS098\",TABLAS!$A$95)","v":0},{"$f":"+GETPIVOTDATA(\" BAS099\",TABLAS!$A$95)","v":0},{"$f":"+GETPIVOTDATA(\" BAS100\",TABLAS!$A$95)","v":0},{"$f":"+GETPIVOTDATA(\" BAS101\",TABLAS!$A$95)","v":0},{"$f":"+GETPIVOTDATA(\" BAS102\",TABLAS!$A$95)","v":0},null,null,null,null,null,null,null,null,null,null,null,null,null,null,null,null,null,null,{"$f":"+AU69+1","v":93},94,95,96,97,null,null,98,99,100,101,102,null,null,null,null,null,null,null,null,null,null,null,null,null,null,null,null,null,null,null,null,null,"=+IMPORTARDATOSDINAMICOS(\" BAS093\"|TABLAS!$A$95)","=+IMPORTARDATOSDINAMICOS(\" BAS094\"|TABLAS!$A$95)","=+IMPORTARDATOSDINAMICOS(\" BAS095\"|TABLAS!$A$95)","=+IMPORTARDATOSDINAMICOS(\" BAS096\"|TABLAS!$A$95)","=+IMPORTARDATOSDINAMICOS(\" BAS097\"|TABLAS!$A$95)",null,null,"=+IMPORTARDATOSDINAMICOS(\" BAS098\"|TABLAS!$A$95)","=+IMPORTARDATOSDINAMICOS(\" BAS099\"|TABLAS!$A$95)","=+IMPORTARDATOSDINAMICOS(\" BAS100\"|TABLAS!$A$95)","=+IMPORTARDATOSDINAMICOS(\" BAS101\"|TABLAS!$A$95)","=+IMPORTARDATOSDINAMICOS(\" BAS102\"|TABLAS!$A$95)"]
["TOTAL",null,null,null,null,null,null,null,null,null,{"$f":"SUM(K65:K70)","v":3},null,null,null,null,null,null,{"$f":"SUM(R65:R70)","v":0}]
[null,null,null,null,null,{"$f":"+D72+1","v":1},{"$f":"+F72+1","v":2},{"$f":"+G72+1","v":3},{"$f":"+H72+1","v":4},{"$f":"+I72+1","v":5},null,null,{"$f":"+J72+1","v":6},{"$f":"+M72+1","v":7},{"$f":"+N72+1","v":8},{"$f":"+O72+1","v":9},{"$f":"+P72+1","v":10},null,null,null,null,null,null,null,null,null,null,null,null,null,null,null,null,null,null,1,{"$f":"+AJ72+1","v":2},{"$f":"+AK72+1","v":3},{"$f":"+AL72+1","v":4},{"$f":"+AM72+1","v":5},null,null,{"$f":"+AN72+1","v":6},{"$f":"+AQ72+1","v":7},{"$f":"+AR72+1","v":8},{"$f":"+AS72+1","v":9},{"$f":"+AT72+1","v":10}]
["SESIONES DE ATENCIÓN TEMPRANA (99411)"]
[]
["Edad",null,"1º\nSesion","2º\nSesion","3º\nSesion","4º\nSesion","5º\nSesion","6º\nSesion","Niño con sesiones   completas"]
[null,null,null,null,null,null,null,null,"Mensual","Acum",null,null,null,null,null,null,null,null,null,null,null,null,null,null,null,null,null,null,null,null,null,null,null,null,null,null,null,null,null,null,null,null,null,null,null,null,null,null,null,null,null,null,null,null,null,null,null,null,null,null,null,null,null,null,null,null,null,null,"d",null,null,null,null,null,"d"]
["RN ",null,{"$f":"+GETPIVOTDATA(\" BAS103\",TABLAS!$A$95)","v":316},{"$f":"+GETPIVOTDATA(\" BAS104\",TABLAS!$A$95)","v":0},{"$f":"+GETPIVOTDATA(\" BAS105\",TABLAS!$A$95)","v":0},{"$f":"+GETPIVOTDATA(\" BAS106\",TABLAS!$A$95)","v":0},{"$f":"+GETPIVOTDATA(\" BAS107\",TABLAS!$A$95)","v":0},{"$f":"+GETPIVOTDATA(\" BAS108\",TABLAS!$A$95)","v":0},{"$f":"+GETPIVOTDATA(\" BAS109\",TABLAS!$A$95)","v":0},null,null,null,null,null,null,null,null,null,null,null,null,null,null,null,null,null,null,null,null,null,null,null,null,null,null,{"$f":"+AU70+1","v":103},{"$f":"+AJ77+1","v":104},105,106,107,108,109,null,null,null,null,null,null,null,null,null,null,null,null,null,null,null,null,null,null,null,null,null,null,null,null,null,null,{"$f":"IF(AJ77<10,CONCATENATE($BR$14,\"00\",AJ77,$BT$41),IF(AND(AJ77>9,AJ77<100),CONCATENATE($BR$14,\"0\",AJ77,$BT$41),IF(AJ77>99,CONCATENATE($BR$14,AJ77,$BT$41))))","v":"=+IMPORTARDATOSDINAMICOS(\" BAS103\"|TABLAS!$A$95)"},"=+IMPORTARDATOSDINAMICOS(\" BAS104\"|TABLAS!$A$95)","=+IMPORTARDATOSDINAMICOS(\" BAS105\"|TABLAS!$A$95)","=+IMPORTARDATOSDINAMICOS(\" BAS106\"|TABLAS!$A$95)","=+IMPORTARDATOSDINAMICOS(\" BAS107\"|TABLAS!$A$95)","=+IMPORTARDATOSDINAMICOS(\" BAS108\"|TABLAS!$A$95)","=+IMPORTARDATOSDINAMICOS(\" BAS109\"|TABLAS!$A$95)","=+IMPORTARDATOSDINAMICOS(\" BAS00\"|TABLAS!$A$95)"]
["<1a",null,{"$f":"+GETPIVOTDATA(\" BAS110\",TABLAS!$A$95)","v":528},{"$f":"+GETPIVOTDATA(\" BAS111\",TABLAS!$A$95)","v":526},{"$f":"+GETPIVOTDATA(\" BAS112\",TABLAS!$A$95)","v":566},{"$f":"+GETPIVOTDATA(\" BAS113\",TABLAS!$A$95)","v":546},{"$f":"+GETPIVOTDATA(\" BAS114\",TABLAS!$A$95)","v":503},{"$f":"+GETPIVOTDATA(\" BAS115\",TABLAS!$A$95)","v":517},{"$f":"+GETPIVOTDATA(\" BAS116\",TABLAS!$A$95)","v":0},null,null,null,null,null,null,null,null,null,null,null,null,null,null,null,null,null,null,null,null,null,null,null,null,null,null,{"$f":"+AP77+1","v":110},111,112,113,114,115,116,null,null,null,null,null,null,null,null,null,null,null,null,null,null,null,null,null,null,null,null,null,null,null,null,null,null,"=+IMPORTARDATOSDINAMICOS(\" BAS110\"|TABLAS!$A$95)","=+IMPORTARDATOSDINAMICOS(\" BAS111\"|TABLAS!$A$95)","=+IMPORTARDATOSDINAMICOS(\" BAS112\"|TABLAS!$A$95)","=+IMPORTARDATOSDINAMICOS(\" BAS113\"|TABLAS!$A$95)","=+IMPORTARDATOSDINAMICOS(\" BAS114\"|TABLAS!$A$95)","=+IMPORTARDATOSDINAMICOS(\" BAS115\"|TABLAS!$A$95)","=+IMPORTARDATOSDINAMICOS(\" BAS116\"|TABLAS!$A$95)","=+IMPORTARDATOSDINAMICOS(\" BAS00\"|TABLAS!$A$95)"]
["1a",null,{"$f":"+GETPIVOTDATA(\" BAS117\",TABLAS!$A$95)","v":441},{"$f":"+GETPIVOTDATA(\" BAS118\",TABLAS!$A$95)","v":407},{"$f":"+GETPIVOTDATA(\" BAS119\",TABLAS!$A$95)","v":446},{"$f":"+GETPIVOTDATA(\" BAS120\",TABLAS!$A$95)","v":247},{"$f":"+GETPIVOTDATA(\" BAS121\",TABLAS!$A$95)","v":6},{"$f":"+GETPIVOTDATA(\" BAS122\",TABLAS!$A$95)","v":1},{"$f":"+GETPIVOTDATA(\" BAS123\",TABLAS!$A$95)","v":0},null,null,null,null,null,null,null,null,null,null,null,null,null,null,null,null,null,null,null,null,null,null,null,null,null,null,{"$f":"+AP78+1","v":117},118,119,120,121,122,123,null,null,null,null,null,null,null,null,null,null,null,null,null,null,null,null,null,null,null,null,null,null,null,null,null,null,"=+IMPORTARDATOSDINAMICOS(\" BAS117\"|TABLAS!$A$95)","=+IMPORTARDATOSDINAMICOS(\" BAS118\"|TABLAS!$A$95)","=+IMPORTARDATOSDINAMICOS(\" BAS119\"|TABLAS!$A$95)","=+IMPORTARDATOSDINAMICOS(\" BAS120\"|TABLAS!$A$95)","=+IMPORTARDATOSDINAMICOS(\" BAS121\"|TABLAS!$A$95)","=+IMPORTARDATOSDINAMICOS(\" BAS122\"|TABLAS!$A$95)","=+IMPORTARDATOSDINAMICOS(\" BAS123\"|TABLAS!$A$95)","=+IMPORTARDATOSDINAMICOS(\" BAS00\"|TABLAS!$A$95)"]
["2a",null,{"$f":"+GETPIVOTDATA(\" BAS124\",TABLAS!$A$95)","v":383},{"$f":"+GETPIVOTDATA(\" BAS125\",TABLAS!$A$95)","v":245},{"$f":"+GETPIVOTDATA(\" BAS126\",TABLAS!$A$95)","v":14},{"$f":"+GETPIVOTDATA(\" BAS127\",TABLAS!$A$95)","v":3},{"$f":"+GETPIVOTDATA(\" BAS128\",TABLAS!$A$95)","v":0},{"$f":"+GETPIVOTDATA(\" BAS129\",TABLAS!$A$95)","v":0},{"$f":"+GETPIVOTDATA(\" BAS130\",TABLAS!$A$95)","v":0},null,null,null,null,null,null,null,null,null,null,null,null,null,null,null,null,null,null,null,null,null,null,null,null,null,null,{"$f":"+AP79+1","v":124},125,126,127,128,129,130,null,null,null,null,null,null,null,null,null,null,null,null,null,null,null,null,null,null,null,null,null,null,null,null,null,null,"=+IMPORTARDATOSDINAMICOS(\" BAS124\"|TABLAS!$A$95)","=+IMPORTARDATOSDINAMICOS(\" BAS125\"|TABLAS!$A$95)","=+IMPORTARDATOSDINAMICOS(\" BAS126\"|TABLAS!$A$95)","=+IMPORTARDATOSDINAMICOS(\" BAS127\"|TABLAS!$A$95)","=+IMPORTARDATOSDINAMICOS(\" BAS128\"|TABLAS!$A$95)","=+IMPORTARDATOSDINAMICOS(\" BAS129\"|TABLAS!$A$95)","=+IMPORTARDATOSDINAMICOS(\" BAS130\"|TABLAS!$A$95)","=+IMPORTARDATOSDINAMICOS(\" BAS00\"|TABLAS!$A$95)"]
["3a",null,{"$f":"+GETPIVOTDATA(\" BAS131\",TABLAS!$A$95)","v":105},{"$f":"+GETPIVOTDATA(\" BAS132\",TABLAS!$A$95)","v":1},{"$f":"+GETPIVOTDATA(\" BAS133\",TABLAS!$A$95)","v":0},{"$f":"+GETPIVOTDATA(\" BAS134\",TABLAS!$A$95)","v":0},{"$f":"+GETPIVOTDATA(\" BAS135\",TABLAS!$A$95)","v":0},{"$f":"+GETPIVOTDATA(\" BAS136\",TABLAS!$A$95)","v":0},{"$f":"+GETPIVOTDATA(\" BAS137\",TABLAS!$A$95)","v":0},null,null,null,null,null,null,null,null,null,null,null,null,null,null,null,null,null,null,null,null,null,null,null,null,null,null,{"$f":"+AP80+1","v":131},132,133,134,135,136,137,null,null,null,null,null,null,null,null,null,null,null,null,null,null,null,null,null,null,null,null,null,null,null,null,null,null,"=+IMPORTARDATOSDINAMICOS(\" BAS131\"|TABLAS!$A$95)","=+IMPORTARDATOSDINAMICOS(\" BAS132\"|TABLAS!$A$95)","=+IMPORTARDATOSDINAMICOS(\" BAS133\"|TABLAS!$A$95)","=+IMPORTARDATOSDINAMICOS(\" BAS134\"|TABLAS!$A$95)","=+IMPORTARDATOSDINAMICOS(\" BAS135\"|TABLAS!$A$95)","=+IMPORTARDATOSDINAMICOS(\" BAS136\"|TABLAS!$A$95)","=+IMPORTARDATOSDINAMICOS(\" BAS137\"|TABLAS!$A$95)","=+IMPORTARDATOSDINAMICOS(\" BAS00\"|TABLAS!$A$95)"]
[null,null,1,{"$f":"+C82+1","v":2},{"$f":"+D82+1","v":3},{"$f":"+E82+1","v":4},{"$f":"+F82+1","v":5},{"$f":"+G82+1","v":6},null,null,null,null,null,null,null,null,null,null,null,null,null,null,null,null,null,null,null,null,null,null,null,null,null,null,null,1,2,3,4,5,6,7]
["IV.- Consejeria en la Atención del niño (a)"]
[null,null,null,null,null,null,null,null,null,null,null,null,null,null,null,null,null,null,null,null,null,null,null,null,null,null,null,null,null,null,null,null,null,null,null,null,null,null,null,null,null,null,null,null,null,null,null,null,null,null,null,null,null,null,null,null,null,null,null,null,null,null,null,null,null,null,null,null,{"$f":"+GETPIVOTDATA(\" BAS001\",TABLAS!$A$130)","v":8}]
["Tipos / Edades",null,null,null,"Total","RN","<1 año","01 año","02 años","03 años","04 años","5 años","6 años","7 años","8 años","9 años","10 años","11 años",null,null,null,null,null,null,null,null,null,null,null,null,null,null,null,null,null,null,null,null,null,null,null,null,null,null,null,null,null,null,null,null,null,null,null,null,null,null,null,null,null,null,null,null,null,null,null,null,null,null,"\"|TABLAS!$A$130)",null,null,null,null,null,null,null,null,null,null,null,"e"]
["Consejería en atención temprana del desarrollo",null,null,null,{"$f":"SUM(F86:R86)","v":59},{"$f":"+GETPIVOTDATA(\" BAS001\",TABLAS!$A$130)","v":8},{"$f":"+GETPIVOTDATA(\" BAS002\",TABLAS!$A$130)","v":29},{"$f":"+GETPIVOTDATA(\" BAS003\",TABLAS!$A$130)","v":16},{"$f":"+GETPIVOTDATA(\" BAS004\",TABLAS!$A$130)","v":0},{"$f":"+GETPIVOTDATA(\" BAS005\",TABLAS!$A$130)","v":1},{"$f":"+GETPIVOTDATA(\" BAS006\",TABLAS!$A$130)","v":2},{"$f":"+GETPIVOTDATA(\" BAS007\",TABLAS!$A$130)","v":1},{"$f":"+GETPIVOTDATA(\" BAS008\",TABLAS!$A$130)","v":1},{"$f":"+GETPIVOTDATA(\" BAS009\",TABLAS!$A$130)","v":0},{"$f":"+GETPIVOTDATA(\" BAS010\",TABLAS!$A$130)","v":0},{"$f":"+GETPIVOTDATA(\" BAS011\",TABLAS!$A$130)","v":0},{"$f":"+GETPIVOTDATA(\" BAS012\",TABLAS!$A$130)","v":1},{"$f":"+GETPIVOTDATA(\" BAS013\",TABLAS!$A$130)","v":0},null,null,null,null,null,null,null,null,null,null,null,null,null,null,null,null,null,1,{"$f":"+AJ86+1","v":2},3,4,5,6,7,8,9,10,11,12,13,null,null,null,null,null,null,null,null,null,null,null,null,null,null,null,null,null,null,null,null,{"$f":"IF(AJ86<10,CONCATENATE($BR$14,\"00\",AJ86,$BQ$85),IF(AND(AJ86>9,AJ86<100),CONCATENATE($BR$14,\"0\",AJ86,$BQ$85),IF(AJ86>99,CONCATENATE($BR$14,AJ86,$BQ$85))))","v":"=+IMPORTARDATOSDINAMICOS(\" BAS001\"|TABLAS!$A$130)"},{"$f":"IF(AK86<10,CONCATENATE($BR$14,\"00\",AK86,$BQ$85),IF(AND(AK86>9,AK86<100),CONCATENATE($BR$14,\"0\",AK86,$BQ$85),IF(AK86>99,CONCATENATE($BR$14,AK86,$BQ$85))))","v":"=+IMPORTARDATOSDINAMICOS(\" BAS002\"|TABLAS!$A$130)"},{"$f":"IF(AL86<10,CONCATENATE($BR$14,\"00\",AL86,$BQ$85),IF(AND(AL86>9,AL86<100),CONCATENATE($BR$14,\"0\",AL86,$BQ$85),IF(AL86>99,CONCATENATE($BR$14,AL86,$BQ$85))))","v":"=+IMPORTARDATOSDINAMICOS(\" BAS003\"|TABLAS!$A$130)"},{"$f":"IF(AM86<10,CONCATENATE($BR$14,\"00\",AM86,$BQ$85),IF(AND(AM86>9,AM86<100),CONCATENATE($BR$14,\"0\",AM86,$BQ$85),IF(AM86>99,CONCATENATE($BR$14,AM86,$BQ$85))))","v":"=+IMPORTARDATOSDINAMICOS(\" BAS004\"|TABLAS!$A$130)"},{"$f":"IF(AN86<10,CONCATENATE($BR$14,\"00\",AN86,$BQ$85),IF(AND(AN86>9,AN86<100),CONCATENATE($BR$14,\"0\",AN86,$BQ$85),IF(AN86>99,CONCATENATE($BR$14,AN86,$BQ$85))))","v":"=+IMPORTARDATOSDINAMICOS(\" BAS005\"|TABLAS!$A$130)"},{"$f":"IF(AO86<10,CONCATENATE($BR$14,\"00\",AO86,$BQ$85),IF(AND(AO86>9,AO86<100),CONCATENATE($BR$14,\"0\",AO86,$BQ$85),IF(AO86>99,CONCATENATE($BR$14,AO86,$BQ$85))))","v":"=+IMPORTARDATOSDINAMICOS(\" BAS006\"|TABLAS!$A$130)"},{"$f":"IF(AP86<10,CONCATENATE($BR$14,\"00\",AP86,$BQ$85),IF(AND(AP86>9,AP86<100),CONCATENATE($BR$14,\"0\",AP86,$BQ$85),IF(AP86>99,CONCATENATE($BR$14,AP86,$BQ$85))))","v":"=+IMPORTARDATOSDINAMICOS(\" BAS007\"|TABLAS!$A$130)"},{"$f":"IF(AQ86<10,CONCATENATE($BR$14,\"00\",AQ86,$BQ$85),IF(AND(AQ86>9,AQ86<100),CONCATENATE($BR$14,\"0\",AQ86,$BQ$85),IF(AQ86>99,CONCATENATE($BR$14,AQ86,$BQ$85))))","v":"=+IMPORTARDATOSDINAMICOS(\" BAS008\"|TABLAS!$A$130)"},{"$f":"IF(AR86<10,CONCATENATE($BR$14,\"00\",AR86,$BQ$85),IF(AND(AR86>9,AR86<100),CONCATENATE($BR$14,\"0\",AR86,$BQ$85),IF(AR86>99,CONCATENATE($BR$14,AR86,$BQ$85))))","v":"=+IMPORTARDATOSDINAMICOS(\" BAS009\"|TABLAS!$A$130)"},{"$f":"IF(AS86<10,CONCATENATE($BR$14,\"00\",AS86,$BQ$85),IF(AND(AS86>9,AS86<100),CONCATENATE($BR$14,\"0\",AS86,$BQ$85),IF(AS86>99,CONCATENATE($BR$14,AS86,$BQ$85))))","v":"=+IMPORTARDATOSDINAMICOS(\" BAS010\"|TABLAS!$A$130)"},{"$f":"IF(AT86<10,CONCATENATE($BR$14,\"00\",AT86,$BQ$85),IF(AND(AT86>9,AT86<100),CONCATENATE($BR$14,\"0\",AT86,$BQ$85),IF(AT86>99,CONCATENATE($BR$14,AT86,$BQ$85))))","v":"=+IMPORTARDATOSDINAMICOS(\" BAS011\"|TABLAS!$A$130)"},{"$f":"IF(AU86<10,CONCATENATE($BR$14,\"00\",AU86,$BQ$85),IF(AND(AU86>9,AU86<100),CONCATENATE($BR$14,\"0\",AU86,$BQ$85),IF(AU86>99,CONCATENATE($BR$14,AU86,$BQ$85))))","v":"=+IMPORTARDATOSDINAMICOS(\" BAS012\"|TABLAS!$A$130)"},{"$f":"IF(AV86<10,CONCATENATE($BR$14,\"00\",AV86,$BQ$85),IF(AND(AV86>9,AV86<100),CONCATENATE($BR$14,\"0\",AV86,$BQ$85),IF(AV86>99,CONCATENATE($BR$14,AV86,$BQ$85))))","v":"=+IMPORTARDATOSDINAMICOS(\" BAS013\"|TABLAS!$A$130)"}]
["Consejería en inmunizaciones",null,null,null,{"$f":"SUM(F87:R87)","v":1945},{"$f":"+GETPIVOTDATA(\" BAS014\",TABLAS!$A$130)","v":349},{"$f":"+GETPIVOTDATA(\" BAS015\",TABLAS!$A$130)","v":992},{"$f":"+GETPIVOTDATA(\" BAS016\",TABLAS!$A$130)","v":497},{"$f":"+GETPIVOTDATA(\" BAS017\",TABLAS!$A$130)","v":27},{"$f":"+GETPIVOTDATA(\" BAS018\",TABLAS!$A$130)","v":22},{"$f":"+GETPIVOTDATA(\" BAS019\",TABLAS!$A$130)","v":52},{"$f":"+GETPIVOTDATA(\" BAS020\",TABLAS!$A$130)","v":1},{"$f":"+GETPIVOTDATA(\" BAS021\",TABLAS!$A$130)","v":3},{"$f":"+GETPIVOTDATA(\" BAS022\",TABLAS!$A$130)","v":1},{"$f":"+GETPIVOTDATA(\" BAS023\",TABLAS!$A$130)","v":0},{"$f":"+GETPIVOTDATA(\" BAS024\",TABLAS!$A$130)","v":0},{"$f":"+GETPIVOTDATA(\" BAS025\",TABLAS!$A$130)","v":1},{"$f":"+GETPIVOTDATA(\" BAS026\",TABLAS!$A$130)","v":0},null,null,null,null,null,null,null,null,null,null,null,null,null,null,null,null,null,{"$f":"+AV86+1","v":14},{"$f":"+AJ87+1","v":15},16,17,18,19,20,21,22,23,24,25,26,null,null,null,null,null,null,null,null,null,null,null,null,null,null,null,null,null,null,null,null,"=+IMPORTARDATOSDINAMICOS(\" BAS014\"|TABLAS!$A$130)","=+IMPORTARDATOSDINAMICOS(\" BAS015\"|TABLAS!$A$130)","=+IMPORTARDATOSDINAMICOS(\" BAS016\"|TABLAS!$A$130)","=+IMPORTARDATOSDINAMICOS(\" BAS017\"|TABLAS!$A$130)","=+IMPORTARDATOSDINAMICOS(\" BAS018\"|TABLAS!$A$130)","=+IMPORTARDATOSDINAMICOS(\" BAS019\"|TABLAS!$A$130)","=+IMPORTARDATOSDINAMICOS(\" BAS020\"|TABLAS!$A$130)","=+IMPORTARDATOSDINAMICOS(\" BAS021\"|TABLAS!$A$130)","=+IMPORTARDATOSDINAMICOS(\" BAS022\"|TABLAS!$A$130)","=+IMPORTARDATOSDINAMICOS(\" BAS023\"|TABLAS!$A$130)","=+IMPORTARDATOSDINAMICOS(\" BAS024\"|TABLAS!$A$130)","=+IMPORTARDATOSDINAMICOS(\" BAS025\"|TABLAS!$A$130)","=+IMPORTARDATOSDINAMICOS(\" BAS026\"|TABLAS!$A$130)"]
["Consejería de identificación de signos de alarma",null,null,null,1130,{"$f":"+GETPIVOTDATA(\" BAS027\",TABLAS!$A$130)","v":784},{"$f":"+GETPIVOTDATA(\" BAS028\",TABLAS!$A$130)","v":215},{"$f":"+GETPIVOTDATA(\" BAS029\",TABLAS!$A$130)","v":69},{"$f":"+GETPIVOTDATA(\" BAS030\",TABLAS!$A$130)","v":17},{"$f":"+GETPIVOTDATA(\" BAS031\",TABLAS!$A$130)","v":15},{"$f":"+GETPIVOTDATA(\" BAS032\",TABLAS!$A$130)","v":15},{"$f":"+GETPIVOTDATA(\" BAS033\",TABLAS!$A$130)","v":6},{"$f":"+GETPIVOTDATA(\" BAS034\",TABLAS!$A$130)","v":1},{"$f":"+GETPIVOTDATA(\" BAS035\",TABLAS!$A$130)","v":3},{"$f":"+GETPIVOTDATA(\" BAS036\",TABLAS!$A$130)","v":1},{"$f":"+GETPIVOTDATA(\" BAS037\",TABLAS!$A$130)","v":1},{"$f":"+GETPIVOTDATA(\" BAS038\",TABLAS!$A$130)","v":2},{"$f":"+GETPIVOTDATA(\" BAS039\",TABLAS!$A$130)","v":1},null,null,null,null,null,null,null,null,null,null,null,null,null,null,null,null,null,27,{"$f":"+AJ88+1","v":28},29,30,31,32,33,34,35,36,37,38,39,null,null,null,null,null,null,null,null,null,null,null,null,null,null,null,null,null,null,null,null,"=+IMPORTARDATOSDINAMICOS(\" BAS027\"|TABLAS!$A$130)","=+IMPORTARDATOSDINAMICOS(\" BAS028\"|TABLAS!$A$130)","=+IMPORTARDATOSDINAMICOS(\" BAS029\"|TABLAS!$A$130)","=+IMPORTARDATOSDINAMICOS(\" BAS030\"|TABLAS!$A$130)","=+IMPORTARDATOSDINAMICOS(\" BAS031\"|TABLAS!$A$130)","=+IMPORTARDATOSDINAMICOS(\" BAS032\"|TABLAS!$A$130)","=+IMPORTARDATOSDINAMICOS(\" BAS033\"|TABLAS!$A$130)","=+IMPORTARDATOSDINAMICOS(\" BAS034\"|TABLAS!$A$130)","=+IMPORTARDATOSDINAMICOS(\" BAS035\"|TABLAS!$A$130)","=+IMPORTARDATOSDINAMICOS(\" BAS036\"|TABLAS!$A$130)","=+IMPORTARDATOSDINAMICOS(\" BAS037\"|TABLAS!$A$130)","=+IMPORTARDATOSDINAMICOS(\" BAS038\"|TABLAS!$A$130)","=+IMPORTARDATOSDINAMICOS(\" BAS039\"|TABLAS!$A$130)"]
["Consejería para la prevención de muerte súbita del lactante",null,null,null,19,{"$f":"+GETPIVOTDATA(\" BAS040\",TABLAS!$A$130)","v":3},{"$f":"+GETPIVOTDATA(\" BAS041\",TABLAS!$A$130)","v":3},{"$f":"+GETPIVOTDATA(\" BAS042\",TABLAS!$A$130)","v":2},{"$f":"+GETPIVOTDATA(\" BAS043\",TABLAS!$A$130)","v":1},{"$f":"+GETPIVOTDATA(\" BAS044\",TABLAS!$A$130)","v":2},{"$f":"+GETPIVOTDATA(\" BAS045\",TABLAS!$A$130)","v":4},{"$f":"+GETPIVOTDATA(\" BAS046\",TABLAS!$A$130)","v":1},{"$f":"+GETPIVOTDATA(\" BAS047\",TABLAS!$A$130)","v":1},{"$f":"+GETPIVOTDATA(\" BAS048\",TABLAS!$A$130)","v":1},{"$f":"+GETPIVOTDATA(\" BAS049\",TABLAS!$A$130)","v":0},{"$f":"+GETPIVOTDATA(\" BAS050\",TABLAS!$A$130)","v":1},{"$f":"+GETPIVOTDATA(\" BAS051\",TABLAS!$A$130)","v":0},{"$f":"+GETPIVOTDATA(\" BAS052\",TABLAS!$A$130)","v":0},null,null,null,null,null,null,null,null,null,null,null,null,null,null,null,null,null,40,{"$f":"+AJ89+1","v":41},42,43,44,45,46,47,48,49,50,51,52,null,null,null,null,null,null,null,null,null,null,null,null,null,null,null,null,null,null,null,null,"=+IMPORTARDATOSDINAMICOS(\" BAS040\"|TABLAS!$A$130)","=+IMPORTARDATOSDINAMICOS(\" BAS041\"|TABLAS!$A$130)","=+IMPORTARDATOSDINAMICOS(\" BAS042\"|TABLAS!$A$130)","=+IMPORTARDATOSDINAMICOS(\" BAS043\"|TABLAS!$A$130)","=+IMPORTARDATOSDINAMICOS(\" BAS044\"|TABLAS!$A$130)","=+IMPORTARDATOSDINAMICOS(\" BAS045\"|TABLAS!$A$130)","=+IMPORTARDATOSDINAMICOS(\" BAS046\"|TABLAS!$A$130)","=+IMPORTARDATOSDINAMICOS(\" BAS047\"|TABLAS!$A$130)","=+IMPORTARDATOSDINAMICOS(\" BAS048\"|TABLAS!$A$130)","=+IMPORTARDATOSDINAMICOS(\" BAS049\"|TABLAS!$A$130)","=+IMPORTARDATOSDINAMICOS(\" BAS050\"|TABLAS!$A$130)","=+IMPORTARDATOSDINAMICOS(\" BAS051\"|TABLAS!$A$130)","=+IMPORTARDATOSDINAMICOS(\" BAS052\"|TABLAS!$A$130)"]
["Consejería para la prevención de enfermedades prevalentes (EDA, IRA, entre otras)",null,null,null,153,{"$f":"+GETPIVOTDATA(\" BAS053\",TABLAS!$A$130)","v":3},{"$f":"+GETPIVOTDATA(\" BAS054\",TABLAS!$A$130)","v":72},{"$f":"+GETPIVOTDATA(\" BAS055\",TABLAS!$A$130)","v":49},{"$f":"+GETPIVOTDATA(\" BAS056\",TABLAS!$A$130)","v":5},{"$f":"+GETPIVOTDATA(\" BAS057\",TABLAS!$A$130)","v":5},{"$f":"+GETPIVOTDATA(\" BAS058\",TABLAS!$A$130)","v":12},{"$f":"+GETPIVOTDATA(\" BAS059\",TABLAS!$A$130)","v":4},{"$f":"+GETPIVOTDATA(\" BAS060\",TABLAS!$A$130)","v":2},{"$f":"+GETPIVOTDATA(\" BAS061\",TABLAS!$A$130)","v":0},{"$f":"+GETPIVOTDATA(\" BAS062\",TABLAS!$A$130)","v":1},{"$f":"+GETPIVOTDATA(\" BAS063\",TABLAS!$A$130)","v":0},{"$f":"+GETPIVOTDATA(\" BAS064\",TABLAS!$A$130)","v":0},{"$f":"+GETPIVOTDATA(\" BAS065\",TABLAS!$A$130)","v":0},null,null,null,null,null,null,null,null,null,null,null,null,null,null,null,null,null,53,{"$f":"+AJ90+1","v":54},55,56,57,58,59,60,61,62,63,64,65,null,null,null,null,null,null,null,null,null,null,null,null,null,null,null,null,null,null,null,null,"=+IMPORTARDATOSDINAMICOS(\" BAS053\"|TABLAS!$A$130)","=+IMPORTARDATOSDINAMICOS(\" BAS054\"|TABLAS!$A$130)","=+IMPORTARDATOSDINAMICOS(\" BAS055\"|TABLAS!$A$130)","=+IMPORTARDATOSDINAMICOS(\" BAS056\"|TABLAS!$A$130)","=+IMPORTARDATOSDINAMICOS(\" BAS057\"|TABLAS!$A$130)","=+IMPORTARDATOSDINAMICOS(\" BAS058\"|TABLAS!$A$130)","=+IMPORTARDATOSDINAMICOS(\" BAS059\"|TABLAS!$A$130)","=+IMPORTARDATOSDINAMICOS(\" BAS060\"|TABLAS!$A$130)","=+IMPORTARDATOSDINAMICOS(\" BAS061\"|TABLAS!$A$130)","=+IMPORTARDATOSDINAMICOS(\" BAS062\"|TABLAS!$A$130)","=+IMPORTARDATOSDINAMICOS(\" BAS063\"|TABLAS!$A$130)","=+IMPORTARDATOSDINAMICOS(\" BAS064\"|TABLAS!$A$130)","=+IMPORTARDATOSDINAMICOS(\" BAS065\"|TABLAS!$A$130)"]
["Consejería en salud ocular",null,null,null,615,{"$f":"+GETPIVOTDATA(\" BAS066\",TABLAS!$A$130)","v":0},{"$f":"+GETPIVOTDATA(\" BAS067\",TABLAS!$A$130)","v":3},{"$f":"+GETPIVOTDATA(\" BAS068\",TABLAS!$A$130)","v":8},{"$f":"+GETPIVOTDATA(\" BAS069\",TABLAS!$A$130)","v":6},{"$f":"+GETPIVOTDATA(\" BAS070\",TABLAS!$A$130)","v":46},{"$f":"+GETPIVOTDATA(\" BAS071\",TABLAS!$A$130)","v":31},{"$f":"+GETPIVOTDATA(\" BAS072\",TABLAS!$A$130)","v":30},{"$f":"+GETPIVOTDATA(\" BAS073\",TABLAS!$A$130)","v":66},{"$f":"+GETPIVOTDATA(\" BAS074\",TABLAS!$A$130)","v":69},{"$f":"+GETPIVOTDATA(\" BAS075\",TABLAS!$A$130)","v":74},{"$f":"+GETPIVOTDATA(\" BAS076\",TABLAS!$A$130)","v":86},{"$f":"+GETPIVOTDATA(\" BAS077\",TABLAS!$A$130)","v":109},{"$f":"+GETPIVOTDATA(\" BAS078\",TABLAS!$A$130)","v":87},null,null,null,null,null,null,null,null,null,null,null,null,null,null,null,null,null,66,{"$f":"+AJ91+1","v":67},68,69,70,71,72,73,74,75,76,77,78,null,null,null,null,null,null,null,null,null,null,null,null,null,null,null,null,null,null,null,null,"=+IMPORTARDATOSDINAMICOS(\" BAS066\"|TABLAS!$A$130)","=+IMPORTARDATOSDINAMICOS(\" BAS067\"|TABLAS!$A$130)","=+IMPORTARDATOSDINAMICOS(\" BAS068\"|TABLAS!$A$130)","=+IMPORTARDATOSDINAMICOS(\" BAS069\"|TABLAS!$A$130)","=+IMPORTARDATOSDINAMICOS(\" BAS070\"|TABLAS!$A$130)","=+IMPORTARDATOSDINAMICOS(\" BAS071\"|TABLAS!$A$130)","=+IMPORTARDATOSDINAMICOS(\" BAS072\"|TABLAS!$A$130)","=+IMPORTARDATOSDINAMICOS(\" BAS073\"|TABLAS!$A$130)","=+IMPORTARDATOSDINAMICOS(\" BAS074\"|TABLAS!$A$130)","=+IMPORTARDATOSDINAMICOS(\" BAS075\"|TABLAS!$A$130)","=+IMPORTARDATOSDINAMICOS(\" BAS076\"|TABLAS!$A$130)","=+IMPORTARDATOSDINAMICOS(\" BAS077\"|TABLAS!$A$130)","=+IMPORTARDATOSDINAMICOS(\" BAS078\"|TABLAS!$A$130)"]
["Consejería en higiene de manos",null,null,null,520,{"$f":"+GETPIVOTDATA(\" BAS079\",TABLAS!$A$130)","v":40},{"$f":"+GETPIVOTDATA(\" BAS080\",TABLAS!$A$130)","v":110},{"$f":"+GETPIVOTDATA(\" BAS081\",TABLAS!$A$130)","v":91},{"$f":"+GETPIVOTDATA(\" BAS082\",TABLAS!$A$130)","v":53},{"$f":"+GETPIVOTDATA(\" BAS083\",TABLAS!$A$130)","v":95},{"$f":"+GETPIVOTDATA(\" BAS084\",TABLAS!$A$130)","v":79},{"$f":"+GETPIVOTDATA(\" BAS085\",TABLAS!$A$130)","v":11},{"$f":"+GETPIVOTDATA(\" BAS086\",TABLAS!$A$130)","v":10},{"$f":"+GETPIVOTDATA(\" BAS087\",TABLAS!$A$130)","v":6},{"$f":"+GETPIVOTDATA(\" BAS088\",TABLAS!$A$130)","v":4},{"$f":"+GETPIVOTDATA(\" BAS089\",TABLAS!$A$130)","v":11},{"$f":"+GETPIVOTDATA(\" BAS090\",TABLAS!$A$130)","v":8},{"$f":"+GETPIVOTDATA(\" BAS091\",TABLAS!$A$130)","v":2},null,null,null,null,null,null,null,null,null,null,null,null,null,null,null,null,null,79,{"$f":"+AJ92+1","v":80},81,82,83,84,85,86,87,88,89,90,91,null,null,null,null,null,null,null,null,null,null,null,null,null,null,null,null,null,null,null,null,"=+IMPORTARDATOSDINAMICOS(\" BAS079\"|TABLAS!$A$130)","=+IMPORTARDATOSDINAMICOS(\" BAS080\"|TABLAS!$A$130)","=+IMPORTARDATOSDINAMICOS(\" BAS081\"|TABLAS!$A$130)","=+IMPORTARDATOSDINAMICOS(\" BAS082\"|TABLAS!$A$130)","=+IMPORTARDATOSDINAMICOS(\" BAS083\"|TABLAS!$A$130)","=+IMPORTARDATOSDINAMICOS(\" BAS084\"|TABLAS!$A$130)","=+IMPORTARDATOSDINAMICOS(\" BAS085\"|TABLAS!$A$130)","=+IMPORTARDATOSDINAMICOS(\" BAS086\"|TABLAS!$A$130)","=+IMPORTARDATOSDINAMICOS(\" BAS087\"|TABLAS!$A$130)","=+IMPORTARDATOSDINAMICOS(\" BAS088\"|TABLAS!$A$130)","=+IMPORTARDATOSDINAMICOS(\" BAS089\"|TABLAS!$A$130)","=+IMPORTARDATOSDINAMICOS(\" BAS090\"|TABLAS!$A$130)","=+IMPORTARDATOSDINAMICOS(\" BAS091\"|TABLAS!$A$130)"]
["Consejería en pautas de crianza, buen trato, comunicación y cuidados adecuados",null,null,null,1459,{"$f":"+GETPIVOTDATA(\" BAS092\",TABLAS!$A$130)","v":107},{"$f":"+GETPIVOTDATA(\" BAS093\",TABLAS!$A$130)","v":363},{"$f":"+GETPIVOTDATA(\" BAS094\",TABLAS!$A$130)","v":338},{"$f":"+GETPIVOTDATA(\" BAS095\",TABLAS!$A$130)","v":272},{"$f":"+GETPIVOTDATA(\" BAS096\",TABLAS!$A$130)","v":219},{"$f":"+GETPIVOTDATA(\" BAS097\",TABLAS!$A$130)","v":131},{"$f":"+GETPIVOTDATA(\" BAS098\",TABLAS!$A$130)","v":19},{"$f":"+GETPIVOTDATA(\" BAS099\",TABLAS!$A$130)","v":2},{"$f":"+GETPIVOTDATA(\" BAS100\",TABLAS!$A$130)","v":2},{"$f":"+GETPIVOTDATA(\" BAS101\",TABLAS!$A$130)","v":1},{"$f":"+GETPIVOTDATA(\" BAS102\",TABLAS!$A$130)","v":1},{"$f":"+GETPIVOTDATA(\" BAS103\",TABLAS!$A$130)","v":2},{"$f":"+GETPIVOTDATA(\" BAS104\",TABLAS!$A$130)","v":2},null,null,null,null,null,null,null,null,null,null,null,null,null,null,null,null,null,92,{"$f":"+AJ93+1","v":93},94,95,96,97,98,99,100,101,102,103,104,null,null,null,null,null,null,null,null,null,null,null,null,null,null,null,null,null,null,null,null,"=+IMPORTARDATOSDINAMICOS(\" BAS092\"|TABLAS!$A$130)","=+IMPORTARDATOSDINAMICOS(\" BAS093\"|TABLAS!$A$130)","=+IMPORTARDATOSDINAMICOS(\" BAS094\"|TABLAS!$A$130)","=+IMPORTARDATOSDINAMICOS(\" BAS095\"|TABLAS!$A$130)","=+IMPORTARDATOSDINAMICOS(\" BAS096\"|TABLAS!$A$130)","=+IMPORTARDATOSDINAMICOS(\" BAS097\"|TABLAS!$A$130)","=+IMPORTARDATOSDINAMICOS(\" BAS098\"|TABLAS!$A$130)","=+IMPORTARDATOSDINAMICOS(\" BAS099\"|TABLAS!$A$130)","=+IMPORTARDATOSDINAMICOS(\" BAS100\"|TABLAS!$A$130)","=+IMPORTARDATOSDINAMICOS(\" BAS101\"|TABLAS!$A$130)","=+IMPORTARDATOSDINAMICOS(\" BAS102\"|TABLAS!$A$130)","=+IMPORTARDATOSDINAMICOS(\" BAS103\"|TABLAS!$A$130)","=+IMPORTARDATOSDINAMICOS(\" BAS104\"|TABLAS!$A$130)"]
["Consejería nutricional: Alimentación saludable",null,null,null,19652,{"$f":"+GETPIVOTDATA(\" BAS105\",TABLAS!$A$130)","v":95},{"$f":"+GETPIVOTDATA(\" BAS106\",TABLAS!$A$130)","v":4670},{"$f":"+GETPIVOTDATA(\" BAS107\",TABLAS!$A$130)","v":4757},{"$f":"+GETPIVOTDATA(\" BAS108\",TABLAS!$A$130)","v":3416},{"$f":"+GETPIVOTDATA(\" BAS109\",TABLAS!$A$130)","v":2514},{"$f":"+GETPIVOTDATA(\" BAS110\",TABLAS!$A$130)","v":2228},{"$f":"+GETPIVOTDATA(\" BAS111\",TABLAS!$A$130)","v":627},{"$f":"+GETPIVOTDATA(\" BAS112\",TABLAS!$A$130)","v":326},{"$f":"+GETPIVOTDATA(\" BAS113\",TABLAS!$A$130)","v":214},{"$f":"+GETPIVOTDATA(\" BAS114\",TABLAS!$A$130)","v":195},{"$f":"+GETPIVOTDATA(\" BAS115\",TABLAS!$A$130)","v":204},{"$f":"+GETPIVOTDATA(\" BAS116\",TABLAS!$A$130)","v":231},{"$f":"+GETPIVOTDATA(\" BAS117\",TABLAS!$A$130)","v":175},null,null,null,null,null,null,null,null,null,null,null,null,null,null,null,null,null,105,{"$f":"+AJ94+1","v":106},107,108,109,110,111,112,113,114,115,116,117,null,null,null,null,null,null,null,null,null,null,null,null,null,null,null,null,null,null,null,null,"=+IMPORTARDATOSDINAMICOS(\" BAS105\"|TABLAS!$A$130)","=+IMPORTARDATOSDINAMICOS(\" BAS106\"|TABLAS!$A$130)","=+IMPORTARDATOSDINAMICOS(\" BAS107\"|TABLAS!$A$130)","=+IMPORTARDATOSDINAMICOS(\" BAS108\"|TABLAS!$A$130)","=+IMPORTARDATOSDINAMICOS(\" BAS109\"|TABLAS!$A$130)","=+IMPORTARDATOSDINAMICOS(\" BAS110\"|TABLAS!$A$130)","=+IMPORTARDATOSDINAMICOS(\" BAS111\"|TABLAS!$A$130)","=+IMPORTARDATOSDINAMICOS(\" BAS112\"|TABLAS!$A$130)","=+IMPORTARDATOSDINAMICOS(\" BAS113\"|TABLAS!$A$130)","=+IMPORTARDATOSDINAMICOS(\" BAS114\"|TABLAS!$A$130)","=+IMPORTARDATOSDINAMICOS(\" BAS115\"|TABLAS!$A$130)","=+IMPORTARDATOSDINAMICOS(\" BAS116\"|TABLAS!$A$130)","=+IMPORTARDATOSDINAMICOS(\" BAS117\"|TABLAS!$A$130)"]
["Consejería en Lactancia Materna Exclusiva hasta los 06 meses",null,null,null,5708,{"$f":"+GETPIVOTDATA(\" BAS118\",TABLAS!$A$130)","v":3075},{"$f":"+GETPIVOTDATA(\" BAS119\",TABLAS!$A$130)","v":2565},{"$f":"+GETPIVOTDATA(\" BAS120\",TABLAS!$A$130)","v":23},{"$f":"+GETPIVOTDATA(\" BAS121\",TABLAS!$A$130)","v":16},{"$f":"+GETPIVOTDATA(\" BAS122\",TABLAS!$A$130)","v":4},{"$f":"+GETPIVOTDATA(\" BAS123\",TABLAS!$A$130)","v":6},{"$f":"+GETPIVOTDATA(\" BAS124\",TABLAS!$A$130)","v":8},{"$f":"+GETPIVOTDATA(\" BAS125\",TABLAS!$A$130)","v":6},{"$f":"+GETPIVOTDATA(\" BAS126\",TABLAS!$A$130)","v":1},{"$f":"+GETPIVOTDATA(\" BAS127\",TABLAS!$A$130)","v":3},{"$f":"+GETPIVOTDATA(\" BAS128\",TABLAS!$A$130)","v":0},{"$f":"+GETPIVOTDATA(\" BAS129\",TABLAS!$A$130)","v":1},{"$f":"+GETPIVOTDATA(\" BAS130\",TABLAS!$A$130)","v":0},null,null,null,null,null,null,null,null,null,null,null,null,null,null,null,null,null,118,{"$f":"+AJ95+1","v":119},120,121,122,123,124,125,126,127,128,129,130,null,null,null,null,null,null,null,null,null,null,null,null,null,null,null,null,null,null,null,null,"=+IMPORTARDATOSDINAMICOS(\" BAS118\"|TABLAS!$A$130)","=+IMPORTARDATOSDINAMICOS(\" BAS119\"|TABLAS!$A$130)","=+IMPORTARDATOSDINAMICOS(\" BAS120\"|TABLAS!$A$130)","=+IMPORTARDATOSDINAMICOS(\" BAS121\"|TABLAS!$A$130)","=+IMPORTARDATOSDINAMICOS(\" BAS122\"|TABLAS!$A$130)","=+IMPORTARDATOSDINAMICOS(\" BAS123\"|TABLAS!$A$130)","=+IMPORTARDATOSDINAMICOS(\" BAS124\"|TABLAS!$A$130)","=+IMPORTARDATOSDINAMICOS(\" BAS125\"|TABLAS!$A$130)","=+IMPORTARDATOSDINAMICOS(\" BAS126\"|TABLAS!$A$130)","=+IMPORTARDATOSDINAMICOS(\" BAS127\"|TABLAS!$A$130)","=+IMPORTARDATOSDINAMICOS(\" BAS128\"|TABLAS!$A$130)","=+IMPORTARDATOSDINAMICOS(\" BAS129\"|TABLAS!$A$130)","=+IMPORTARDATOSDINAMICOS(\" BAS130\"|TABLAS!$A$130)"]
[null,null,null,null,null,1,{"$f":"+F96+1","v":2},3,4,5,6,7,8,9,10,11,12,13,null,null,null,null,null,null,null,null,null,null,null,null,null,null,null,null,null,1,{"$f":"+AJ96+1","v":2},3,4,5,6,7,8,9,10,11,12,13]
[]
[]
[]
[]
["V. EVALUACIÓN DEL  ESTADO NUTRICIONAL "]
[]
["GRUPO DE EDAD",null,"Riesgo Nutricional",null,null,null,"Desnutrición Aguda \nE44.0",null,"Desnutrición Crónica \nE45",null,"Desnutrición Severa  \nE43",null,"Exceso"]
[null,null,"Ganancia Inadecuada de Peso(Z72.4)",null,"Ganancia Inadecuada de  Talla(Z72.4)",null,null,null,null,null,null,null,"Sobre Peso    P/T (E66.90)",null,"Obeso  (E66.9)"]
[null,null,"Diagnosticado","Recuperado","Diagnosticado","Recuperado","DX","Rec.","DX","Rec.","DX","Rec.","DX","Rec.","DX","Rec."]
[null,null,"P/E","P/E","T/E","T/E","P/T","P/T","T/E","T/E","P/E","P/E",null,null,null,null,null,null,null,null,null,null,null,null,null,null,null,null,null,null,null,null,null,null,null,null,null,null,null,null,null,null,null,null,null,null,null,null,null,null,null,null,null,null,null,null,null,null,null,null,null,null,null,null,null,null,null,null,"d",null,null,null,null,null,null,null,null,null,null,null,null,"f"]
["Recien Nacido>2500gr   ",null,{"$error":"#REF!"}]
["Recien Nacido de  Bajo peso "]
["< 1 año",null,{"$f":"+GETPIVOTDATA(\" BAS131\",TABLAS!$A$130)","v":42},{"$f":"+GETPIVOTDATA(\" BAS132\",TABLAS!$A$130)","v":16},{"$f":"+GETPIVOTDATA(\" BAS133\",TABLAS!$A$130)","v":24},{"$f":"+GETPIVOTDATA(\" BAS134\",TABLAS!$A$130)","v":11},{"$f":"+GETPIVOTDATA(\" BAS135\",TABLAS!$A$130)","v":0},{"$f":"+GETPIVOTDATA(\" BAS136\",TABLAS!$A$130)","v":11},{"$f":"+GETPIVOTDATA(\" BAS137\",TABLAS!$A$130)","v":58},{"$f":"+GETPIVOTDATA(\" BAS138\",TABLAS!$A$130)","v":1},{"$f":"+GETPIVOTDATA(\" BAS139\",TABLAS!$A$130)","v":0},{"$f":"+GETPIVOTDATA(\" BAS140\",TABLAS!$A$130)","v":0},{"$f":"+GETPIVOTDATA(\" BAS141\",TABLAS!$A$130)","v":104},{"$f":"+GETPIVOTDATA(\" BAS142\",TABLAS!$A$130)","v":0},{"$f":"+GETPIVOTDATA(\" BAS143\",TABLAS!$A$130)","v":13},{"$f":"+GETPIVOTDATA(\" BAS144\",TABLAS!$A$130)","v":0},null,null,null,null,null,null,null,null,null,null,null,null,null,null,null,null,null,null,null,{"$f":"+AV95+1","v":131},{"$f":"+AJ109+1","v":132},133,134,135,136,137,138,139,140,141,142,143,144,null,null,null,null,null,null,null,null,null,null,null,null,null,null,null,null,null,null,null,{"$f":"IF(AJ109<10,CONCATENATE($BR$14,\"00\",AJ109,$BQ$85),IF(AND(AJ109>9,AJ109<100),CONCATENATE($BR$14,\"0\",AJ109,$BQ$85),IF(AJ109>99,CONCATENATE($BR$14,AJ109,$BQ$85))))","v":"=+IMPORTARDATOSDINAMICOS(\" BAS131\"|TABLAS!$A$130)"},"=+IMPORTARDATOSDINAMICOS(\" BAS132\"|TABLAS!$A$130)","=+IMPORTARDATOSDINAMICOS(\" BAS133\"|TABLAS!$A$130)","=+IMPORTARDATOSDINAMICOS(\" BAS134\"|TABLAS!$A$130)","=+IMPORTARDATOSDINAMICOS(\" BAS135\"|TABLAS!$A$130)","=+IMPORTARDATOSDINAMICOS(\" BAS136\"|TABLAS!$A$130)","=+IMPORTARDATOSDINAMICOS(\" BAS137\"|TABLAS!$A$130)","=+IMPORTARDATOSDINAMICOS(\" BAS138\"|TABLAS!$A$130)","=+IMPORTARDATOSDINAMICOS(\" BAS139\"|TABLAS!$A$130)","=+IMPORTARDATOSDINAMICOS(\" BAS140\"|TABLAS!$A$130)","=+IMPORTARDATOSDINAMICOS(\" BAS141\"|TABLAS!$A$130)","=+IMPORTARDATOSDINAMICOS(\" BAS142\"|TABLAS!$A$130)","=+IMPORTARDATOSDINAMICOS(\" BAS143\"|TABLAS!$A$130)","=+IMPORTARDATOSDINAMICOS(\" BAS144\"|TABLAS!$A$130)"]
["1 año",null,{"$f":"+GETPIVOTDATA(\" BAS145\",TABLAS!$A$130)","v":36},{"$f":"+GETPIVOTDATA(\" BAS146\",TABLAS!$A$130)","v":3},{"$f":"+GETPIVOTDATA(\" BAS147\",TABLAS!$A$130)","v":21},{"$f":"+GETPIVOTDATA(\" BAS148\",TABLAS!$A$130)","v":5},{"$f":"+GETPIVOTDATA(\" BAS149\",TABLAS!$A$130)","v":0},{"$f":"+GETPIVOTDATA(\" BAS150\",TABLAS!$A$130)","v":0},{"$f":"+GETPIVOTDATA(\" BAS151\",TABLAS!$A$130)","v":50},{"$f":"+GETPIVOTDATA(\" BAS152\",TABLAS!$A$130)","v":1},{"$f":"+GETPIVOTDATA(\" BAS153\",TABLAS!$A$130)","v":0},{"$f":"+GETPIVOTDATA(\" BAS154\",TABLAS!$A$130)","v":0},{"$f":"+GETPIVOTDATA(\" BAS155\",TABLAS!$A$130)","v":40},{"$f":"+GETPIVOTDATA(\" BAS156\",TABLAS!$A$130)","v":0},{"$f":"+GETPIVOTDATA(\" BAS157\",TABLAS!$A$130)","v":11},{"$f":"+GETPIVOTDATA(\" BAS158\",TABLAS!$A$130)","v":0},null,null,null,null,null,null,null,null,null,null,null,null,null,null,null,null,null,null,null,{"$f":"+AW109+1","v":145},{"$f":"+AJ110+1","v":146},147,148,149,150,151,152,153,154,155,156,157,158,null,null,null,null,null,null,null,null,null,null,null,null,null,null,null,null,null,null,null,"=+IMPORTARDATOSDINAMICOS(\" BAS145\"|TABLAS!$A$130)","=+IMPORTARDATOSDINAMICOS(\" BAS146\"|TABLAS!$A$130)","=+IMPORTARDATOSDINAMICOS(\" BAS147\"|TABLAS!$A$130)","=+IMPORTARDATOSDINAMICOS(\" BAS148\"|TABLAS!$A$130)","=+IMPORTARDATOSDINAMICOS(\" BAS149\"|TABLAS!$A$130)","=+IMPORTARDATOSDINAMICOS(\" BAS150\"|TABLAS!$A$130)","=+IMPORTARDATOSDINAMICOS(\" BAS151\"|TABLAS!$A$130)","=+IMPORTARDATOSDINAMICOS(\" BAS152\"|TABLAS!$A$130)","=+IMPORTARDATOSDINAMICOS(\" BAS153\"|TABLAS!$A$130)","=+IMPORTARDATOSDINAMICOS(\" BAS154\"|TABLAS!$A$130)","=+IMPORTARDATOSDINAMICOS(\" BAS155\"|TABLAS!$A$130)","=+IMPORTARDATOSDINAMICOS(\" BAS156\"|TABLAS!$A$130)","=+IMPORTARDATOSDINAMICOS(\" BAS157\"|TABLAS!$A$130)","=+IMPORTARDATOSDINAMICOS(\" BAS158\"|TABLAS!$A$130)"]
["2 años",null,{"$f":"+GETPIVOTDATA(\" BAS159\",TABLAS!$A$130)","v":15},{"$f":"+GETPIVOTDATA(\" BAS160\",TABLAS!$A$130)","v":1},{"$f":"+GETPIVOTDATA(\" BAS161\",TABLAS!$A$130)","v":25},{"$f":"+GETPIVOTDATA(\" BAS162\",TABLAS!$A$130)","v":1},{"$f":"+GETPIVOTDATA(\" BAS163\",TABLAS!$A$130)","v":1},{"$f":"+GETPIVOTDATA(\" BAS164\",TABLAS!$A$130)","v":0},{"$f":"+GETPIVOTDATA(\" BAS165\",TABLAS!$A$130)","v":18},{"$f":"+GETPIVOTDATA(\" BAS166\",TABLAS!$A$130)","v":0},{"$f":"+GETPIVOTDATA(\" BAS167\",TABLAS!$A$130)","v":0},{"$f":"+GETPIVOTDATA(\" BAS168\",TABLAS!$A$130)","v":0},{"$f":"+GETPIVOTDATA(\" BAS169\",TABLAS!$A$130)","v":21},{"$f":"+GETPIVOTDATA(\" BAS170\",TABLAS!$A$130)","v":0},{"$f":"+GETPIVOTDATA(\" BAS171\",TABLAS!$A$130)","v":5},{"$f":"+GETPIVOTDATA(\" BAS172\",TABLAS!$A$130)","v":0},null,null,null,null,null,null,null,null,null,null,null,null,null,null,null,null,null,null,null,{"$f":"+AW110+1","v":159},{"$f":"+AJ111+1","v":160},161,162,163,164,165,166,167,168,169,170,171,172,null,null,null,null,null,null,null,null,null,null,null,null,null,null,null,null,null,null,null,"=+IMPORTARDATOSDINAMICOS(\" BAS159\"|TABLAS!$A$130)","=+IMPORTARDATOSDINAMICOS(\" BAS160\"|TABLAS!$A$130)","=+IMPORTARDATOSDINAMICOS(\" BAS161\"|TABLAS!$A$130)","=+IMPORTARDATOSDINAMICOS(\" BAS162\"|TABLAS!$A$130)","=+IMPORTARDATOSDINAMICOS(\" BAS163\"|TABLAS!$A$130)","=+IMPORTARDATOSDINAMICOS(\" BAS164\"|TABLAS!$A$130)","=+IMPORTARDATOSDINAMICOS(\" BAS165\"|TABLAS!$A$130)","=+IMPORTARDATOSDINAMICOS(\" BAS166\"|TABLAS!$A$130)","=+IMPORTARDATOSDINAMICOS(\" BAS167\"|TABLAS!$A$130)","=+IMPORTARDATOSDINAMICOS(\" BAS168\"|TABLAS!$A$130)","=+IMPORTARDATOSDINAMICOS(\" BAS169\"|TABLAS!$A$130)","=+IMPORTARDATOSDINAMICOS(\" BAS170\"|TABLAS!$A$130)","=+IMPORTARDATOSDINAMICOS(\" BAS171\"|TABLAS!$A$130)","=+IMPORTARDATOSDINAMICOS(\" BAS172\"|TABLAS!$A$130)"]
["3 años",null,{"$f":"+GETPIVOTDATA(\" BAS173\",TABLAS!$A$130)","v":15},{"$f":"+GETPIVOTDATA(\" BAS174\",TABLAS!$A$130)","v":0},{"$f":"+GETPIVOTDATA(\" BAS175\",TABLAS!$A$130)","v":26},{"$f":"+GETPIVOTDATA(\" BAS176\",TABLAS!$A$130)","v":1},{"$f":"+GETPIVOTDATA(\" BAS177\",TABLAS!$A$130)","v":1},{"$f":"+GETPIVOTDATA(\" BAS178\",TABLAS!$A$130)","v":0},{"$f":"+GETPIVOTDATA(\" BAS179\",TABLAS!$A$130)","v":17},{"$f":"+GETPIVOTDATA(\" BAS180\",TABLAS!$A$130)","v":0},{"$f":"+GETPIVOTDATA(\" BAS181\",TABLAS!$A$130)","v":0},{"$f":"+GETPIVOTDATA(\" BAS182\",TABLAS!$A$130)","v":0},{"$f":"+GETPIVOTDATA(\" BAS183\",TABLAS!$A$130)","v":17},{"$f":"+GETPIVOTDATA(\" BAS184\",TABLAS!$A$130)","v":0},{"$f":"+GETPIVOTDATA(\" BAS185\",TABLAS!$A$130)","v":5},{"$f":"+GETPIVOTDATA(\" BAS186\",TABLAS!$A$130)","v":0},null,null,null,null,null,null,null,null,null,null,null,null,null,null,null,null,null,null,null,{"$f":"+AW111+1","v":173},{"$f":"+AJ112+1","v":174},175,176,177,178,179,180,181,182,183,184,185,186,null,null,null,null,null,null,null,null,null,null,null,null,null,null,null,null,null,null,null,"=+IMPORTARDATOSDINAMICOS(\" BAS173\"|TABLAS!$A$130)","=+IMPORTARDATOSDINAMICOS(\" BAS174\"|TABLAS!$A$130)","=+IMPORTARDATOSDINAMICOS(\" BAS175\"|TABLAS!$A$130)","=+IMPORTARDATOSDINAMICOS(\" BAS176\"|TABLAS!$A$130)","=+IMPORTARDATOSDINAMICOS(\" BAS177\"|TABLAS!$A$130)","=+IMPORTARDATOSDINAMICOS(\" BAS178\"|TABLAS!$A$130)","=+IMPORTARDATOSDINAMICOS(\" BAS179\"|TABLAS!$A$130)","=+IMPORTARDATOSDINAMICOS(\" BAS180\"|TABLAS!$A$130)","=+IMPORTARDATOSDINAMICOS(\" BAS181\"|TABLAS!$A$130)","=+IMPORTARDATOSDINAMICOS(\" BAS182\"|TABLAS!$A$130)","=+IMPORTARDATOSDINAMICOS(\" BAS183\"|TABLAS!$A$130)","=+IMPORTARDATOSDINAMICOS(\" BAS184\"|TABLAS!$A$130)","=+IMPORTARDATOSDINAMICOS(\" BAS185\"|TABLAS!$A$130)","=+IMPORTARDATOSDINAMICOS(\" BAS186\"|TABLAS!$A$130)"]
["4 años",null,{"$f":"+GETPIVOTDATA(\" BAS187\",TABLAS!$A$130)","v":9},{"$f":"+GETPIVOTDATA(\" BAS188\",TABLAS!$A$130)","v":1},{"$f":"+GETPIVOTDATA(\" BAS189\",TABLAS!$A$130)","v":18},{"$f":"+GETPIVOTDATA(\" BAS190\",TABLAS!$A$130)","v":0},{"$f":"+GETPIVOTDATA(\" BAS191\",TABLAS!$A$130)","v":0},{"$f":"+GETPIVOTDATA(\" BAS192\",TABLAS!$A$130)","v":0},{"$f":"+GETPIVOTDATA(\" BAS193\",TABLAS!$A$130)","v":18},{"$f":"+GETPIVOTDATA(\" BAS194\",TABLAS!$A$130)","v":0},{"$f":"+GETPIVOTDATA(\" BAS195\",TABLAS!$A$130)","v":0},{"$f":"+GETPIVOTDATA(\" BAS196\",TABLAS!$A$130)","v":0},{"$f":"+GETPIVOTDATA(\" BAS197\",TABLAS!$A$130)","v":16},{"$f":"+GETPIVOTDATA(\" BAS198\",TABLAS!$A$130)","v":0},{"$f":"+GETPIVOTDATA(\" BAS199\",TABLAS!$A$130)","v":4},{"$f":"+GETPIVOTDATA(\" BAS200\",TABLAS!$A$130)","v":0},null,null,null,null,null,null,null,null,null,null,null,null,null,null,null,null,null,null,null,{"$f":"+AW112+1","v":187},{"$f":"+AJ113+1","v":188},189,190,191,192,193,194,195,196,197,198,199,200,null,null,null,null,null,null,null,null,null,null,null,null,null,null,null,null,null,null,null,"=+IMPORTARDATOSDINAMICOS(\" BAS187\"|TABLAS!$A$130)","=+IMPORTARDATOSDINAMICOS(\" BAS188\"|TABLAS!$A$130)","=+IMPORTARDATOSDINAMICOS(\" BAS189\"|TABLAS!$A$130)","=+IMPORTARDATOSDINAMICOS(\" BAS190\"|TABLAS!$A$130)","=+IMPORTARDATOSDINAMICOS(\" BAS191\"|TABLAS!$A$130)","=+IMPORTARDATOSDINAMICOS(\" BAS192\"|TABLAS!$A$130)","=+IMPORTARDATOSDINAMICOS(\" BAS193\"|TABLAS!$A$130)","=+IMPORTARDATOSDINAMICOS(\" BAS194\"|TABLAS!$A$130)","=+IMPORTARDATOSDINAMICOS(\" BAS195\"|TABLAS!$A$130)","=+IMPORTARDATOSDINAMICOS(\" BAS196\"|TABLAS!$A$130)","=+IMPORTARDATOSDINAMICOS(\" BAS197\"|TABLAS!$A$130)","=+IMPORTARDATOSDINAMICOS(\" BAS198\"|TABLAS!$A$130)","=+IMPORTARDATOSDINAMICOS(\" BAS199\"|TABLAS!$A$130)","=+IMPORTARDATOSDINAMICOS(\" BAS200\"|TABLAS!$A$130)"]
[null,null,1,{"$f":"+C114+1","v":2},3,4,5,6,7,8,9,10,11,12,13,14,null,null,null,null,null,null,null,null,null,null,null,null,null,null,null,null,null,null,null,1,{"$f":"+AJ114+1","v":2},3,4,5,6,7,8,9,10,11,12,13,14]
[]
["VI. PARASITOSIS"]
["Ervaluacion por IMC  de  5 a 11 años ",null,"Dx ","Recup "]
["Deldadez",null,{"$error":"#REF!"}]
["Normal ",null,{"$error":"#REF!"}]
["Sobrepeso",null,{"$error":"#REF!"},{"$error":"#REF!"}]
["Obeso ",null,{"$error":"#REF!"},{"$error":"#REF!"}]
[]
[]
["EXAMENES DE  LABORATORIO / TAMIZAJES  "]
["ACTIVIDAD",null,null,"1 año ",null,null,"2 años ",null,null,"3 años ",null,null,"4 años ",null,null,"5 a 11 años ",null,null,null,null,null,null,null,null,null,null,null,null,null,null,null,null,null,null,null,null,null,null,null,null,null,null,null,null,null,null,null,null,null,null,null,null,null,null,null,null,null,null,null,null,null,null,null,null,null,null,null,null,null,{"$f":"+GETPIVOTDATA(\" BAS001\",TABLAS!$A$168)","v":279}]
[null,null,null,"Prog","Mensual","%","Prog","Mensual","%","Prog","Mensual","%","Prog","Mensual","%","Prog","Mensual","%",null,null,null,null,null,null,null,null,null,null,null,null,null,null,null,null,null,null,null,null,null,null,null,null,null,null,null,null,null,null,null,null,null,null,null,null,null,null,null,null,null,null,null,null,null,null,null,null,null,null,null,"\"|TABLAS!$A$168)"]
["Total de tamizaje de  anemia\n (Dosaje de Hemoglobina) Z001.7",null,null,null,{"$error":"#REF!"},null,null,null,{"$error":"#REF!"},null,null,{"$error":"#REF!"},null,null,{"$error":"#REF!"}]
["Nro Total de Test de  Graham 87172",null,null,null,{"$f":"+GETPIVOTDATA(\" BAS001\",TABLAS!$A$168)","v":279},null,null,{"$f":"+GETPIVOTDATA(\" BAS002\",TABLAS!$A$168)","v":336},null,null,{"$f":"+GETPIVOTDATA(\" BAS003\",TABLAS!$A$168)","v":296},null,null,{"$f":"+GETPIVOTDATA(\" BAS004\",TABLAS!$A$168)","v":256},null,null,{"$f":"+GETPIVOTDATA(\" BAS005\",TABLAS!$A$168)","v":223},null,null,null,null,null,null,null,null,null,null,null,null,null,null,null,null,null,null,null,1,null,null,{"$f":"+AK128+1","v":2},null,null,{"$f":"+AN128+1","v":3},null,null,{"$f":"+AQ128+1","v":4},null,null,{"$f":"+AT128+1","v":5},null,null,null,null,null,null,null,null,null,null,null,null,null,null,null,null,null,null,null,null,{"$f":"IF(AK128<10,CONCATENATE($BR$14,\"00\",AK128,$BR$126),IF(AND(AK128>9,AK128<100),CONCATENATE($BR$14,\"0\",AK128,$BR$126),IF(AK128>99,CONCATENATE($BR$14,AK128,$BR$126))))","v":"=+IMPORTARDATOSDINAMICOS(\" BAS001\"|TABLAS!$A$168)"},null,null,{"$f":"IF(AN128<10,CONCATENATE($BR$14,\"00\",AN128,$BR$126),IF(AND(AN128>9,AN128<100),CONCATENATE($BR$14,\"0\",AN128,$BR$126),IF(AN128>99,CONCATENATE($BR$14,AN128,$BR$126))))","v":"=+IMPORTARDATOSDINAMICOS(\" BAS002\"|TABLAS!$A$168)"},null,null,{"$f":"IF(AQ128<10,CONCATENATE($BR$14,\"00\",AQ128,$BR$126),IF(AND(AQ128>9,AQ128<100),CONCATENATE($BR$14,\"0\",AQ128,$BR$126),IF(AQ128>99,CONCATENATE($BR$14,AQ128,$BR$126))))","v":"=+IMPORTARDATOSDINAMICOS(\" BAS003\"|TABLAS!$A$168)"},null,null,{"$f":"IF(AT128<10,CONCATENATE($BR$14,\"00\",AT128,$BR$126),IF(AND(AT128>9,AT128<100),CONCATENATE($BR$14,\"0\",AT128,$BR$126),IF(AT128>99,CONCATENATE($BR$14,AT128,$BR$126))))","v":"=+IMPORTARDATOSDINAMICOS(\" BAS004\"|TABLAS!$A$168)"},null,null,{"$f":"IF(AW128<10,CONCATENATE($BR$14,\"00\",AW128,$BR$126),IF(AND(AW128>9,AW128<100),CONCATENATE($BR$14,\"0\",AW128,$BR$126),IF(AW128>99,CONCATENATE($BR$14,AW128,$BR$126))))","v":"=+IMPORTARDATOSDINAMICOS(\" BAS005\"|TABLAS!$A$168)"}]
["Nro de Test de Graham Positivos  ",null,null,null,{"$f":"+GETPIVOTDATA(\" BAS006\",TABLAS!$A$168)","v":52},null,null,{"$f":"+GETPIVOTDATA(\" BAS007\",TABLAS!$A$168)","v":35},null,null,{"$f":"+GETPIVOTDATA(\" BAS008\",TABLAS!$A$168)","v":50},null,null,{"$f":"+GETPIVOTDATA(\" BAS009\",TABLAS!$A$168)","v":54},null,null,{"$f":"+GETPIVOTDATA(\" BAS010\",TABLAS!$A$168)","v":321},null,null,null,null,null,null,null,null,null,null,null,null,null,null,null,null,null,null,null,{"$f":"+AW128+1","v":6},null,null,{"$f":"+AK129+1","v":7},null,null,{"$f":"+AN129+1","v":8},null,null,{"$f":"+AQ129+1","v":9},null,null,{"$f":"+AT129+1","v":10},null,null,null,null,null,null,null,null,null,null,null,null,null,null,null,null,null,null,null,null,{"$f":"IF(AK129<10,CONCATENATE($BR$14,\"00\",AK129,$BR$126),IF(AND(AK129>9,AK129<100),CONCATENATE($BR$14,\"0\",AK129,$BR$126),IF(AK129>99,CONCATENATE($BR$14,AK129,$BR$126))))","v":"=+IMPORTARDATOSDINAMICOS(\" BAS006\"|TABLAS!$A$168)"},null,null,{"$f":"IF(AN129<10,CONCATENATE($BR$14,\"00\",AN129,$BR$126),IF(AND(AN129>9,AN129<100),CONCATENATE($BR$14,\"0\",AN129,$BR$126),IF(AN129>99,CONCATENATE($BR$14,AN129,$BR$126))))","v":"=+IMPORTARDATOSDINAMICOS(\" BAS007\"|TABLAS!$A$168)"},null,null,{"$f":"IF(AQ129<10,CONCATENATE($BR$14,\"00\",AQ129,$BR$126),IF(AND(AQ129>9,AQ129<100),CONCATENATE($BR$14,\"0\",AQ129,$BR$126),IF(AQ129>99,CONCATENATE($BR$14,AQ129,$BR$126))))","v":"=+IMPORTARDATOSDINAMICOS(\" BAS008\"|TABLAS!$A$168)"},null,null,{"$f":"IF(AT129<10,CONCATENATE($BR$14,\"00\",AT129,$BR$126),IF(AND(AT129>9,AT129<100),CONCATENATE($BR$14,\"0\",AT129,$BR$126),IF(AT129>99,CONCATENATE($BR$14,AT129,$BR$126))))","v":"=+IMPORTARDATOSDINAMICOS(\" BAS009\"|TABLAS!$A$168)"},null,null,{"$f":"IF(AW129<10,CONCATENATE($BR$14,\"00\",AW129,$BR$126),IF(AND(AW129>9,AW129<100),CONCATENATE($BR$14,\"0\",AW129,$BR$126),IF(AW129>99,CONCATENATE($BR$14,AW129,$BR$126))))","v":"=+IMPORTARDATOSDINAMICOS(\" BAS010\"|TABLAS!$A$168)"}]
["Nro Total de Examen Seriado de  Heces  87177.01",null,null,null,{"$f":"+GETPIVOTDATA(\" BAS011\",TABLAS!$A$168)","v":307},null,null,{"$f":"+GETPIVOTDATA(\" BAS012\",TABLAS!$A$168)","v":366},null,null,{"$f":"+GETPIVOTDATA(\" BAS013\",TABLAS!$A$168)","v":317},null,null,{"$f":"+GETPIVOTDATA(\" BAS014\",TABLAS!$A$168)","v":273},null,null,{"$f":"+GETPIVOTDATA(\" BAS015\",TABLAS!$A$168)","v":246},null,null,null,null,null,null,null,null,null,null,null,null,null,null,null,null,null,null,null,{"$f":"+AW129+1","v":11},null,null,{"$f":"+AK130+1","v":12},null,null,{"$f":"+AN130+1","v":13},null,null,{"$f":"+AQ130+1","v":14},null,null,{"$f":"+AT130+1","v":15},null,null,null,null,null,null,null,null,null,null,null,null,null,null,null,null,null,null,null,null,{"$f":"IF(AK130<10,CONCATENATE($BR$14,\"00\",AK130,$BR$126),IF(AND(AK130>9,AK130<100),CONCATENATE($BR$14,\"0\",AK130,$BR$126),IF(AK130>99,CONCATENATE($BR$14,AK130,$BR$126))))","v":"=+IMPORTARDATOSDINAMICOS(\" BAS011\"|TABLAS!$A$168)"},null,null,{"$f":"IF(AN130<10,CONCATENATE($BR$14,\"00\",AN130,$BR$126),IF(AND(AN130>9,AN130<100),CONCATENATE($BR$14,\"0\",AN130,$BR$126),IF(AN130>99,CONCATENATE($BR$14,AN130,$BR$126))))","v":"=+IMPORTARDATOSDINAMICOS(\" BAS012\"|TABLAS!$A$168)"},null,null,{"$f":"IF(AQ130<10,CONCATENATE($BR$14,\"00\",AQ130,$BR$126),IF(AND(AQ130>9,AQ130<100),CONCATENATE($BR$14,\"0\",AQ130,$BR$126),IF(AQ130>99,CONCATENATE($BR$14,AQ130,$BR$126))))","v":"=+IMPORTARDATOSDINAMICOS(\" BAS013\"|TABLAS!$A$168)"},null,null,{"$f":"IF(AT130<10,CONCATENATE($BR$14,\"00\",AT130,$BR$126),IF(AND(AT130>9,AT130<100),CONCATENATE($BR$14,\"0\",AT130,$BR$126),IF(AT130>99,CONCATENATE($BR$14,AT130,$BR$126))))","v":"=+IMPORTARDATOSDINAMICOS(\" BAS014\"|TABLAS!$A$168)"},null,null,{"$f":"IF(AW130<10,CONCATENATE($BR$14,\"00\",AW130,$BR$126),IF(AND(AW130>9,AW130<100),CONCATENATE($BR$14,\"0\",AW130,$BR$126),IF(AW130>99,CONCATENATE($BR$14,AW130,$BR$126))))","v":"=+IMPORTARDATOSDINAMICOS(\" BAS015\"|TABLAS!$A$168)"}]
["Nro de Examen  Seriado de Heces  Positivos ",null,null,null,{"$f":"+GETPIVOTDATA(\" BAS016\",TABLAS!$A$168)","v":71},null,null,{"$f":"+GETPIVOTDATA(\" BAS017\",TABLAS!$A$168)","v":63},null,null,{"$f":"+GETPIVOTDATA(\" BAS018\",TABLAS!$A$168)","v":70},null,null,{"$f":"+GETPIVOTDATA(\" BAS019\",TABLAS!$A$168)","v":80},null,null,{"$f":"+GETPIVOTDATA(\" BAS020\",TABLAS!$A$168)","v":407},null,null,null,null,null,null,null,null,null,null,null,null,null,null,null,null,null,null,null,{"$f":"+AW130+1","v":16},null,null,{"$f":"+AK131+1","v":17},null,null,{"$f":"+AN131+1","v":18},null,null,{"$f":"+AQ131+1","v":19},null,null,{"$f":"+AT131+1","v":20},null,null,null,null,null,null,null,null,null,null,null,null,null,null,null,null,null,null,null,null,{"$f":"IF(AK131<10,CONCATENATE($BR$14,\"00\",AK131,$BR$126),IF(AND(AK131>9,AK131<100),CONCATENATE($BR$14,\"0\",AK131,$BR$126),IF(AK131>99,CONCATENATE($BR$14,AK131,$BR$126))))","v":"=+IMPORTARDATOSDINAMICOS(\" BAS016\"|TABLAS!$A$168)"},null,null,{"$f":"IF(AN131<10,CONCATENATE($BR$14,\"00\",AN131,$BR$126),IF(AND(AN131>9,AN131<100),CONCATENATE($BR$14,\"0\",AN131,$BR$126),IF(AN131>99,CONCATENATE($BR$14,AN131,$BR$126))))","v":"=+IMPORTARDATOSDINAMICOS(\" BAS017\"|TABLAS!$A$168)"},null,null,{"$f":"IF(AQ131<10,CONCATENATE($BR$14,\"00\",AQ131,$BR$126),IF(AND(AQ131>9,AQ131<100),CONCATENATE($BR$14,\"0\",AQ131,$BR$126),IF(AQ131>99,CONCATENATE($BR$14,AQ131,$BR$126))))","v":"=+IMPORTARDATOSDINAMICOS(\" BAS018\"|TABLAS!$A$168)"},null,null,{"$f":"IF(AT131<10,CONCATENATE($BR$14,\"00\",AT131,$BR$126),IF(AND(AT131>9,AT131<100),CONCATENATE($BR$14,\"0\",AT131,$BR$126),IF(AT131>99,CONCATENATE($BR$14,AT131,$BR$126))))","v":"=+IMPORTARDATOSDINAMICOS(\" BAS019\"|TABLAS!$A$168)"},null,null,{"$f":"IF(AW131<10,CONCATENATE($BR$14,\"00\",AW131,$BR$126),IF(AND(AW131>9,AW131<100),CONCATENATE($BR$14,\"0\",AW131,$BR$126),IF(AW131>99,CONCATENATE($BR$14,AW131,$BR$126))))","v":"=+IMPORTARDATOSDINAMICOS(\" BAS020\"|TABLAS!$A$168)"}]
["PARASITOSIS TEST  GRAHAN  O  EXAMEN HECES TRATADOS",null,null,null,{"$f":"+GETPIVOTDATA(\" BAS021\",TABLAS!$A$168)","v":2},null,null,{"$f":"+GETPIVOTDATA(\" BAS022\",TABLAS!$A$168)","v":501},null,null,{"$f":"+GETPIVOTDATA(\" BAS023\",TABLAS!$A$168)","v":443},null,null,{"$f":"+GETPIVOTDATA(\" BAS024\",TABLAS!$A$168)","v":370},null,null,{"$f":"+GETPIVOTDATA(\" BAS025\",TABLAS!$A$168)","v":66},null,null,null,null,null,null,null,null,null,null,null,null,null,null,null,null,null,null,null,{"$f":"+AW131+1","v":21},null,null,{"$f":"+AK132+1","v":22},null,null,{"$f":"+AN132+1","v":23},null,null,{"$f":"+AQ132+1","v":24},null,null,{"$f":"+AT132+1","v":25},null,null,null,null,null,null,null,null,null,null,null,null,null,null,null,null,null,null,null,null,{"$f":"IF(AK132<10,CONCATENATE($BR$14,\"00\",AK132,$BR$126),IF(AND(AK132>9,AK132<100),CONCATENATE($BR$14,\"0\",AK132,$BR$126),IF(AK132>99,CONCATENATE($BR$14,AK132,$BR$126))))","v":"=+IMPORTARDATOSDINAMICOS(\" BAS021\"|TABLAS!$A$168)"},null,null,{"$f":"IF(AN132<10,CONCATENATE($BR$14,\"00\",AN132,$BR$126),IF(AND(AN132>9,AN132<100),CONCATENATE($BR$14,\"0\",AN132,$BR$126),IF(AN132>99,CONCATENATE($BR$14,AN132,$BR$126))))","v":"=+IMPORTARDATOSDINAMICOS(\" BAS022\"|TABLAS!$A$168)"},null,null,{"$f":"IF(AQ132<10,CONCATENATE($BR$14,\"00\",AQ132,$BR$126),IF(AND(AQ132>9,AQ132<100),CONCATENATE($BR$14,\"0\",AQ132,$BR$126),IF(AQ132>99,CONCATENATE($BR$14,AQ132,$BR$126))))","v":"=+IMPORTARDATOSDINAMICOS(\" BAS023\"|TABLAS!$A$168)"},null,null,{"$f":"IF(AT132<10,CONCATENATE($BR$14,\"00\",AT132,$BR$126),IF(AND(AT132>9,AT132<100),CONCATENATE($BR$14,\"0\",AT132,$BR$126),IF(AT132>99,CONCATENATE($BR$14,AT132,$BR$126))))","v":"=+IMPORTARDATOSDINAMICOS(\" BAS024\"|TABLAS!$A$168)"},null,null,{"$f":"IF(AW132<10,CONCATENATE($BR$14,\"00\",AW132,$BR$126),IF(AND(AW132>9,AW132<100),CONCATENATE($BR$14,\"0\",AW132,$BR$126),IF(AW132>99,CONCATENATE($BR$14,AW132,$BR$126))))","v":"=+IMPORTARDATOSDINAMICOS(\" BAS025\"|TABLAS!$A$168)"}]
[]
["VII. ADMINISTRACIÓN DE PROFILAXIS ANTIPARASITARIA"]
[]
["ACTIVIDADES",null,"01 año",null,"02 años",null,"03 años",null,"04 años",null,"05 - 11 años"]
[null,null,"1º","2º","1º","2º","1º","2º","1º","2º","1º","2º",null,null,null,null,null,null,null,null,null,null,null,null,null,null,null,null,null,null,null,null,null,null,null,null,null,null,null,null,null,null,null,null,null,null,null,null,null,null,null,null,null,null,null,null,null,null,null,null,null,null,null,null,null,null,null,null,"d",null,null,null,null,null,null,null,null,"d"]
["Administración de Profilaxis Antiparasitaria",null,{"$f":"+GETPIVOTDATA(\" BAS026\",TABLAS!$A$168)","v":5},{"$f":"+GETPIVOTDATA(\" BAS027\",TABLAS!$A$168)","v":2},{"$f":"+GETPIVOTDATA(\" BAS028\",TABLAS!$A$168)","v":627},{"$f":"+GETPIVOTDATA(\" BAS029\",TABLAS!$A$168)","v":501},{"$f":"+GETPIVOTDATA(\" BAS030\",TABLAS!$A$168)","v":677},{"$f":"+GETPIVOTDATA(\" BAS031\",TABLAS!$A$168)","v":443},{"$f":"+GETPIVOTDATA(\" BAS032\",TABLAS!$A$168)","v":750},{"$f":"+GETPIVOTDATA(\" BAS033\",TABLAS!$A$168)","v":370},{"$f":"+GETPIVOTDATA(\" BAS034\",TABLAS!$A$168)","v":4219},{"$f":"+GETPIVOTDATA(\" BAS035\",TABLAS!$A$168)","v":66},null,null,null,null,null,null,null,null,null,null,null,null,null,null,null,null,null,null,null,null,null,null,null,{"$f":"+AW132+1","v":26},{"$f":"+AJ138+1","v":27},28,29,30,31,32,33,34,35,null,null,null,null,null,null,null,null,null,null,null,null,null,null,null,null,null,null,null,null,null,null,null,{"$f":"IF(AJ138<10,CONCATENATE($BR$14,\"00\",AJ138,$BR$126),IF(AND(AJ138>9,AJ138<100),CONCATENATE($BR$14,\"0\",AJ138,$BR$126),IF(AJ138>99,CONCATENATE($BR$14,AJ138,$BR$126))))","v":"=+IMPORTARDATOSDINAMICOS(\" BAS026\"|TABLAS!$A$168)"},"=+IMPORTARDATOSDINAMICOS(\" BAS027\"|TABLAS!$A$168)","=+IMPORTARDATOSDINAMICOS(\" BAS028\"|TABLAS!$A$168)","=+IMPORTARDATOSDINAMICOS(\" BAS029\"|TABLAS!$A$168)","=+IMPORTARDATOSDINAMICOS(\" BAS030\"|TABLAS!$A$168)","=+IMPORTARDATOSDINAMICOS(\" BAS031\"|TABLAS!$A$168)","=+IMPORTARDATOSDINAMICOS(\" BAS032\"|TABLAS!$A$168)","=+IMPORTARDATOSDINAMICOS(\" BAS033\"|TABLAS!$A$168)","=+IMPORTARDATOSDINAMICOS(\" BAS034\"|TABLAS!$A$168)","=+IMPORTARDATOSDINAMICOS(\" BAS035\"|TABLAS!$A$168)"]
[null,null,1,{"$f":"+C139+1","v":2},3,4,5,6,7,8,9,10,null,null,null,null,null,null,null,null,null,null,null,null,null,null,null,null,null,null,null,null,null,null,null,1,{"$f":"+AJ139+1","v":2},3,4,5,6,7,8,9,10]
[]
[]
["2.1- Total de Evaluación del desarrollo psicosocial con test de habilidades ",null,null,null,"2.2.- Total  de Evaluación de Agudeza visual",null,null,null,null,null,"2.5.- Total  de Evaluacion Fisico Postural"]
[" Muy Bajo",null,null,null,"Normal",null,null,null,null,null,"Normal"]
[" Bajo",null,null,null,"Disminución de Agudeza visual",null,null,null,null,null,"Hiperlordosis"]
[" Promedio Bajo",null,null,null,"2.3.- Total de Evaluación agudeza auditiva",null,null,null,null,null,"Hipersifosis"]
[" Promedio",null,null,null,"Normal",null,null,null,null,null,"Escoliosis"]
[" Promedio Alto",null,null,null,"Disminución de agudeza auditiva"]
[" Alto",null,null,null,"2.4 .- Total de Evaluacion del Desarrollo sexual según Tanner"]
[" Muy Alto",null,null,null,"Adecuado "]
[null,null,null,null,"Retardo "]
[null,null,null,null,"Precoz"]
[]
[]
["VII. VISITAS  DOMICILIARIA DE SEGUIMIENTO  "]
[]
["VISITA FAMILIAR \nINTEGRAL ",null,null,"Prog","MENS ","ACUM  ","%"]
["Nº de visitas domiciliarias  a  RN",null,null,null,{"$f":"+GETPIVOTDATA(\" BAS036\",TABLAS!$A$168)","v":626},null,null,null,null,null,null,null,null,null,null,null,null,null,null,null,null,null,null,null,null,null,null,null,null,null,null,null,null,null,null,null,null,{"$f":"+AS138+1","v":36},null,null,null,null,null,null,null,null,null,null,null,null,null,null,null,null,null,null,null,null,null,null,null,null,null,null,null,null,null,null,null,null,{"$f":"IF(AL157<10,CONCATENATE($BR$14,\"00\",AL157,$BR$126),IF(AND(AL157>9,AL157<100),CONCATENATE($BR$14,\"0\",AL157,$BR$126),IF(AL157>99,CONCATENATE($BR$14,AL157,$BR$126))))","v":"=+IMPORTARDATOSDINAMICOS(\" BAS036\"|TABLAS!$A$168)"}]
["Nº de visitas domiciliarias  a niños < 1 año",null,null,null,{"$f":"+GETPIVOTDATA(\" BAS037\",TABLAS!$A$168)","v":2196},null,null,null,null,null,null,null,null,null,null,null,null,null,null,null,null,null,null,null,null,null,null,null,null,null,null,null,null,null,null,null,null,{"$f":"+AL157+1","v":37},null,null,null,null,null,null,null,null,null,null,null,null,null,null,null,null,null,null,null,null,null,null,null,null,null,null,null,null,null,null,null,null,"=+IMPORTARDATOSDINAMICOS(\" BAS037\"|TABLAS!$A$168)"]
["Nº de visitas domiciliarias  a niños 1 año ",null,null,null,{"$f":"+GETPIVOTDATA(\" BAS038\",TABLAS!$A$168)","v":1318},null,null,null,null,null,null,null,null,null,null,null,null,null,null,null,null,null,null,null,null,null,null,null,null,null,null,null,null,null,null,null,null,38,null,null,null,null,null,null,null,null,null,null,null,null,null,null,null,null,null,null,null,null,null,null,null,null,null,null,null,null,null,null,null,null,"=+IMPORTARDATOSDINAMICOS(\" BAS038\"|TABLAS!$A$168)"]
["Nº de visitas domiciliarias  a niños 2 años ",null,null,null,{"$f":"+GETPIVOTDATA(\" BAS039\",TABLAS!$A$168)","v":794},null,null,null,null,null,null,null,null,null,null,null,null,null,null,null,null,null,null,null,null,null,null,null,null,null,null,null,null,null,null,null,null,39,null,null,null,null,null,null,null,null,null,null,null,null,null,null,null,null,null,null,null,null,null,null,null,null,null,null,null,null,null,null,null,null,"=+IMPORTARDATOSDINAMICOS(\" BAS039\"|TABLAS!$A$168)"]
["Nº de visitas domiciliarias  a niños 3 años ",null,null,null,{"$f":"+GETPIVOTDATA(\" BAS040\",TABLAS!$A$168)","v":619},null,null,null,null,null,null,null,null,null,null,null,null,null,null,null,null,null,null,null,null,null,null,null,null,null,null,null,null,null,null,null,null,40,null,null,null,null,null,null,null,null,null,null,null,null,null,null,null,null,null,null,null,null,null,null,null,null,null,null,null,null,null,null,null,null,"=+IMPORTARDATOSDINAMICOS(\" BAS040\"|TABLAS!$A$168)"]
["Nº de visitas domiciliarias  a niños 4 años ",null,null,null,{"$f":"+GETPIVOTDATA(\" BAS041\",TABLAS!$A$168)","v":520},null,null,null,null,null,null,null,null,null,null,null,null,null,null,null,null,null,null,null,null,null,null,null,null,null,null,null,null,null,null,null,null,41,null,null,null,null,null,null,null,null,null,null,null,null,null,null,null,null,null,null,null,null,null,null,null,null,null,null,null,null,null,null,null,null,"=+IMPORTARDATOSDINAMICOS(\" BAS041\"|TABLAS!$A$168)"]
["Nº de visitas domiciliarias  a niños 5 a 11 años ",null,null,null,{"$f":"+GETPIVOTDATA(\" BAS042\",TABLAS!$A$168)","v":791},null,null,null,null,null,null,null,null,null,null,null,null,null,null,null,null,null,null,null,null,null,null,null,null,null,null,null,null,null,null,null,null,42,null,null,null,null,null,null,null,null,null,null,null,null,null,null,null,null,null,null,null,null,null,null,null,null,null,null,null,null,null,null,null,null,"=+IMPORTARDATOSDINAMICOS(\" BAS042\"|TABLAS!$A$168)"]
["Sesiones  Demostrativas ",null,null,null,{"$f":"+GETPIVOTDATA(\" BAS043\",TABLAS!$A$168)","v":912},null,null,null,null,null,null,null,null,null,null,null,null,null,null,null,null,null,null,null,null,null,null,null,null,null,null,null,null,null,null,null,null,43,null,null,null,null,null,null,null,null,null,null,null,null,null,null,null,null,null,null,null,null,null,null,null,null,null,null,null,null,null,null,null,null,"=+IMPORTARDATOSDINAMICOS(\" BAS043\"|TABLAS!$A$168)"]
["Sesiones Educativas ",null,null,null,{"$f":"+GETPIVOTDATA(\" BAS044\",TABLAS!$A$168)","v":274},null,null,null,null,null,null,null,null,null,null,null,null,null,null,null,null,null,null,null,null,null,null,null,null,null,null,null,null,null,null,null,null,44,null,null,null,null,null,null,null,null,null,null,null,null,null,null,null,null,null,null,null,null,null,null,null,null,null,null,null,null,null,null,null,null,"=+IMPORTARDATOSDINAMICOS(\" BAS044\"|TABLAS!$A$168)"]
[null,null,null,1,2,null,null,null,null,null,null,null,null,null,null,null,null,null,null,null,null,null,null,null,null,null,null,null,null,null,null,null,null,null,null,null,1]
["IX. VISITA DOMICILIARIA"]
["TIPOS DE VISITA / EDADES",null,null,"Total","RN","<1 año","01 año","02 años","03 años","04 años","05 - 11 a",null,null,null,null,null,null,null,null,null,null,null,null,null,null,null,null,null,null,null,null,null,null,null,null,null,null,null,null,null,null,null,null,null,null,null,null,null,null,null,null,null,null,null,null,null,null,null,null,null,null,null,null,null,null,null,null,null,null,"d",null,null,null,null,null,"f"]
["Seguimiento al Control CRED",null,null,{"$f":"SUM(E169:K169)","v":6396},{"$f":"+GETPIVOTDATA(\" BAS045\",TABLAS!$A$168)","v":158},{"$f":"+GETPIVOTDATA(\" BAS046\",TABLAS!$A$168)","v":2196},{"$f":"+GETPIVOTDATA(\" BAS047\",TABLAS!$A$168)","v":1318},{"$f":"+GETPIVOTDATA(\" BAS048\",TABLAS!$A$168)","v":794},{"$f":"+GETPIVOTDATA(\" BAS049\",TABLAS!$A$168)","v":619},{"$f":"+GETPIVOTDATA(\" BAS050\",TABLAS!$A$168)","v":520},{"$f":"+GETPIVOTDATA(\" BAS051\",TABLAS!$A$168)","v":791},null,null,null,null,null,null,null,null,null,null,null,null,null,null,null,null,null,null,null,null,null,null,null,null,null,{"$f":"+AL165+1","v":45},{"$f":"+AK169+1","v":46},47,48,49,50,51,null,null,null,null,null,null,null,null,null,null,null,null,null,null,null,null,null,null,null,null,null,null,null,null,null,null,{"$f":"IF(AK169<10,CONCATENATE($BR$14,\"00\",AK169,$BR$126),IF(AND(AK169>9,AK169<100),CONCATENATE($BR$14,\"0\",AK169,$BR$126),IF(AK169>99,CONCATENATE($BR$14,AK169,$BR$126))))","v":"=+IMPORTARDATOSDINAMICOS(\" BAS045\"|TABLAS!$A$168)"},"=+IMPORTARDATOSDINAMICOS(\" BAS046\"|TABLAS!$A$168)","=+IMPORTARDATOSDINAMICOS(\" BAS047\"|TABLAS!$A$168)","=+IMPORTARDATOSDINAMICOS(\" BAS048\"|TABLAS!$A$168)","=+IMPORTARDATOSDINAMICOS(\" BAS049\"|TABLAS!$A$168)","=+IMPORTARDATOSDINAMICOS(\" BAS050\"|TABLAS!$A$168)","=+IMPORTARDATOSDINAMICOS(\" BAS051\"|TABLAS!$A$168)"]
["Seguimiento a Problemas Nutricionales",null,null,{"$f":"SUM(E170:K170)","v":9319},{"$f":"+GETPIVOTDATA(\" BAS052\",TABLAS!$A$168)","v":3081},{"$f":"+GETPIVOTDATA(\" BAS053\",TABLAS!$A$168)","v":2196},{"$f":"+GETPIVOTDATA(\" BAS054\",TABLAS!$A$168)","v":1318},{"$f":"+GETPIVOTDATA(\" BAS055\",TABLAS!$A$168)","v":794},{"$f":"+GETPIVOTDATA(\" BAS056\",TABLAS!$A$168)","v":619},{"$f":"+GETPIVOTDATA(\" BAS057\",TABLAS!$A$168)","v":520},{"$f":"+GETPIVOTDATA(\" BAS058\",TABLAS!$A$168)","v":791},null,null,null,null,null,null,null,null,null,null,null,null,null,null,null,null,null,null,null,null,null,null,null,null,null,{"$f":"+AQ169+1","v":52},53,54,55,56,57,58,null,null,null,null,null,null,null,null,null,null,null,null,null,null,null,null,null,null,null,null,null,null,null,null,null,null,"=+IMPORTARDATOSDINAMICOS(\" BAS052\"|TABLAS!$A$168)","=+IMPORTARDATOSDINAMICOS(\" BAS053\"|TABLAS!$A$168)","=+IMPORTARDATOSDINAMICOS(\" BAS054\"|TABLAS!$A$168)","=+IMPORTARDATOSDINAMICOS(\" BAS055\"|TABLAS!$A$168)","=+IMPORTARDATOSDINAMICOS(\" BAS056\"|TABLAS!$A$168)","=+IMPORTARDATOSDINAMICOS(\" BAS057\"|TABLAS!$A$168)","=+IMPORTARDATOSDINAMICOS(\" BAS058\"|TABLAS!$A$168)"]
["Seguimiento a Problemas del Desarrollo",null,null,7419,{"$f":"+GETPIVOTDATA(\" BAS059\",TABLAS!$A$168)","v":865},{"$f":"+GETPIVOTDATA(\" BAS060\",TABLAS!$A$168)","v":2386},{"$f":"+GETPIVOTDATA(\" BAS061\",TABLAS!$A$168)","v":1321},{"$f":"+GETPIVOTDATA(\" BAS062\",TABLAS!$A$168)","v":795},{"$f":"+GETPIVOTDATA(\" BAS063\",TABLAS!$A$168)","v":623},{"$f":"+GETPIVOTDATA(\" BAS064\",TABLAS!$A$168)","v":556},{"$f":"+GETPIVOTDATA(\" BAS065\",TABLAS!$A$168)","v":873},null,null,null,null,null,null,null,null,null,null,null,null,null,null,null,null,null,null,null,null,null,null,null,null,null,{"$f":"+AQ170+1","v":59},60,61,62,63,64,65,null,null,null,null,null,null,null,null,null,null,null,null,null,null,null,null,null,null,null,null,null,null,null,null,null,null,"=+IMPORTARDATOSDINAMICOS(\" BAS059\"|TABLAS!$A$168)","=+IMPORTARDATOSDINAMICOS(\" BAS060\"|TABLAS!$A$168)","=+IMPORTARDATOSDINAMICOS(\" BAS061\"|TABLAS!$A$168)","=+IMPORTARDATOSDINAMICOS(\" BAS062\"|TABLAS!$A$168)","=+IMPORTARDATOSDINAMICOS(\" BAS063\"|TABLAS!$A$168)","=+IMPORTARDATOSDINAMICOS(\" BAS064\"|TABLAS!$A$168)","=+IMPORTARDATOSDINAMICOS(\" BAS065\"|TABLAS!$A$168)"]
["Entrega de Suplementación",null,null,25980,{"$f":"+GETPIVOTDATA(\" BAS066\",TABLAS!$A$168)","v":0},{"$f":"+GETPIVOTDATA(\" BAS067\",TABLAS!$A$168)","v":5437},{"$f":"+GETPIVOTDATA(\" BAS068\",TABLAS!$A$168)","v":5414},{"$f":"+GETPIVOTDATA(\" BAS069\",TABLAS!$A$168)","v":5414},{"$f":"+GETPIVOTDATA(\" BAS070\",TABLAS!$A$168)","v":5414},{"$f":"+GETPIVOTDATA(\" BAS071\",TABLAS!$A$168)","v":2299},{"$f":"+GETPIVOTDATA(\" BAS072\",TABLAS!$A$168)","v":2002},null,null,null,null,null,null,null,null,null,null,null,null,null,null,null,null,null,null,null,null,null,null,null,null,null,{"$f":"+AQ171+1","v":66},67,68,69,70,71,72,null,null,null,null,null,null,null,null,null,null,null,null,null,null,null,null,null,null,null,null,null,null,null,null,null,null,"=+IMPORTARDATOSDINAMICOS(\" BAS066\"|TABLAS!$A$168)","=+IMPORTARDATOSDINAMICOS(\" BAS067\"|TABLAS!$A$168)","=+IMPORTARDATOSDINAMICOS(\" BAS068\"|TABLAS!$A$168)","=+IMPORTARDATOSDINAMICOS(\" BAS069\"|TABLAS!$A$168)","=+IMPORTARDATOSDINAMICOS(\" BAS070\"|TABLAS!$A$168)","=+IMPORTARDATOSDINAMICOS(\" BAS071\"|TABLAS!$A$168)","=+IMPORTARDATOSDINAMICOS(\" BAS072\"|TABLAS!$A$168)"]
["Verificación de Consumo de Micronutrientes",null,null,6454,{"$f":"+GETPIVOTDATA(\" BAS073\",TABLAS!$A$168)","v":0},{"$f":"+GETPIVOTDATA(\" BAS074\",TABLAS!$A$168)","v":2210},{"$f":"+GETPIVOTDATA(\" BAS075\",TABLAS!$A$168)","v":1338},{"$f":"+GETPIVOTDATA(\" BAS076\",TABLAS!$A$168)","v":893},{"$f":"+GETPIVOTDATA(\" BAS077\",TABLAS!$A$168)","v":668},{"$f":"+GETPIVOTDATA(\" BAS078\",TABLAS!$A$168)","v":553},{"$f":"+GETPIVOTDATA(\" BAS079\",TABLAS!$A$168)","v":792},null,null,null,null,null,null,null,null,null,null,null,null,null,null,null,null,null,null,null,null,null,null,null,null,null,{"$f":"+AQ172+1","v":73},74,75,76,77,78,79,null,null,null,null,null,null,null,null,null,null,null,null,null,null,null,null,null,null,null,null,null,null,null,null,null,null,"=+IMPORTARDATOSDINAMICOS(\" BAS073\"|TABLAS!$A$168)","=+IMPORTARDATOSDINAMICOS(\" BAS074\"|TABLAS!$A$168)","=+IMPORTARDATOSDINAMICOS(\" BAS075\"|TABLAS!$A$168)","=+IMPORTARDATOSDINAMICOS(\" BAS076\"|TABLAS!$A$168)","=+IMPORTARDATOSDINAMICOS(\" BAS077\"|TABLAS!$A$168)","=+IMPORTARDATOSDINAMICOS(\" BAS078\"|TABLAS!$A$168)","=+IMPORTARDATOSDINAMICOS(\" BAS079\"|TABLAS!$A$168)"]
[null,null,null,1,{"$f":"+D174+1","v":2},3,4,5,6,7,null,null,null,null,null,null,null,null,null,null,null,null,null,null,null,null,null,null,null,null,null,null,null,null,null,1,2,3,4,5,6,7]